mesos-builds mailing list archives

Site index · List index
Message view « Date » · « Thread »
Top « Date » · « Thread »
From Apache Jenkins Server <jenk...@builds.apache.org>
Subject Build failed in Jenkins: Mesos-Buildbot » autotools,clang,--verbose --disable-libtool-wrappers,GLOG_v=1 MESOS_VERBOSE=1,ubuntu:14.04,(ubuntu)&&(!ubuntu-us1)&&(!ubuntu-eu2)&&(!qnode3)&&(!H23) #4416
Date Mon, 06 Nov 2017 06:28:15 GMT
See <https://builds.apache.org/job/Mesos-Buildbot/BUILDTOOL=autotools,COMPILER=clang,CONFIGURATION=--verbose%20--disable-libtool-wrappers,ENVIRONMENT=GLOG_v=1%20MESOS_VERBOSE=1,OS=ubuntu%3A14.04,label_exp=(ubuntu)&&(!ubuntu-us1)&&(!ubuntu-eu2)&&(!qnode3)&&(!H23)/4416/display/redirect>

------------------------------------------
[...truncated 32.13 MB...]
[ RUN      ] Endpoint/SlaveEndpointTest.AuthorizedRequest/2
I1106 06:27:56.140622  4047 containerizer.cpp:301] Using isolation { environment_secret, posix/cpu,
posix/mem, filesystem/posix, network/cni }
W1106 06:27:56.141134  4047 backend.cpp:76] Failed to create 'aufs' backend: AufsBackend requires
root privileges
W1106 06:27:56.141252  4047 backend.cpp:76] Failed to create 'bind' backend: BindBackend requires
root privileges
I1106 06:27:56.141286  4047 provisioner.cpp:255] Using default backend 'copy'
I1106 06:27:56.144803  4067 slave.cpp:254] Mesos agent started on (824)@172.17.0.2:40598
I1106 06:27:56.144853  4067 slave.cpp:255] Flags at startup: --acls="" --appc_simple_discovery_uri_prefix="http://"
--appc_store_dir="/tmp/Endpoint_SlaveEndpointTest_AuthorizedRequest_2_nGNM75/store/appc" --authenticate_http_readonly="true"
--authenticate_http_readwrite="true" --authenticatee="crammd5" --authentication_backoff_factor="1secs"
--authorizer="local" --cgroups_cpu_enable_pids_and_tids_count="false" --cgroups_enable_cfs="false"
--cgroups_hierarchy="/sys/fs/cgroup" --cgroups_limit_swap="false" --cgroups_root="mesos" --container_disk_watch_interval="15secs"
--containerizers="mesos" --credential="/tmp/Endpoint_SlaveEndpointTest_AuthorizedRequest_2_nGNM75/credential"
--default_role="*" --disallow_sharing_agent_pid_namespace="false" --disk_watch_interval="1mins"
--docker="docker" --docker_kill_orphans="true" --docker_registry="https://registry-1.docker.io"
--docker_remove_delay="6hrs" --docker_socket="/var/run/docker.sock" --docker_stop_timeout="0ns"
--docker_store_dir="/tmp/Endpoint_SlaveEndpointTest_AuthorizedRequest_2_nGNM75/store/docker"
--docker_volume_checkpoint_dir="/var/run/mesos/isolators/docker/volume" --enforce_container_disk_quota="false"
--executor_registration_timeout="1mins" --executor_reregistration_timeout="2secs" --executor_shutdown_grace_period="5secs"
--fetcher_cache_dir="/tmp/Endpoint_SlaveEndpointTest_AuthorizedRequest_2_nGNM75/fetch" --fetcher_cache_size="2GB"
--frameworks_home="" --gc_delay="1weeks" --gc_disk_headroom="0.1" --hadoop_home="" --help="false"
--hostname_lookup="true" --http_command_executor="false" --http_credentials="/tmp/Endpoint_SlaveEndpointTest_AuthorizedRequest_2_nGNM75/http_credentials"
--http_heartbeat_interval="30secs" --initialize_driver_logging="true" --isolation="posix/cpu,posix/mem"
--launcher="posix" --launcher_dir="/mesos/mesos-1.5.0/_build/src" --logbufsecs="0" --logging_level="INFO"
--max_completed_executors_per_framework="150" --oversubscribed_resources_interval="15secs"
--perf_duration="10secs" --perf_interval="1mins" --port="5051" --qos_correction_interval_min="0ns"
--quiet="false" --recover="reconnect" --recovery_timeout="15mins" --registration_backoff_factor="10ms"
--resources="cpus:2;gpus:0;mem:1024;disk:1024;ports:[31000-32000]" --revocable_cpu_low_priority="true"
--runtime_dir="/tmp/Endpoint_SlaveEndpointTest_AuthorizedRequest_2_nGNM75" --sandbox_directory="/mnt/mesos/sandbox"
--strict="true" --switch_user="true" --systemd_enable_support="true" --systemd_runtime_directory="/run/systemd/system"
--version="false" --work_dir="/tmp/Endpoint_SlaveEndpointTest_AuthorizedRequest_2_sZ1tAt"
--zk_session_timeout="10secs"
I1106 06:27:56.145359  4067 credentials.hpp:86] Loading credential for authentication from
'/tmp/Endpoint_SlaveEndpointTest_AuthorizedRequest_2_nGNM75/credential'
I1106 06:27:56.145598  4067 slave.cpp:287] Agent using credential for: test-principal
I1106 06:27:56.145622  4067 credentials.hpp:37] Loading credentials for authentication from
'/tmp/Endpoint_SlaveEndpointTest_AuthorizedRequest_2_nGNM75/http_credentials'
I1106 06:27:56.145895  4067 http.cpp:1045] Creating default 'basic' HTTP authenticator for
realm 'mesos-agent-readonly'
I1106 06:27:56.146116  4067 http.cpp:1045] Creating default 'basic' HTTP authenticator for
realm 'mesos-agent-readwrite'
I1106 06:27:56.147789  4067 slave.cpp:585] Agent resources: [{"name":"cpus","scalar":{"value":2.0},"type":"SCALAR"},{"name":"mem","scalar":{"value":1024.0},"type":"SCALAR"},{"name":"disk","scalar":{"value":1024.0},"type":"SCALAR"},{"name":"ports","ranges":{"range":[{"begin":31000,"end":32000}]},"type":"RANGES"}]
I1106 06:27:56.148042  4067 slave.cpp:593] Agent attributes: [  ]
I1106 06:27:56.148056  4067 slave.cpp:602] Agent hostname: 22b16eff41c3
I1106 06:27:56.148257  4071 status_update_manager.cpp:177] Pausing sending status updates
I1106 06:27:56.149950  4063 state.cpp:64] Recovering state from '/tmp/Endpoint_SlaveEndpointTest_AuthorizedRequest_2_sZ1tAt/meta'
I1106 06:27:56.150318  4063 status_update_manager.cpp:203] Recovering status update manager
I1106 06:27:56.150643  4061 containerizer.cpp:662] Recovering containerizer
I1106 06:27:56.152084  4050 provisioner.cpp:416] Provisioner recovery complete
I1106 06:27:56.152428  4071 slave.cpp:6333] Finished recovery
I1106 06:27:56.155997  4049 process.cpp:3938] Handling HTTP event for process 'slave(824)'
with path: '/slave(824)/containers'
I1106 06:27:56.157268  4062 http.cpp:1185] HTTP GET for /slave(824)/containers from 172.17.0.2:52180
I1106 06:27:56.157347  4062 http.cpp:976] Authorizing principal 'test-principal' to GET the
'/containers' endpoint
I1106 06:27:56.161392  4047 slave.cpp:875] Agent terminating
[       OK ] Endpoint/SlaveEndpointTest.AuthorizedRequest/2 (32 ms)
[ RUN      ] Endpoint/SlaveEndpointTest.UnauthorizedRequest/0
I1106 06:27:56.173547  4047 containerizer.cpp:301] Using isolation { environment_secret, posix/cpu,
posix/mem, filesystem/posix, network/cni }
W1106 06:27:56.174052  4047 backend.cpp:76] Failed to create 'aufs' backend: AufsBackend requires
root privileges
W1106 06:27:56.174170  4047 backend.cpp:76] Failed to create 'bind' backend: BindBackend requires
root privileges
I1106 06:27:56.174217  4047 provisioner.cpp:255] Using default backend 'copy'
I1106 06:27:56.177821  4049 slave.cpp:254] Mesos agent started on (825)@172.17.0.2:40598
I1106 06:27:56.177862  4049 slave.cpp:255] Flags at startup: --acls="" --appc_simple_discovery_uri_prefix="http://"
--appc_store_dir="/tmp/Endpoint_SlaveEndpointTest_UnauthorizedRequest_0_9AAxxA/store/appc"
--authenticate_http_readonly="true" --authenticate_http_readwrite="true" --authenticatee="crammd5"
--authentication_backoff_factor="1secs" --authorizer="local" --cgroups_cpu_enable_pids_and_tids_count="false"
--cgroups_enable_cfs="false" --cgroups_hierarchy="/sys/fs/cgroup" --cgroups_limit_swap="false"
--cgroups_root="mesos" --container_disk_watch_interval="15secs" --containerizers="mesos" --credential="/tmp/Endpoint_SlaveEndpointTest_UnauthorizedRequest_0_9AAxxA/credential"
--default_role="*" --disallow_sharing_agent_pid_namespace="false" --disk_watch_interval="1mins"
--docker="docker" --docker_kill_orphans="true" --docker_registry="https://registry-1.docker.io"
--docker_remove_delay="6hrs" --docker_socket="/var/run/docker.sock" --docker_stop_timeout="0ns"
--docker_store_dir="/tmp/Endpoint_SlaveEndpointTest_UnauthorizedRequest_0_9AAxxA/store/docker"
--docker_volume_checkpoint_dir="/var/run/mesos/isolators/docker/volume" --enforce_container_disk_quota="false"
--executor_registration_timeout="1mins" --executor_reregistration_timeout="2secs" --executor_shutdown_grace_period="5secs"
--fetcher_cache_dir="/tmp/Endpoint_SlaveEndpointTest_UnauthorizedRequest_0_9AAxxA/fetch" --fetcher_cache_size="2GB"
--frameworks_home="" --gc_delay="1weeks" --gc_disk_headroom="0.1" --hadoop_home="" --help="false"
--hostname_lookup="true" --http_command_executor="false" --http_credentials="/tmp/Endpoint_SlaveEndpointTest_UnauthorizedRequest_0_9AAxxA/http_credentials"
--http_heartbeat_interval="30secs" --initialize_driver_logging="true" --isolation="posix/cpu,posix/mem"
--launcher="posix" --launcher_dir="/mesos/mesos-1.5.0/_build/src" --logbufsecs="0" --logging_level="INFO"
--max_completed_executors_per_framework="150" --oversubscribed_resources_interval="15secs"
--perf_duration="10secs" --perf_interval="1mins" --port="5051" --qos_correction_interval_min="0ns"
--quiet="false" --recover="reconnect" --recovery_timeout="15mins" --registration_backoff_factor="10ms"
--resources="cpus:2;gpus:0;mem:1024;disk:1024;ports:[31000-32000]" --revocable_cpu_low_priority="true"
--runtime_dir="/tmp/Endpoint_SlaveEndpointTest_UnauthorizedRequest_0_9AAxxA" --sandbox_directory="/mnt/mesos/sandbox"
--strict="true" --switch_user="true" --systemd_enable_support="true" --systemd_runtime_directory="/run/systemd/system"
--version="false" --work_dir="/tmp/Endpoint_SlaveEndpointTest_UnauthorizedRequest_0_WAOkVX"
--zk_session_timeout="10secs"
I1106 06:27:56.178279  4049 credentials.hpp:86] Loading credential for authentication from
'/tmp/Endpoint_SlaveEndpointTest_UnauthorizedRequest_0_9AAxxA/credential'
I1106 06:27:56.178447  4049 slave.cpp:287] Agent using credential for: test-principal
I1106 06:27:56.178469  4049 credentials.hpp:37] Loading credentials for authentication from
'/tmp/Endpoint_SlaveEndpointTest_UnauthorizedRequest_0_9AAxxA/http_credentials'
I1106 06:27:56.178701  4049 http.cpp:1045] Creating default 'basic' HTTP authenticator for
realm 'mesos-agent-readonly'
I1106 06:27:56.178869  4049 http.cpp:1045] Creating default 'basic' HTTP authenticator for
realm 'mesos-agent-readwrite'
I1106 06:27:56.180338  4049 slave.cpp:585] Agent resources: [{"name":"cpus","scalar":{"value":2.0},"type":"SCALAR"},{"name":"mem","scalar":{"value":1024.0},"type":"SCALAR"},{"name":"disk","scalar":{"value":1024.0},"type":"SCALAR"},{"name":"ports","ranges":{"range":[{"begin":31000,"end":32000}]},"type":"RANGES"}]
I1106 06:27:56.180557  4049 slave.cpp:593] Agent attributes: [  ]
I1106 06:27:56.180570  4049 slave.cpp:602] Agent hostname: 22b16eff41c3
I1106 06:27:56.180737  4062 status_update_manager.cpp:177] Pausing sending status updates
I1106 06:27:56.182258  4058 state.cpp:64] Recovering state from '/tmp/Endpoint_SlaveEndpointTest_UnauthorizedRequest_0_WAOkVX/meta'
I1106 06:27:56.182621  4065 status_update_manager.cpp:203] Recovering status update manager
I1106 06:27:56.182802  4065 containerizer.cpp:662] Recovering containerizer
I1106 06:27:56.184347  4051 provisioner.cpp:416] Provisioner recovery complete
I1106 06:27:56.184725  4062 slave.cpp:6333] Finished recovery
I1106 06:27:56.188392  4068 process.cpp:3938] Handling HTTP event for process 'slave(825)'
with path: '/slave(825)/monitor/statistics'
I1106 06:27:56.189843  4067 http.cpp:1185] HTTP GET for /slave(825)/monitor/statistics from
172.17.0.2:52182
I1106 06:27:56.189929  4067 http.cpp:976] Authorizing principal 'test-principal' to GET the
'/monitor/statistics' endpoint
I1106 06:27:56.192559  4047 slave.cpp:875] Agent terminating
[       OK ] Endpoint/SlaveEndpointTest.UnauthorizedRequest/0 (31 ms)
[ RUN      ] Endpoint/SlaveEndpointTest.UnauthorizedRequest/1
I1106 06:27:56.204583  4047 containerizer.cpp:301] Using isolation { environment_secret, posix/cpu,
posix/mem, filesystem/posix, network/cni }
W1106 06:27:56.205097  4047 backend.cpp:76] Failed to create 'aufs' backend: AufsBackend requires
root privileges
W1106 06:27:56.205221  4047 backend.cpp:76] Failed to create 'bind' backend: BindBackend requires
root privileges
I1106 06:27:56.205263  4047 provisioner.cpp:255] Using default backend 'copy'
I1106 06:27:56.209692  4070 slave.cpp:254] Mesos agent started on (826)@172.17.0.2:40598
I1106 06:27:56.209751  4070 slave.cpp:255] Flags at startup: --acls="" --appc_simple_discovery_uri_prefix="http://"
--appc_store_dir="/tmp/Endpoint_SlaveEndpointTest_UnauthorizedRequest_1_ljMXf5/store/appc"
--authenticate_http_readonly="true" --authenticate_http_readwrite="true" --authenticatee="crammd5"
--authentication_backoff_factor="1secs" --authorizer="local" --cgroups_cpu_enable_pids_and_tids_count="false"
--cgroups_enable_cfs="false" --cgroups_hierarchy="/sys/fs/cgroup" --cgroups_limit_swap="false"
--cgroups_root="mesos" --container_disk_watch_interval="15secs" --containerizers="mesos" --credential="/tmp/Endpoint_SlaveEndpointTest_UnauthorizedRequest_1_ljMXf5/credential"
--default_role="*" --disallow_sharing_agent_pid_namespace="false" --disk_watch_interval="1mins"
--docker="docker" --docker_kill_orphans="true" --docker_registry="https://registry-1.docker.io"
--docker_remove_delay="6hrs" --docker_socket="/var/run/docker.sock" --docker_stop_timeout="0ns"
--docker_store_dir="/tmp/Endpoint_SlaveEndpointTest_UnauthorizedRequest_1_ljMXf5/store/docker"
--docker_volume_checkpoint_dir="/var/run/mesos/isolators/docker/volume" --enforce_container_disk_quota="false"
--executor_registration_timeout="1mins" --executor_reregistration_timeout="2secs" --executor_shutdown_grace_period="5secs"
--fetcher_cache_dir="/tmp/Endpoint_SlaveEndpointTest_UnauthorizedRequest_1_ljMXf5/fetch" --fetcher_cache_size="2GB"
--frameworks_home="" --gc_delay="1weeks" --gc_disk_headroom="0.1" --hadoop_home="" --help="false"
--hostname_lookup="true" --http_command_executor="false" --http_credentials="/tmp/Endpoint_SlaveEndpointTest_UnauthorizedRequest_1_ljMXf5/http_credentials"
--http_heartbeat_interval="30secs" --initialize_driver_logging="true" --isolation="posix/cpu,posix/mem"
--launcher="posix" --launcher_dir="/mesos/mesos-1.5.0/_build/src" --logbufsecs="0" --logging_level="INFO"
--max_completed_executors_per_framework="150" --oversubscribed_resources_interval="15secs"
--perf_duration="10secs" --perf_interval="1mins" --port="5051" --qos_correction_interval_min="0ns"
--quiet="false" --recover="reconnect" --recovery_timeout="15mins" --registration_backoff_factor="10ms"
--resources="cpus:2;gpus:0;mem:1024;disk:1024;ports:[31000-32000]" --revocable_cpu_low_priority="true"
--runtime_dir="/tmp/Endpoint_SlaveEndpointTest_UnauthorizedRequest_1_ljMXf5" --sandbox_directory="/mnt/mesos/sandbox"
--strict="true" --switch_user="true" --systemd_enable_support="true" --systemd_runtime_directory="/run/systemd/system"
--version="false" --work_dir="/tmp/Endpoint_SlaveEndpointTest_UnauthorizedRequest_1_u2Y8ys"
--zk_session_timeout="10secs"
I1106 06:27:56.210384  4070 credentials.hpp:86] Loading credential for authentication from
'/tmp/Endpoint_SlaveEndpointTest_UnauthorizedRequest_1_ljMXf5/credential'
I1106 06:27:56.210562  4070 slave.cpp:287] Agent using credential for: test-principal
I1106 06:27:56.210585  4070 credentials.hpp:37] Loading credentials for authentication from
'/tmp/Endpoint_SlaveEndpointTest_UnauthorizedRequest_1_ljMXf5/http_credentials'
I1106 06:27:56.210830  4070 http.cpp:1045] Creating default 'basic' HTTP authenticator for
realm 'mesos-agent-readonly'
I1106 06:27:56.211009  4070 http.cpp:1045] Creating default 'basic' HTTP authenticator for
realm 'mesos-agent-readwrite'
I1106 06:27:56.212563  4070 slave.cpp:585] Agent resources: [{"name":"cpus","scalar":{"value":2.0},"type":"SCALAR"},{"name":"mem","scalar":{"value":1024.0},"type":"SCALAR"},{"name":"disk","scalar":{"value":1024.0},"type":"SCALAR"},{"name":"ports","ranges":{"range":[{"begin":31000,"end":32000}]},"type":"RANGES"}]
I1106 06:27:56.212796  4070 slave.cpp:593] Agent attributes: [  ]
I1106 06:27:56.212810  4070 slave.cpp:602] Agent hostname: 22b16eff41c3
I1106 06:27:56.212971  4062 status_update_manager.cpp:177] Pausing sending status updates
I1106 06:27:56.214588  4056 state.cpp:64] Recovering state from '/tmp/Endpoint_SlaveEndpointTest_UnauthorizedRequest_1_u2Y8ys/meta'
I1106 06:27:56.214967  4064 status_update_manager.cpp:203] Recovering status update manager
I1106 06:27:56.215157  4049 containerizer.cpp:662] Recovering containerizer
I1106 06:27:56.216639  4050 provisioner.cpp:416] Provisioner recovery complete
I1106 06:27:56.217039  4062 slave.cpp:6333] Finished recovery
I1106 06:27:56.220402  4063 process.cpp:3938] Handling HTTP event for process 'slave(826)'
with path: '/slave(826)/monitor/statistics.json'
I1106 06:27:56.221752  4059 http.cpp:1185] HTTP GET for /slave(826)/monitor/statistics.json
from 172.17.0.2:52184
I1106 06:27:56.221838  4059 http.cpp:976] Authorizing principal 'test-principal' to GET the
'/monitor/statistics.json' endpoint
I1106 06:27:56.224730  4047 slave.cpp:875] Agent terminating
[       OK ] Endpoint/SlaveEndpointTest.UnauthorizedRequest/1 (32 ms)
[ RUN      ] Endpoint/SlaveEndpointTest.UnauthorizedRequest/2
I1106 06:27:56.236829  4047 containerizer.cpp:301] Using isolation { environment_secret, posix/cpu,
posix/mem, filesystem/posix, network/cni }
W1106 06:27:56.237323  4047 backend.cpp:76] Failed to create 'aufs' backend: AufsBackend requires
root privileges
W1106 06:27:56.237438  4047 backend.cpp:76] Failed to create 'bind' backend: BindBackend requires
root privileges
I1106 06:27:56.237475  4047 provisioner.cpp:255] Using default backend 'copy'
I1106 06:27:56.241080  4068 slave.cpp:254] Mesos agent started on (827)@172.17.0.2:40598
I1106 06:27:56.241129  4068 slave.cpp:255] Flags at startup: --acls="" --appc_simple_discovery_uri_prefix="http://"
--appc_store_dir="/tmp/Endpoint_SlaveEndpointTest_UnauthorizedRequest_2_5j8BhA/store/appc"
--authenticate_http_readonly="true" --authenticate_http_readwrite="true" --authenticatee="crammd5"
--authentication_backoff_factor="1secs" --authorizer="local" --cgroups_cpu_enable_pids_and_tids_count="false"
--cgroups_enable_cfs="false" --cgroups_hierarchy="/sys/fs/cgroup" --cgroups_limit_swap="false"
--cgroups_root="mesos" --container_disk_watch_interval="15secs" --containerizers="mesos" --credential="/tmp/Endpoint_SlaveEndpointTest_UnauthorizedRequest_2_5j8BhA/credential"
--default_role="*" --disallow_sharing_agent_pid_namespace="false" --disk_watch_interval="1mins"
--docker="docker" --docker_kill_orphans="true" --docker_registry="https://registry-1.docker.io"
--docker_remove_delay="6hrs" --docker_socket="/var/run/docker.sock" --docker_stop_timeout="0ns"
--docker_store_dir="/tmp/Endpoint_SlaveEndpointTest_UnauthorizedRequest_2_5j8BhA/store/docker"
--docker_volume_checkpoint_dir="/var/run/mesos/isolators/docker/volume" --enforce_container_disk_quota="false"
--executor_registration_timeout="1mins" --executor_reregistration_timeout="2secs" --executor_shutdown_grace_period="5secs"
--fetcher_cache_dir="/tmp/Endpoint_SlaveEndpointTest_UnauthorizedRequest_2_5j8BhA/fetch" --fetcher_cache_size="2GB"
--frameworks_home="" --gc_delay="1weeks" --gc_disk_headroom="0.1" --hadoop_home="" --help="false"
--hostname_lookup="true" --http_command_executor="false" --http_credentials="/tmp/Endpoint_SlaveEndpointTest_UnauthorizedRequest_2_5j8BhA/http_credentials"
--http_heartbeat_interval="30secs" --initialize_driver_logging="true" --isolation="posix/cpu,posix/mem"
--launcher="posix" --launcher_dir="/mesos/mesos-1.5.0/_build/src" --logbufsecs="0" --logging_level="INFO"
--max_completed_executors_per_framework="150" --oversubscribed_resources_interval="15secs"
--perf_duration="10secs" --perf_interval="1mins" --port="5051" --qos_correction_interval_min="0ns"
--quiet="false" --recover="reconnect" --recovery_timeout="15mins" --registration_backoff_factor="10ms"
--resources="cpus:2;gpus:0;mem:1024;disk:1024;ports:[31000-32000]" --revocable_cpu_low_priority="true"
--runtime_dir="/tmp/Endpoint_SlaveEndpointTest_UnauthorizedRequest_2_5j8BhA" --sandbox_directory="/mnt/mesos/sandbox"
--strict="true" --switch_user="true" --systemd_enable_support="true" --systemd_runtime_directory="/run/systemd/system"
--version="false" --work_dir="/tmp/Endpoint_SlaveEndpointTest_UnauthorizedRequest_2_ACJZvX"
--zk_session_timeout="10secs"
I1106 06:27:56.241494  4068 credentials.hpp:86] Loading credential for authentication from
'/tmp/Endpoint_SlaveEndpointTest_UnauthorizedRequest_2_5j8BhA/credential'
I1106 06:27:56.241688  4068 slave.cpp:287] Agent using credential for: test-principal
I1106 06:27:56.241713  4068 credentials.hpp:37] Loading credentials for authentication from
'/tmp/Endpoint_SlaveEndpointTest_UnauthorizedRequest_2_5j8BhA/http_credentials'
I1106 06:27:56.241943  4068 http.cpp:1045] Creating default 'basic' HTTP authenticator for
realm 'mesos-agent-readonly'
I1106 06:27:56.242120  4068 http.cpp:1045] Creating default 'basic' HTTP authenticator for
realm 'mesos-agent-readwrite'
I1106 06:27:56.243597  4068 slave.cpp:585] Agent resources: [{"name":"cpus","scalar":{"value":2.0},"type":"SCALAR"},{"name":"mem","scalar":{"value":1024.0},"type":"SCALAR"},{"name":"disk","scalar":{"value":1024.0},"type":"SCALAR"},{"name":"ports","ranges":{"range":[{"begin":31000,"end":32000}]},"type":"RANGES"}]
I1106 06:27:56.243813  4068 slave.cpp:593] Agent attributes: [  ]
I1106 06:27:56.243826  4068 slave.cpp:602] Agent hostname: 22b16eff41c3
I1106 06:27:56.244029  4060 status_update_manager.cpp:177] Pausing sending status updates
I1106 06:27:56.245539  4049 state.cpp:64] Recovering state from '/tmp/Endpoint_SlaveEndpointTest_UnauthorizedRequest_2_ACJZvX/meta'
I1106 06:27:56.245904  4052 status_update_manager.cpp:203] Recovering status update manager
I1106 06:27:56.246173  4048 containerizer.cpp:662] Recovering containerizer
I1106 06:27:56.247604  4063 provisioner.cpp:416] Provisioner recovery complete
I1106 06:27:56.248077  4053 slave.cpp:6333] Finished recovery
I1106 06:27:56.251497  4071 process.cpp:3938] Handling HTTP event for process 'slave(827)'
with path: '/slave(827)/containers'
I1106 06:27:56.252892  4056 http.cpp:1185] HTTP GET for /slave(827)/containers from 172.17.0.2:52186
I1106 06:27:56.252972  4056 http.cpp:976] Authorizing principal 'test-principal' to GET the
'/containers' endpoint
I1106 06:27:56.255619  4047 slave.cpp:875] Agent terminating
[       OK ] Endpoint/SlaveEndpointTest.UnauthorizedRequest/2 (30 ms)
[ RUN      ] Endpoint/SlaveEndpointTest.NoAuthorizer/0
I1106 06:27:56.268376  4047 containerizer.cpp:301] Using isolation { environment_secret, posix/cpu,
posix/mem, filesystem/posix, network/cni }
W1106 06:27:56.268952  4047 backend.cpp:76] Failed to create 'aufs' backend: AufsBackend requires
root privileges
W1106 06:27:56.269083  4047 backend.cpp:76] Failed to create 'bind' backend: BindBackend requires
root privileges
I1106 06:27:56.269121  4047 provisioner.cpp:255] Using default backend 'copy'
I1106 06:27:56.271085  4047 cluster.cpp:448] Creating default 'local' authorizer
I1106 06:27:56.273298  4064 slave.cpp:254] Mesos agent started on (828)@172.17.0.2:40598
I1106 06:27:56.273347  4064 slave.cpp:255] Flags at startup: --acls="" --appc_simple_discovery_uri_prefix="http://"
--appc_store_dir="/tmp/Endpoint_SlaveEndpointTest_NoAuthorizer_0_75RCB5/store/appc" --authenticate_http_readonly="true"
--authenticate_http_readwrite="true" --authenticatee="crammd5" --authentication_backoff_factor="1secs"
--authorizer="local" --cgroups_cpu_enable_pids_and_tids_count="false" --cgroups_enable_cfs="false"
--cgroups_hierarchy="/sys/fs/cgroup" --cgroups_limit_swap="false" --cgroups_root="mesos" --container_disk_watch_interval="15secs"
--containerizers="mesos" --credential="/tmp/Endpoint_SlaveEndpointTest_NoAuthorizer_0_75RCB5/credential"
--default_role="*" --disallow_sharing_agent_pid_namespace="false" --disk_watch_interval="1mins"
--docker="docker" --docker_kill_orphans="true" --docker_registry="https://registry-1.docker.io"
--docker_remove_delay="6hrs" --docker_socket="/var/run/docker.sock" --docker_stop_timeout="0ns"
--docker_store_dir="/tmp/Endpoint_SlaveEndpointTest_NoAuthorizer_0_75RCB5/store/docker" --docker_volume_checkpoint_dir="/var/run/mesos/isolators/docker/volume"
--enforce_container_disk_quota="false" --executor_registration_timeout="1mins" --executor_reregistration_timeout="2secs"
--executor_shutdown_grace_period="5secs" --fetcher_cache_dir="/tmp/Endpoint_SlaveEndpointTest_NoAuthorizer_0_75RCB5/fetch"
--fetcher_cache_size="2GB" --frameworks_home="" --gc_delay="1weeks" --gc_disk_headroom="0.1"
--hadoop_home="" --help="false" --hostname_lookup="true" --http_command_executor="false" --http_credentials="/tmp/Endpoint_SlaveEndpointTest_NoAuthorizer_0_75RCB5/http_credentials"
--http_heartbeat_interval="30secs" --initialize_driver_logging="true" --isolation="posix/cpu,posix/mem"
--launcher="posix" --launcher_dir="/mesos/mesos-1.5.0/_build/src" --logbufsecs="0" --logging_level="INFO"
--max_completed_executors_per_framework="150" --oversubscribed_resources_interval="15secs"
--perf_duration="10secs" --perf_interval="1mins" --port="5051" --qos_correction_interval_min="0ns"
--quiet="false" --recover="reconnect" --recovery_timeout="15mins" --registration_backoff_factor="10ms"
--resources="cpus:2;gpus:0;mem:1024;disk:1024;ports:[31000-32000]" --revocable_cpu_low_priority="true"
--runtime_dir="/tmp/Endpoint_SlaveEndpointTest_NoAuthorizer_0_75RCB5" --sandbox_directory="/mnt/mesos/sandbox"
--strict="true" --switch_user="true" --systemd_enable_support="true" --systemd_runtime_directory="/run/systemd/system"
--version="false" --work_dir="/tmp/Endpoint_SlaveEndpointTest_NoAuthorizer_0_s4vpLs" --zk_session_timeout="10secs"
I1106 06:27:56.273792  4064 credentials.hpp:86] Loading credential for authentication from
'/tmp/Endpoint_SlaveEndpointTest_NoAuthorizer_0_75RCB5/credential'
I1106 06:27:56.273958  4064 slave.cpp:287] Agent using credential for: test-principal
I1106 06:27:56.273990  4064 credentials.hpp:37] Loading credentials for authentication from
'/tmp/Endpoint_SlaveEndpointTest_NoAuthorizer_0_75RCB5/http_credentials'
I1106 06:27:56.274258  4064 http.cpp:1045] Creating default 'basic' HTTP authenticator for
realm 'mesos-agent-readonly'
I1106 06:27:56.274441  4064 http.cpp:1045] Creating default 'basic' HTTP authenticator for
realm 'mesos-agent-readwrite'
I1106 06:27:56.275905  4064 slave.cpp:585] Agent resources: [{"name":"cpus","scalar":{"value":2.0},"type":"SCALAR"},{"name":"mem","scalar":{"value":1024.0},"type":"SCALAR"},{"name":"disk","scalar":{"value":1024.0},"type":"SCALAR"},{"name":"ports","ranges":{"range":[{"begin":31000,"end":32000}]},"type":"RANGES"}]
I1106 06:27:56.276127  4064 slave.cpp:593] Agent attributes: [  ]
I1106 06:27:56.276141  4064 slave.cpp:602] Agent hostname: 22b16eff41c3
I1106 06:27:56.276304  4050 status_update_manager.cpp:177] Pausing sending status updates
I1106 06:27:56.277837  4063 state.cpp:64] Recovering state from '/tmp/Endpoint_SlaveEndpointTest_NoAuthorizer_0_s4vpLs/meta'
I1106 06:27:56.278167  4069 status_update_manager.cpp:203] Recovering status update manager
I1106 06:27:56.278409  4062 containerizer.cpp:662] Recovering containerizer
I1106 06:27:56.280026  4051 provisioner.cpp:416] Provisioner recovery complete
I1106 06:27:56.280519  4055 slave.cpp:6333] Finished recovery
I1106 06:27:56.284152  4057 process.cpp:3938] Handling HTTP event for process 'slave(828)'
with path: '/slave(828)/monitor/statistics'
I1106 06:27:56.285585  4070 http.cpp:1185] HTTP GET for /slave(828)/monitor/statistics from
172.17.0.2:52192
I1106 06:27:56.285672  4070 http.cpp:976] Authorizing principal 'test-principal' to GET the
'/monitor/statistics' endpoint
I1106 06:27:56.289183  4047 slave.cpp:875] Agent terminating
[       OK ] Endpoint/SlaveEndpointTest.NoAuthorizer/0 (33 ms)
[ RUN      ] Endpoint/SlaveEndpointTest.NoAuthorizer/1
I1106 06:27:56.301672  4047 containerizer.cpp:301] Using isolation { environment_secret, posix/cpu,
posix/mem, filesystem/posix, network/cni }
W1106 06:27:56.302158  4047 backend.cpp:76] Failed to create 'aufs' backend: AufsBackend requires
root privileges
W1106 06:27:56.302279  4047 backend.cpp:76] Failed to create 'bind' backend: BindBackend requires
root privileges
I1106 06:27:56.302312  4047 provisioner.cpp:255] Using default backend 'copy'
I1106 06:27:56.303972  4047 cluster.cpp:448] Creating default 'local' authorizer
I1106 06:27:56.305965  4063 slave.cpp:254] Mesos agent started on (829)@172.17.0.2:40598
I1106 06:27:56.306005  4063 slave.cpp:255] Flags at startup: --acls="" --appc_simple_discovery_uri_prefix="http://"
--appc_store_dir="/tmp/Endpoint_SlaveEndpointTest_NoAuthorizer_1_xlKyfB/store/appc" --authenticate_http_readonly="true"
--authenticate_http_readwrite="true" --authenticatee="crammd5" --authentication_backoff_factor="1secs"
--authorizer="local" --cgroups_cpu_enable_pids_and_tids_count="false" --cgroups_enable_cfs="false"
--cgroups_hierarchy="/sys/fs/cgroup" --cgroups_limit_swap="false" --cgroups_root="mesos" --container_disk_watch_interval="15secs"
--containerizers="mesos" --credential="/tmp/Endpoint_SlaveEndpointTest_NoAuthorizer_1_xlKyfB/credential"
--default_role="*" --disallow_sharing_agent_pid_namespace="false" --disk_watch_interval="1mins"
--docker="docker" --docker_kill_orphans="true" --docker_registry="https://registry-1.docker.io"
--docker_remove_delay="6hrs" --docker_socket="/var/run/docker.sock" --docker_stop_timeout="0ns"
--docker_store_dir="/tmp/Endpoint_SlaveEndpointTest_NoAuthorizer_1_xlKyfB/store/docker" --docker_volume_checkpoint_dir="/var/run/mesos/isolators/docker/volume"
--enforce_container_disk_quota="false" --executor_registration_timeout="1mins" --executor_reregistration_timeout="2secs"
--executor_shutdown_grace_period="5secs" --fetcher_cache_dir="/tmp/Endpoint_SlaveEndpointTest_NoAuthorizer_1_xlKyfB/fetch"
--fetcher_cache_size="2GB" --frameworks_home="" --gc_delay="1weeks" --gc_disk_headroom="0.1"
--hadoop_home="" --help="false" --hostname_lookup="true" --http_command_executor="false" --http_credentials="/tmp/Endpoint_SlaveEndpointTest_NoAuthorizer_1_xlKyfB/http_credentials"
--http_heartbeat_interval="30secs" --initialize_driver_logging="true" --isolation="posix/cpu,posix/mem"
--launcher="posix" --launcher_dir="/mesos/mesos-1.5.0/_build/src" --logbufsecs="0" --logging_level="INFO"
--max_completed_executors_per_framework="150" --oversubscribed_resources_interval="15secs"
--perf_duration="10secs" --perf_interval="1mins" --port="5051" --qos_correction_interval_min="0ns"
--quiet="false" --recover="reconnect" --recovery_timeout="15mins" --registration_backoff_factor="10ms"
--resources="cpus:2;gpus:0;mem:1024;disk:1024;ports:[31000-32000]" --revocable_cpu_low_priority="true"
--runtime_dir="/tmp/Endpoint_SlaveEndpointTest_NoAuthorizer_1_xlKyfB" --sandbox_directory="/mnt/mesos/sandbox"
--strict="true" --switch_user="true" --systemd_enable_support="true" --systemd_runtime_directory="/run/systemd/system"
--version="false" --work_dir="/tmp/Endpoint_SlaveEndpointTest_NoAuthorizer_1_qockkY" --zk_session_timeout="10secs"
I1106 06:27:56.306519  4063 credentials.hpp:86] Loading credential for authentication from
'/tmp/Endpoint_SlaveEndpointTest_NoAuthorizer_1_xlKyfB/credential'
I1106 06:27:56.306732  4063 slave.cpp:287] Agent using credential for: test-principal
I1106 06:27:56.306756  4063 credentials.hpp:37] Loading credentials for authentication from
'/tmp/Endpoint_SlaveEndpointTest_NoAuthorizer_1_xlKyfB/http_credentials'
I1106 06:27:56.307019  4063 http.cpp:1045] Creating default 'basic' HTTP authenticator for
realm 'mesos-agent-readonly'
I1106 06:27:56.307226  4063 http.cpp:1045] Creating default 'basic' HTTP authenticator for
realm 'mesos-agent-readwrite'
I1106 06:27:56.308733  4063 slave.cpp:585] Agent resources: [{"name":"cpus","scalar":{"value":2.0},"type":"SCALAR"},{"name":"mem","scalar":{"value":1024.0},"type":"SCALAR"},{"name":"disk","scalar":{"value":1024.0},"type":"SCALAR"},{"name":"ports","ranges":{"range":[{"begin":31000,"end":32000}]},"type":"RANGES"}]
I1106 06:27:56.308974  4063 slave.cpp:593] Agent attributes: [  ]
I1106 06:27:56.308987  4063 slave.cpp:602] Agent hostname: 22b16eff41c3
I1106 06:27:56.309197  4070 status_update_manager.cpp:177] Pausing sending status updates
I1106 06:27:56.310808  4059 state.cpp:64] Recovering state from '/tmp/Endpoint_SlaveEndpointTest_NoAuthorizer_1_qockkY/meta'
I1106 06:27:56.311169  4052 status_update_manager.cpp:203] Recovering status update manager
I1106 06:27:56.311344  4052 containerizer.cpp:662] Recovering containerizer
I1106 06:27:56.312603  4067 provisioner.cpp:416] Provisioner recovery complete
I1106 06:27:56.313042  4048 slave.cpp:6333] Finished recovery
I1106 06:27:56.316344  4068 process.cpp:3938] Handling HTTP event for process 'slave(829)'
with path: '/slave(829)/monitor/statistics.json'
I1106 06:27:56.317522  4066 http.cpp:1185] HTTP GET for /slave(829)/monitor/statistics.json
from 172.17.0.2:52194
I1106 06:27:56.317593  4066 http.cpp:976] Authorizing principal 'test-principal' to GET the
'/monitor/statistics.json' endpoint
I1106 06:27:56.321471  4047 slave.cpp:875] Agent terminating
[       OK ] Endpoint/SlaveEndpointTest.NoAuthorizer/1 (32 ms)
[ RUN      ] Endpoint/SlaveEndpointTest.NoAuthorizer/2
I1106 06:27:56.334724  4047 containerizer.cpp:301] Using isolation { environment_secret, posix/cpu,
posix/mem, filesystem/posix, network/cni }
W1106 06:27:56.335222  4047 backend.cpp:76] Failed to create 'aufs' backend: AufsBackend requires
root privileges
W1106 06:27:56.335338  4047 backend.cpp:76] Failed to create 'bind' backend: BindBackend requires
root privileges
I1106 06:27:56.335374  4047 provisioner.cpp:255] Using default backend 'copy'
I1106 06:27:56.337147  4047 cluster.cpp:448] Creating default 'local' authorizer
I1106 06:27:56.339498  4052 slave.cpp:254] Mesos agent started on (830)@172.17.0.2:40598
I1106 06:27:56.339538  4052 slave.cpp:255] Flags at startup: --acls="" --appc_simple_discovery_uri_prefix="http://"
--appc_store_dir="/tmp/Endpoint_SlaveEndpointTest_NoAuthorizer_2_l7a2c7/store/appc" --authenticate_http_readonly="true"
--authenticate_http_readwrite="true" --authenticatee="crammd5" --authentication_backoff_factor="1secs"
--authorizer="local" --cgroups_cpu_enable_pids_and_tids_count="false" --cgroups_enable_cfs="false"
--cgroups_hierarchy="/sys/fs/cgroup" --cgroups_limit_swap="false" --cgroups_root="mesos" --container_disk_watch_interval="15secs"
--containerizers="mesos" --credential="/tmp/Endpoint_SlaveEndpointTest_NoAuthorizer_2_l7a2c7/credential"
--default_role="*" --disallow_sharing_agent_pid_namespace="false" --disk_watch_interval="1mins"
--docker="docker" --docker_kill_orphans="true" --docker_registry="https://registry-1.docker.io"
--docker_remove_delay="6hrs" --docker_socket="/var/run/docker.sock" --docker_stop_timeout="0ns"
--docker_store_dir="/tmp/Endpoint_SlaveEndpointTest_NoAuthorizer_2_l7a2c7/store/docker" --docker_volume_checkpoint_dir="/var/run/mesos/isolators/docker/volume"
--enforce_container_disk_quota="false" --executor_registration_timeout="1mins" --executor_reregistration_timeout="2secs"
--executor_shutdown_grace_period="5secs" --fetcher_cache_dir="/tmp/Endpoint_SlaveEndpointTest_NoAuthorizer_2_l7a2c7/fetch"
--fetcher_cache_size="2GB" --frameworks_home="" --gc_delay="1weeks" --gc_disk_headroom="0.1"
--hadoop_home="" --help="false" --hostname_lookup="true" --http_command_executor="false" --http_credentials="/tmp/Endpoint_SlaveEndpointTest_NoAuthorizer_2_l7a2c7/http_credentials"
--http_heartbeat_interval="30secs" --initialize_driver_logging="true" --isolation="posix/cpu,posix/mem"
--launcher="posix" --launcher_dir="/mesos/mesos-1.5.0/_build/src" --logbufsecs="0" --logging_level="INFO"
--max_completed_executors_per_framework="150" --oversubscribed_resources_interval="15secs"
--perf_duration="10secs" --perf_interval="1mins" --port="5051" --qos_correction_interval_min="0ns"
--quiet="false" --recover="reconnect" --recovery_timeout="15mins" --registration_backoff_factor="10ms"
--resources="cpus:2;gpus:0;mem:1024;disk:1024;ports:[31000-32000]" --revocable_cpu_low_priority="true"
--runtime_dir="/tmp/Endpoint_SlaveEndpointTest_NoAuthorizer_2_l7a2c7" --sandbox_directory="/mnt/mesos/sandbox"
--strict="true" --switch_user="true" --systemd_enable_support="true" --systemd_runtime_directory="/run/systemd/system"
--version="false" --work_dir="/tmp/Endpoint_SlaveEndpointTest_NoAuthorizer_2_m2ITcu" --zk_session_timeout="10secs"
I1106 06:27:56.339993  4052 credentials.hpp:86] Loading credential for authentication from
'/tmp/Endpoint_SlaveEndpointTest_NoAuthorizer_2_l7a2c7/credential'
I1106 06:27:56.340175  4052 slave.cpp:287] Agent using credential for: test-principal
I1106 06:27:56.340199  4052 credentials.hpp:37] Loading credentials for authentication from
'/tmp/Endpoint_SlaveEndpointTest_NoAuthorizer_2_l7a2c7/http_credentials'
I1106 06:27:56.340454  4052 http.cpp:1045] Creating default 'basic' HTTP authenticator for
realm 'mesos-agent-readonly'
I1106 06:27:56.340628  4052 http.cpp:1045] Creating default 'basic' HTTP authenticator for
realm 'mesos-agent-readwrite'
I1106 06:27:56.342106  4052 slave.cpp:585] Agent resources: [{"name":"cpus","scalar":{"value":2.0},"type":"SCALAR"},{"name":"mem","scalar":{"value":1024.0},"type":"SCALAR"},{"name":"disk","scalar":{"value":1024.0},"type":"SCALAR"},{"name":"ports","ranges":{"range":[{"begin":31000,"end":32000}]},"type":"RANGES"}]
I1106 06:27:56.342458  4052 slave.cpp:593] Agent attributes: [  ]
I1106 06:27:56.342483  4052 slave.cpp:602] Agent hostname: 22b16eff41c3
I1106 06:27:56.342718  4051 status_update_manager.cpp:177] Pausing sending status updates
I1106 06:27:56.345141  4059 state.cpp:64] Recovering state from '/tmp/Endpoint_SlaveEndpointTest_NoAuthorizer_2_m2ITcu/meta'
I1106 06:27:56.345490  4064 status_update_manager.cpp:203] Recovering status update manager
I1106 06:27:56.345744  4071 containerizer.cpp:662] Recovering containerizer
I1106 06:27:56.347270  4061 provisioner.cpp:416] Provisioner recovery complete
I1106 06:27:56.347710  4050 slave.cpp:6333] Finished recovery
I1106 06:27:56.351227  4054 process.cpp:3938] Handling HTTP event for process 'slave(830)'
with path: '/slave(830)/containers'
I1106 06:27:56.352706  4055 http.cpp:1185] HTTP GET for /slave(830)/containers from 172.17.0.2:52196
I1106 06:27:56.352833  4055 http.cpp:976] Authorizing principal 'test-principal' to GET the
'/containers' endpoint
I1106 06:27:56.357282  4047 slave.cpp:875] Agent terminating
[       OK ] Endpoint/SlaveEndpointTest.NoAuthorizer/2 (35 ms)
[----------] 9 tests from Endpoint/SlaveEndpointTest (296 ms total)

[----------] 2 tests from ContainerizerType/DefaultContainerDNSFlagTest
[ RUN      ] ContainerizerType/DefaultContainerDNSFlagTest.ValidateFlag/0
[       OK ] ContainerizerType/DefaultContainerDNSFlagTest.ValidateFlag/0 (11 ms)
[ RUN      ] ContainerizerType/DefaultContainerDNSFlagTest.ValidateFlag/1
[       OK ] ContainerizerType/DefaultContainerDNSFlagTest.ValidateFlag/1 (9 ms)
[----------] 2 tests from ContainerizerType/DefaultContainerDNSFlagTest (20 ms total)

[----------] Global test environment tear-down
[==========] 1706 tests from 186 test cases ran. (613393 ms total)
[  PASSED  ] 1702 tests.
[  FAILED  ] 4 tests, listed below:
[  FAILED  ] FetcherCacheTest.SimpleEviction
[  FAILED  ] MasterTest.RecoveredFramework
[  FAILED  ] SchedulerDriverEventTest.Update
[  FAILED  ] SlaveTest.KillQueuedTaskDuringExecutorRegistration

 4 FAILED TESTS
  YOU HAVE 21 DISABLED TESTS

I1106 06:27:56.449980  4072 process.cpp:1067] Failed to accept socket: future discarded
make[4]: *** [check-local] Error 1
make[4]: Leaving directory `/mesos/mesos-1.5.0/_build/src'
make[3]: *** [check-am] Error 2
make[3]: Leaving directory `/mesos/mesos-1.5.0/_build/src'
make[2]: *** [check] Error 2
make[2]: Leaving directory `/mesos/mesos-1.5.0/_build/src'
make[1]: *** [check-recursive] Error 1
make[1]: Leaving directory `/mesos/mesos-1.5.0/_build'
make: *** [distcheck] Error 1
+ docker rmi mesos-1509946636-2126
Untagged: mesos-1509946636-2126:latest
Deleted: sha256:c763917b848eeee6880b8175b81b30758fd986f4bc1706ec8b71a9e6a56e0be0
Deleted: sha256:4e4cab58b5656a471f2e3e7f81803924539f7aa3e99f2723902e5aa1397aae4a
Deleted: sha256:7afa20106f26caf48c9960f42b98c12a564d0da5382318f1236ba95da2ef464a
Deleted: sha256:d7548b12e1ca25dc58bb5543dd23133e0773aea83c1fe410a16e6c886782b728
Deleted: sha256:5023c0c785149fddbea8f67f051ca22ebc6e9541435a10b532791410c6b65b36
Deleted: sha256:aa263c770d2a2a27b7acce0f32fe7ca9ac927560f77e75db5ec1f0f3e0ad8cf3
Deleted: sha256:de9f665807f6f487ad5fc66b51b4b8dd323a5d22f1609ac4da9ce821a5b51a86
Deleted: sha256:3c6cf8acb2afec5f8dd56f44f3c0786cfd66a8c9cde799e6164cd9857278ca57
Deleted: sha256:9a1678a9aeed6a82bd75d02497a7475e34a9fbcfe112504088f60a24e7f8e6bb
Deleted: sha256:7a0ed3dd1572964d545db80bc44f6354ca2f8c3f089f26eb4a8fafabf7ab5079
Deleted: sha256:0f59f9df10851d9bd2a5e778bc6ed4e1347dbfb475d1e6bf5a80fc11990ff96d
Deleted: sha256:58690802cee7bbe8cafbe77143fb2ceb18af52bd3dbffb3ad1f04b9e4bbf89e7
Deleted: sha256:def180ce6177a82acbd089840670950b378a177e8a40f8e39a5a8a1ad97bcb89
Deleted: sha256:1f21ab887641b389dbe9ab2c3cbd279980510afa7d92edf9add720cb24e597f7
Deleted: sha256:ea07fb7d903bbb4fc1c3b39d51444036c29898b8d0f43df010cfe5eadf663ea5
Deleted: sha256:8144a2bbd7986f4d7cca7c78852814f237585b5fe1f0d7d06bf4bdb0037559e4
Deleted: sha256:a3b9d3e7a23fadceb443d12a3297dee35ccc8756b393c252b6fe97d55e5e3f11
Deleted: sha256:fa59ed2406cc9a208bed83747b5ea35d20e2810e99be794e4e6b4eeb36ad47e3
Deleted: sha256:bf290628d5dba34ca11ec03ec9f2cc4c602155bbe503c2c79736027aabb7694e
Deleted: sha256:ce25cca3d7bce905bea8d602f08c540bfe87f2a67ab04ecb453f654e1a48c518
Deleted: sha256:ccddb4f2a89acf390aff5f27071d397a21dd966cbab27992175a48e262024e7f
Deleted: sha256:3f191a6c6b31483289baff40c6d5134f00de57e412eefdd6e24e96a98d5e2df5
Deleted: sha256:8ad4762c3b9addf446d25a5426e711c92e1d99346c0349cf482f177f001b8e19
Deleted: sha256:d39bb1edabf071491547b15019f0a6e33c0a5f85433c33c6acedefb1d804dbd8
Deleted: sha256:862a0e2e0fde3bfdf19da608e4a3cc37ff982523d5e986f4a87d9c91c1a3f46c
Deleted: sha256:2911b4882d704b699e010f8cda42c35be1df51229a3931ba1f6ab3ca76104cf4
Deleted: sha256:6382d4024a9694343a218a452209bf70003963f4a58b9bf95d338f5c019a424d
Deleted: sha256:1f4bea002e2592dd89a476d685d59ddeb4e65c860c0c88590d1649154898f4a6
Deleted: sha256:3dc82a2169a812f207faa47eebb030d2cb30adea77c9caabda4a9cc0830cbb6c
Deleted: sha256:26de697d24d05910df30ba9342e2865252f743b6abd47a9efcfd43cd870344bf
Build step 'Execute shell' marked build as failure


Mime
View raw message