mesos-builds mailing list archives

Site index · List index
Message view « Date » · « Thread »
Top « Date » · « Thread »
From Apache Jenkins Server <jenk...@builds.apache.org>
Subject Build failed in Jenkins: Mesos-Buildbot » autotools,gcc,--verbose --disable-libtool-wrappers --enable-libevent --enable-ssl,GLOG_v=1 MESOS_VERBOSE=1,centos:7,(ubuntu)&&(!ubuntu-us1)&&(!ubuntu-eu2)&&(!qnode3)&&(!H23) #4416
Date Mon, 06 Nov 2017 06:26:58 GMT
See <https://builds.apache.org/job/Mesos-Buildbot/BUILDTOOL=autotools,COMPILER=gcc,CONFIGURATION=--verbose%20--disable-libtool-wrappers%20--enable-libevent%20--enable-ssl,ENVIRONMENT=GLOG_v=1%20MESOS_VERBOSE=1,OS=centos%3A7,label_exp=(ubuntu)&&(!ubuntu-us1)&&(!ubuntu-eu2)&&(!qnode3)&&(!H23)/4416/display/redirect>

------------------------------------------
[...truncated 33.18 MB...]
I1106 06:26:52.289945 19776 process.cpp:3938] Handling HTTP event for process 'slave(827)'
with path: '/slave(827)/containers'
I1106 06:26:52.291898 19782 http.cpp:1185] HTTP GET for /slave(827)/containers from 172.17.0.2:46680
I1106 06:26:52.292026 19782 http.cpp:976] Authorizing principal 'test-principal' to GET the
'/containers' endpoint
I1106 06:26:52.295836 19778 slave.cpp:875] Agent terminating
[       OK ] Endpoint/SlaveEndpointTest.AuthorizedRequest/2 (37 ms)
[ RUN      ] Endpoint/SlaveEndpointTest.UnauthorizedRequest/0
I1106 06:26:52.314772  9659 containerizer.cpp:301] Using isolation { environment_secret, posix/cpu,
posix/mem, filesystem/posix, network/cni }
W1106 06:26:52.315553  9659 backend.cpp:76] Failed to create 'aufs' backend: AufsBackend requires
root privileges
W1106 06:26:52.315728  9659 backend.cpp:76] Failed to create 'bind' backend: BindBackend requires
root privileges
I1106 06:26:52.315779  9659 provisioner.cpp:255] Using default backend 'copy'
I1106 06:26:52.321496 19783 slave.cpp:254] Mesos agent started on (828)@172.17.0.2:34812
I1106 06:26:52.321523 19783 slave.cpp:255] Flags at startup: --acls="" --appc_simple_discovery_uri_prefix="http://"
--appc_store_dir="/tmp/Endpoint_SlaveEndpointTest_UnauthorizedRequest_0_V2Mo6f/store/appc"
--authenticate_http_executors="true" --authenticate_http_readonly="true" --authenticate_http_readwrite="true"
--authenticatee="crammd5" --authentication_backoff_factor="1secs" --authorizer="local" --cgroups_cpu_enable_pids_and_tids_count="false"
--cgroups_enable_cfs="false" --cgroups_hierarchy="/sys/fs/cgroup" --cgroups_limit_swap="false"
--cgroups_root="mesos" --container_disk_watch_interval="15secs" --containerizers="mesos" --credential="/tmp/Endpoint_SlaveEndpointTest_UnauthorizedRequest_0_V2Mo6f/credential"
--default_role="*" --disallow_sharing_agent_pid_namespace="false" --disk_watch_interval="1mins"
--docker="docker" --docker_kill_orphans="true" --docker_registry="https://registry-1.docker.io"
--docker_remove_delay="6hrs" --docker_socket="/var/run/docker.sock" --docker_stop_timeout="0ns"
--docker_store_dir="/tmp/Endpoint_SlaveEndpointTest_UnauthorizedRequest_0_V2Mo6f/store/docker"
--docker_volume_checkpoint_dir="/var/run/mesos/isolators/docker/volume" --enforce_container_disk_quota="false"
--executor_registration_timeout="1mins" --executor_reregistration_timeout="2secs" --executor_secret_key="/tmp/Endpoint_SlaveEndpointTest_UnauthorizedRequest_0_V2Mo6f/executor_secret_key"
--executor_shutdown_grace_period="5secs" --fetcher_cache_dir="/tmp/Endpoint_SlaveEndpointTest_UnauthorizedRequest_0_V2Mo6f/fetch"
--fetcher_cache_size="2GB" --frameworks_home="" --gc_delay="1weeks" --gc_disk_headroom="0.1"
--hadoop_home="" --help="false" --hostname_lookup="true" --http_command_executor="false" --http_credentials="/tmp/Endpoint_SlaveEndpointTest_UnauthorizedRequest_0_V2Mo6f/http_credentials"
--http_heartbeat_interval="30secs" --initialize_driver_logging="true" --isolation="posix/cpu,posix/mem"
--launcher="posix" --launcher_dir="/mesos/mesos-1.5.0/_build/src" --logbufsecs="0" --logging_level="INFO"
--max_completed_executors_per_framework="150" --oversubscribed_resources_interval="15secs"
--perf_duration="10secs" --perf_interval="1mins" --port="5051" --qos_correction_interval_min="0ns"
--quiet="false" --recover="reconnect" --recovery_timeout="15mins" --registration_backoff_factor="10ms"
--resources="cpus:2;gpus:0;mem:1024;disk:1024;ports:[31000-32000]" --revocable_cpu_low_priority="true"
--runtime_dir="/tmp/Endpoint_SlaveEndpointTest_UnauthorizedRequest_0_V2Mo6f" --sandbox_directory="/mnt/mesos/sandbox"
--strict="true" --switch_user="true" --systemd_enable_support="true" --systemd_runtime_directory="/run/systemd/system"
--version="false" --work_dir="/tmp/Endpoint_SlaveEndpointTest_UnauthorizedRequest_0_GThLLQ"
--zk_session_timeout="10secs"
I1106 06:26:52.322263 19783 credentials.hpp:86] Loading credential for authentication from
'/tmp/Endpoint_SlaveEndpointTest_UnauthorizedRequest_0_V2Mo6f/credential'
I1106 06:26:52.322551 19783 slave.cpp:287] Agent using credential for: test-principal
I1106 06:26:52.322574 19783 credentials.hpp:37] Loading credentials for authentication from
'/tmp/Endpoint_SlaveEndpointTest_UnauthorizedRequest_0_V2Mo6f/http_credentials'
I1106 06:26:52.323045 19783 http.cpp:1045] Creating default 'basic' HTTP authenticator for
realm 'mesos-agent-executor'
I1106 06:26:52.323245 19783 http.cpp:1066] Creating default 'jwt' HTTP authenticator for realm
'mesos-agent-executor'
I1106 06:26:52.323537 19783 http.cpp:1045] Creating default 'basic' HTTP authenticator for
realm 'mesos-agent-readonly'
I1106 06:26:52.323712 19783 http.cpp:1066] Creating default 'jwt' HTTP authenticator for realm
'mesos-agent-readonly'
I1106 06:26:52.324007 19783 http.cpp:1045] Creating default 'basic' HTTP authenticator for
realm 'mesos-agent-readwrite'
I1106 06:26:52.324157 19783 http.cpp:1066] Creating default 'jwt' HTTP authenticator for realm
'mesos-agent-readwrite'
I1106 06:26:52.326727 19783 slave.cpp:585] Agent resources: [{"name":"cpus","scalar":{"value":2.0},"type":"SCALAR"},{"name":"mem","scalar":{"value":1024.0},"type":"SCALAR"},{"name":"disk","scalar":{"value":1024.0},"type":"SCALAR"},{"name":"ports","ranges":{"range":[{"begin":31000,"end":32000}]},"type":"RANGES"}]
I1106 06:26:52.327163 19783 slave.cpp:593] Agent attributes: [  ]
I1106 06:26:52.327190 19783 slave.cpp:602] Agent hostname: 39e987b9a3e1
I1106 06:26:52.327354 19767 status_update_manager.cpp:177] Pausing sending status updates
I1106 06:26:52.329872 19769 state.cpp:64] Recovering state from '/tmp/Endpoint_SlaveEndpointTest_UnauthorizedRequest_0_GThLLQ/meta'
I1106 06:26:52.330238 19769 status_update_manager.cpp:203] Recovering status update manager
I1106 06:26:52.330523 19768 containerizer.cpp:662] Recovering containerizer
I1106 06:26:52.332051 19775 provisioner.cpp:416] Provisioner recovery complete
I1106 06:26:52.332446 19779 slave.cpp:6333] Finished recovery
I1106 06:26:52.335543 19773 process.cpp:3938] Handling HTTP event for process 'slave(828)'
with path: '/slave(828)/monitor/statistics'
I1106 06:26:52.337895 19771 http.cpp:1185] HTTP GET for /slave(828)/monitor/statistics from
172.17.0.2:46682
I1106 06:26:52.338063 19771 http.cpp:976] Authorizing principal 'test-principal' to GET the
'/monitor/statistics' endpoint
I1106 06:26:52.341329 19764 slave.cpp:875] Agent terminating
[       OK ] Endpoint/SlaveEndpointTest.UnauthorizedRequest/0 (44 ms)
[ RUN      ] Endpoint/SlaveEndpointTest.UnauthorizedRequest/1
I1106 06:26:52.358469  9659 containerizer.cpp:301] Using isolation { environment_secret, posix/cpu,
posix/mem, filesystem/posix, network/cni }
W1106 06:26:52.359253  9659 backend.cpp:76] Failed to create 'aufs' backend: AufsBackend requires
root privileges
W1106 06:26:52.359457  9659 backend.cpp:76] Failed to create 'bind' backend: BindBackend requires
root privileges
I1106 06:26:52.359514  9659 provisioner.cpp:255] Using default backend 'copy'
I1106 06:26:52.364486 19785 slave.cpp:254] Mesos agent started on (829)@172.17.0.2:34812
I1106 06:26:52.364517 19785 slave.cpp:255] Flags at startup: --acls="" --appc_simple_discovery_uri_prefix="http://"
--appc_store_dir="/tmp/Endpoint_SlaveEndpointTest_UnauthorizedRequest_1_nHVHNT/store/appc"
--authenticate_http_executors="true" --authenticate_http_readonly="true" --authenticate_http_readwrite="true"
--authenticatee="crammd5" --authentication_backoff_factor="1secs" --authorizer="local" --cgroups_cpu_enable_pids_and_tids_count="false"
--cgroups_enable_cfs="false" --cgroups_hierarchy="/sys/fs/cgroup" --cgroups_limit_swap="false"
--cgroups_root="mesos" --container_disk_watch_interval="15secs" --containerizers="mesos" --credential="/tmp/Endpoint_SlaveEndpointTest_UnauthorizedRequest_1_nHVHNT/credential"
--default_role="*" --disallow_sharing_agent_pid_namespace="false" --disk_watch_interval="1mins"
--docker="docker" --docker_kill_orphans="true" --docker_registry="https://registry-1.docker.io"
--docker_remove_delay="6hrs" --docker_socket="/var/run/docker.sock" --docker_stop_timeout="0ns"
--docker_store_dir="/tmp/Endpoint_SlaveEndpointTest_UnauthorizedRequest_1_nHVHNT/store/docker"
--docker_volume_checkpoint_dir="/var/run/mesos/isolators/docker/volume" --enforce_container_disk_quota="false"
--executor_registration_timeout="1mins" --executor_reregistration_timeout="2secs" --executor_secret_key="/tmp/Endpoint_SlaveEndpointTest_UnauthorizedRequest_1_nHVHNT/executor_secret_key"
--executor_shutdown_grace_period="5secs" --fetcher_cache_dir="/tmp/Endpoint_SlaveEndpointTest_UnauthorizedRequest_1_nHVHNT/fetch"
--fetcher_cache_size="2GB" --frameworks_home="" --gc_delay="1weeks" --gc_disk_headroom="0.1"
--hadoop_home="" --help="false" --hostname_lookup="true" --http_command_executor="false" --http_credentials="/tmp/Endpoint_SlaveEndpointTest_UnauthorizedRequest_1_nHVHNT/http_credentials"
--http_heartbeat_interval="30secs" --initialize_driver_logging="true" --isolation="posix/cpu,posix/mem"
--launcher="posix" --launcher_dir="/mesos/mesos-1.5.0/_build/src" --logbufsecs="0" --logging_level="INFO"
--max_completed_executors_per_framework="150" --oversubscribed_resources_interval="15secs"
--perf_duration="10secs" --perf_interval="1mins" --port="5051" --qos_correction_interval_min="0ns"
--quiet="false" --recover="reconnect" --recovery_timeout="15mins" --registration_backoff_factor="10ms"
--resources="cpus:2;gpus:0;mem:1024;disk:1024;ports:[31000-32000]" --revocable_cpu_low_priority="true"
--runtime_dir="/tmp/Endpoint_SlaveEndpointTest_UnauthorizedRequest_1_nHVHNT" --sandbox_directory="/mnt/mesos/sandbox"
--strict="true" --switch_user="true" --systemd_enable_support="true" --systemd_runtime_directory="/run/systemd/system"
--version="false" --work_dir="/tmp/Endpoint_SlaveEndpointTest_UnauthorizedRequest_1_6xZrmu"
--zk_session_timeout="10secs"
I1106 06:26:52.364929 19785 credentials.hpp:86] Loading credential for authentication from
'/tmp/Endpoint_SlaveEndpointTest_UnauthorizedRequest_1_nHVHNT/credential'
I1106 06:26:52.365085 19785 slave.cpp:287] Agent using credential for: test-principal
I1106 06:26:52.365109 19785 credentials.hpp:37] Loading credentials for authentication from
'/tmp/Endpoint_SlaveEndpointTest_UnauthorizedRequest_1_nHVHNT/http_credentials'
I1106 06:26:52.365442 19785 http.cpp:1045] Creating default 'basic' HTTP authenticator for
realm 'mesos-agent-executor'
I1106 06:26:52.365561 19785 http.cpp:1066] Creating default 'jwt' HTTP authenticator for realm
'mesos-agent-executor'
I1106 06:26:52.365787 19785 http.cpp:1045] Creating default 'basic' HTTP authenticator for
realm 'mesos-agent-readonly'
I1106 06:26:52.365902 19785 http.cpp:1066] Creating default 'jwt' HTTP authenticator for realm
'mesos-agent-readonly'
I1106 06:26:52.366168 19785 http.cpp:1045] Creating default 'basic' HTTP authenticator for
realm 'mesos-agent-readwrite'
I1106 06:26:52.366287 19785 http.cpp:1066] Creating default 'jwt' HTTP authenticator for realm
'mesos-agent-readwrite'
I1106 06:26:52.367820 19785 slave.cpp:585] Agent resources: [{"name":"cpus","scalar":{"value":2.0},"type":"SCALAR"},{"name":"mem","scalar":{"value":1024.0},"type":"SCALAR"},{"name":"disk","scalar":{"value":1024.0},"type":"SCALAR"},{"name":"ports","ranges":{"range":[{"begin":31000,"end":32000}]},"type":"RANGES"}]
I1106 06:26:52.368062 19785 slave.cpp:593] Agent attributes: [  ]
I1106 06:26:52.368077 19785 slave.cpp:602] Agent hostname: 39e987b9a3e1
I1106 06:26:52.368227 19782 status_update_manager.cpp:177] Pausing sending status updates
I1106 06:26:52.370199 19778 state.cpp:64] Recovering state from '/tmp/Endpoint_SlaveEndpointTest_UnauthorizedRequest_1_6xZrmu/meta'
I1106 06:26:52.370471 19778 status_update_manager.cpp:203] Recovering status update manager
I1106 06:26:52.370673 19765 containerizer.cpp:662] Recovering containerizer
I1106 06:26:52.372388 19776 provisioner.cpp:416] Provisioner recovery complete
I1106 06:26:52.372922 19782 slave.cpp:6333] Finished recovery
I1106 06:26:52.376377 19764 process.cpp:3938] Handling HTTP event for process 'slave(829)'
with path: '/slave(829)/monitor/statistics.json'
I1106 06:26:52.378727 19776 http.cpp:1185] HTTP GET for /slave(829)/monitor/statistics.json
from 172.17.0.2:46685
I1106 06:26:52.378834 19776 http.cpp:976] Authorizing principal 'test-principal' to GET the
'/monitor/statistics.json' endpoint
I1106 06:26:52.382074  9659 slave.cpp:875] Agent terminating
[       OK ] Endpoint/SlaveEndpointTest.UnauthorizedRequest/1 (39 ms)
[ RUN      ] Endpoint/SlaveEndpointTest.UnauthorizedRequest/2
I1106 06:26:52.398352  9659 containerizer.cpp:301] Using isolation { environment_secret, posix/cpu,
posix/mem, filesystem/posix, network/cni }
W1106 06:26:52.399102  9659 backend.cpp:76] Failed to create 'aufs' backend: AufsBackend requires
root privileges
W1106 06:26:52.399299  9659 backend.cpp:76] Failed to create 'bind' backend: BindBackend requires
root privileges
I1106 06:26:52.399364  9659 provisioner.cpp:255] Using default backend 'copy'
I1106 06:26:52.404359 19780 slave.cpp:254] Mesos agent started on (830)@172.17.0.2:34812
I1106 06:26:52.404382 19780 slave.cpp:255] Flags at startup: --acls="" --appc_simple_discovery_uri_prefix="http://"
--appc_store_dir="/tmp/Endpoint_SlaveEndpointTest_UnauthorizedRequest_2_iQJNMw/store/appc"
--authenticate_http_executors="true" --authenticate_http_readonly="true" --authenticate_http_readwrite="true"
--authenticatee="crammd5" --authentication_backoff_factor="1secs" --authorizer="local" --cgroups_cpu_enable_pids_and_tids_count="false"
--cgroups_enable_cfs="false" --cgroups_hierarchy="/sys/fs/cgroup" --cgroups_limit_swap="false"
--cgroups_root="mesos" --container_disk_watch_interval="15secs" --containerizers="mesos" --credential="/tmp/Endpoint_SlaveEndpointTest_UnauthorizedRequest_2_iQJNMw/credential"
--default_role="*" --disallow_sharing_agent_pid_namespace="false" --disk_watch_interval="1mins"
--docker="docker" --docker_kill_orphans="true" --docker_registry="https://registry-1.docker.io"
--docker_remove_delay="6hrs" --docker_socket="/var/run/docker.sock" --docker_stop_timeout="0ns"
--docker_store_dir="/tmp/Endpoint_SlaveEndpointTest_UnauthorizedRequest_2_iQJNMw/store/docker"
--docker_volume_checkpoint_dir="/var/run/mesos/isolators/docker/volume" --enforce_container_disk_quota="false"
--executor_registration_timeout="1mins" --executor_reregistration_timeout="2secs" --executor_secret_key="/tmp/Endpoint_SlaveEndpointTest_UnauthorizedRequest_2_iQJNMw/executor_secret_key"
--executor_shutdown_grace_period="5secs" --fetcher_cache_dir="/tmp/Endpoint_SlaveEndpointTest_UnauthorizedRequest_2_iQJNMw/fetch"
--fetcher_cache_size="2GB" --frameworks_home="" --gc_delay="1weeks" --gc_disk_headroom="0.1"
--hadoop_home="" --help="false" --hostname_lookup="true" --http_command_executor="false" --http_credentials="/tmp/Endpoint_SlaveEndpointTest_UnauthorizedRequest_2_iQJNMw/http_credentials"
--http_heartbeat_interval="30secs" --initialize_driver_logging="true" --isolation="posix/cpu,posix/mem"
--launcher="posix" --launcher_dir="/mesos/mesos-1.5.0/_build/src" --logbufsecs="0" --logging_level="INFO"
--max_completed_executors_per_framework="150" --oversubscribed_resources_interval="15secs"
--perf_duration="10secs" --perf_interval="1mins" --port="5051" --qos_correction_interval_min="0ns"
--quiet="false" --recover="reconnect" --recovery_timeout="15mins" --registration_backoff_factor="10ms"
--resources="cpus:2;gpus:0;mem:1024;disk:1024;ports:[31000-32000]" --revocable_cpu_low_priority="true"
--runtime_dir="/tmp/Endpoint_SlaveEndpointTest_UnauthorizedRequest_2_iQJNMw" --sandbox_directory="/mnt/mesos/sandbox"
--strict="true" --switch_user="true" --systemd_enable_support="true" --systemd_runtime_directory="/run/systemd/system"
--version="false" --work_dir="/tmp/Endpoint_SlaveEndpointTest_UnauthorizedRequest_2_N7NJl8"
--zk_session_timeout="10secs"
I1106 06:26:52.404857 19780 credentials.hpp:86] Loading credential for authentication from
'/tmp/Endpoint_SlaveEndpointTest_UnauthorizedRequest_2_iQJNMw/credential'
I1106 06:26:52.405045 19780 slave.cpp:287] Agent using credential for: test-principal
I1106 06:26:52.405068 19780 credentials.hpp:37] Loading credentials for authentication from
'/tmp/Endpoint_SlaveEndpointTest_UnauthorizedRequest_2_iQJNMw/http_credentials'
I1106 06:26:52.405429 19780 http.cpp:1045] Creating default 'basic' HTTP authenticator for
realm 'mesos-agent-executor'
I1106 06:26:52.405586 19780 http.cpp:1066] Creating default 'jwt' HTTP authenticator for realm
'mesos-agent-executor'
I1106 06:26:52.405838 19780 http.cpp:1045] Creating default 'basic' HTTP authenticator for
realm 'mesos-agent-readonly'
I1106 06:26:52.405964 19780 http.cpp:1066] Creating default 'jwt' HTTP authenticator for realm
'mesos-agent-readonly'
I1106 06:26:52.406196 19780 http.cpp:1045] Creating default 'basic' HTTP authenticator for
realm 'mesos-agent-readwrite'
I1106 06:26:52.406312 19780 http.cpp:1066] Creating default 'jwt' HTTP authenticator for realm
'mesos-agent-readwrite'
I1106 06:26:52.407862 19780 slave.cpp:585] Agent resources: [{"name":"cpus","scalar":{"value":2.0},"type":"SCALAR"},{"name":"mem","scalar":{"value":1024.0},"type":"SCALAR"},{"name":"disk","scalar":{"value":1024.0},"type":"SCALAR"},{"name":"ports","ranges":{"range":[{"begin":31000,"end":32000}]},"type":"RANGES"}]
I1106 06:26:52.408143 19780 slave.cpp:593] Agent attributes: [  ]
I1106 06:26:52.408159 19780 slave.cpp:602] Agent hostname: 39e987b9a3e1
I1106 06:26:52.408318 19766 status_update_manager.cpp:177] Pausing sending status updates
I1106 06:26:52.409948 19776 state.cpp:64] Recovering state from '/tmp/Endpoint_SlaveEndpointTest_UnauthorizedRequest_2_N7NJl8/meta'
I1106 06:26:52.410370 19769 status_update_manager.cpp:203] Recovering status update manager
I1106 06:26:52.410611 19770 containerizer.cpp:662] Recovering containerizer
I1106 06:26:52.412185 19773 provisioner.cpp:416] Provisioner recovery complete
I1106 06:26:52.412516 19766 slave.cpp:6333] Finished recovery
I1106 06:26:52.415458 19783 process.cpp:3938] Handling HTTP event for process 'slave(830)'
with path: '/slave(830)/containers'
I1106 06:26:52.417686 19767 http.cpp:1185] HTTP GET for /slave(830)/containers from 172.17.0.2:46686
I1106 06:26:52.417825 19767 http.cpp:976] Authorizing principal 'test-principal' to GET the
'/containers' endpoint
I1106 06:26:52.420717  9659 slave.cpp:875] Agent terminating
[       OK ] Endpoint/SlaveEndpointTest.UnauthorizedRequest/2 (37 ms)
[ RUN      ] Endpoint/SlaveEndpointTest.NoAuthorizer/0
I1106 06:26:52.433439  9659 containerizer.cpp:301] Using isolation { environment_secret, posix/cpu,
posix/mem, filesystem/posix, network/cni }
W1106 06:26:52.433957  9659 backend.cpp:76] Failed to create 'aufs' backend: AufsBackend requires
root privileges
W1106 06:26:52.434073  9659 backend.cpp:76] Failed to create 'bind' backend: BindBackend requires
root privileges
I1106 06:26:52.434105  9659 provisioner.cpp:255] Using default backend 'copy'
I1106 06:26:52.435806  9659 cluster.cpp:448] Creating default 'local' authorizer
I1106 06:26:52.438098 19774 slave.cpp:254] Mesos agent started on (831)@172.17.0.2:34812
I1106 06:26:52.438128 19774 slave.cpp:255] Flags at startup: --acls="" --appc_simple_discovery_uri_prefix="http://"
--appc_store_dir="/tmp/Endpoint_SlaveEndpointTest_NoAuthorizer_0_8PWteb/store/appc" --authenticate_http_executors="true"
--authenticate_http_readonly="true" --authenticate_http_readwrite="true" --authenticatee="crammd5"
--authentication_backoff_factor="1secs" --authorizer="local" --cgroups_cpu_enable_pids_and_tids_count="false"
--cgroups_enable_cfs="false" --cgroups_hierarchy="/sys/fs/cgroup" --cgroups_limit_swap="false"
--cgroups_root="mesos" --container_disk_watch_interval="15secs" --containerizers="mesos" --credential="/tmp/Endpoint_SlaveEndpointTest_NoAuthorizer_0_8PWteb/credential"
--default_role="*" --disallow_sharing_agent_pid_namespace="false" --disk_watch_interval="1mins"
--docker="docker" --docker_kill_orphans="true" --docker_registry="https://registry-1.docker.io"
--docker_remove_delay="6hrs" --docker_socket="/var/run/docker.sock" --docker_stop_timeout="0ns"
--docker_store_dir="/tmp/Endpoint_SlaveEndpointTest_NoAuthorizer_0_8PWteb/store/docker" --docker_volume_checkpoint_dir="/var/run/mesos/isolators/docker/volume"
--enforce_container_disk_quota="false" --executor_registration_timeout="1mins" --executor_reregistration_timeout="2secs"
--executor_secret_key="/tmp/Endpoint_SlaveEndpointTest_NoAuthorizer_0_8PWteb/executor_secret_key"
--executor_shutdown_grace_period="5secs" --fetcher_cache_dir="/tmp/Endpoint_SlaveEndpointTest_NoAuthorizer_0_8PWteb/fetch"
--fetcher_cache_size="2GB" --frameworks_home="" --gc_delay="1weeks" --gc_disk_headroom="0.1"
--hadoop_home="" --help="false" --hostname_lookup="true" --http_command_executor="false" --http_credentials="/tmp/Endpoint_SlaveEndpointTest_NoAuthorizer_0_8PWteb/http_credentials"
--http_heartbeat_interval="30secs" --initialize_driver_logging="true" --isolation="posix/cpu,posix/mem"
--launcher="posix" --launcher_dir="/mesos/mesos-1.5.0/_build/src" --logbufsecs="0" --logging_level="INFO"
--max_completed_executors_per_framework="150" --oversubscribed_resources_interval="15secs"
--perf_duration="10secs" --perf_interval="1mins" --port="5051" --qos_correction_interval_min="0ns"
--quiet="false" --recover="reconnect" --recovery_timeout="15mins" --registration_backoff_factor="10ms"
--resources="cpus:2;gpus:0;mem:1024;disk:1024;ports:[31000-32000]" --revocable_cpu_low_priority="true"
--runtime_dir="/tmp/Endpoint_SlaveEndpointTest_NoAuthorizer_0_8PWteb" --sandbox_directory="/mnt/mesos/sandbox"
--strict="true" --switch_user="true" --systemd_enable_support="true" --systemd_runtime_directory="/run/systemd/system"
--version="false" --work_dir="/tmp/Endpoint_SlaveEndpointTest_NoAuthorizer_0_FKYOBL" --zk_session_timeout="10secs"
I1106 06:26:52.438498 19774 credentials.hpp:86] Loading credential for authentication from
'/tmp/Endpoint_SlaveEndpointTest_NoAuthorizer_0_8PWteb/credential'
I1106 06:26:52.438645 19774 slave.cpp:287] Agent using credential for: test-principal
I1106 06:26:52.438668 19774 credentials.hpp:37] Loading credentials for authentication from
'/tmp/Endpoint_SlaveEndpointTest_NoAuthorizer_0_8PWteb/http_credentials'
I1106 06:26:52.438940 19774 http.cpp:1045] Creating default 'basic' HTTP authenticator for
realm 'mesos-agent-executor'
I1106 06:26:52.439056 19774 http.cpp:1066] Creating default 'jwt' HTTP authenticator for realm
'mesos-agent-executor'
I1106 06:26:52.439255 19774 http.cpp:1045] Creating default 'basic' HTTP authenticator for
realm 'mesos-agent-readonly'
I1106 06:26:52.439357 19774 http.cpp:1066] Creating default 'jwt' HTTP authenticator for realm
'mesos-agent-readonly'
I1106 06:26:52.439539 19774 http.cpp:1045] Creating default 'basic' HTTP authenticator for
realm 'mesos-agent-readwrite'
I1106 06:26:52.439640 19774 http.cpp:1066] Creating default 'jwt' HTTP authenticator for realm
'mesos-agent-readwrite'
I1106 06:26:52.441061 19774 slave.cpp:585] Agent resources: [{"name":"cpus","scalar":{"value":2.0},"type":"SCALAR"},{"name":"mem","scalar":{"value":1024.0},"type":"SCALAR"},{"name":"disk","scalar":{"value":1024.0},"type":"SCALAR"},{"name":"ports","ranges":{"range":[{"begin":31000,"end":32000}]},"type":"RANGES"}]
I1106 06:26:52.441296 19774 slave.cpp:593] Agent attributes: [  ]
I1106 06:26:52.441310 19774 slave.cpp:602] Agent hostname: 39e987b9a3e1
I1106 06:26:52.441435 19782 status_update_manager.cpp:177] Pausing sending status updates
I1106 06:26:52.442875 19776 state.cpp:64] Recovering state from '/tmp/Endpoint_SlaveEndpointTest_NoAuthorizer_0_FKYOBL/meta'
I1106 06:26:52.443181 19776 status_update_manager.cpp:203] Recovering status update manager
I1106 06:26:52.443401 19779 containerizer.cpp:662] Recovering containerizer
I1106 06:26:52.444639 19777 provisioner.cpp:416] Provisioner recovery complete
I1106 06:26:52.444950 19764 slave.cpp:6333] Finished recovery
I1106 06:26:52.447744 19768 process.cpp:3938] Handling HTTP event for process 'slave(831)'
with path: '/slave(831)/monitor/statistics'
I1106 06:26:52.450067 19769 http.cpp:1185] HTTP GET for /slave(831)/monitor/statistics from
172.17.0.2:46688
I1106 06:26:52.450206 19769 http.cpp:976] Authorizing principal 'test-principal' to GET the
'/monitor/statistics' endpoint
I1106 06:26:52.454071  9659 slave.cpp:875] Agent terminating
[       OK ] Endpoint/SlaveEndpointTest.NoAuthorizer/0 (33 ms)
[ RUN      ] Endpoint/SlaveEndpointTest.NoAuthorizer/1
I1106 06:26:52.467533  9659 containerizer.cpp:301] Using isolation { environment_secret, posix/cpu,
posix/mem, filesystem/posix, network/cni }
W1106 06:26:52.468065  9659 backend.cpp:76] Failed to create 'aufs' backend: AufsBackend requires
root privileges
W1106 06:26:52.468188  9659 backend.cpp:76] Failed to create 'bind' backend: BindBackend requires
root privileges
I1106 06:26:52.468225  9659 provisioner.cpp:255] Using default backend 'copy'
I1106 06:26:52.470041  9659 cluster.cpp:448] Creating default 'local' authorizer
I1106 06:26:52.472410 19763 slave.cpp:254] Mesos agent started on (832)@172.17.0.2:34812
I1106 06:26:52.472436 19763 slave.cpp:255] Flags at startup: --acls="" --appc_simple_discovery_uri_prefix="http://"
--appc_store_dir="/tmp/Endpoint_SlaveEndpointTest_NoAuthorizer_1_uVr0ZP/store/appc" --authenticate_http_executors="true"
--authenticate_http_readonly="true" --authenticate_http_readwrite="true" --authenticatee="crammd5"
--authentication_backoff_factor="1secs" --authorizer="local" --cgroups_cpu_enable_pids_and_tids_count="false"
--cgroups_enable_cfs="false" --cgroups_hierarchy="/sys/fs/cgroup" --cgroups_limit_swap="false"
--cgroups_root="mesos" --container_disk_watch_interval="15secs" --containerizers="mesos" --credential="/tmp/Endpoint_SlaveEndpointTest_NoAuthorizer_1_uVr0ZP/credential"
--default_role="*" --disallow_sharing_agent_pid_namespace="false" --disk_watch_interval="1mins"
--docker="docker" --docker_kill_orphans="true" --docker_registry="https://registry-1.docker.io"
--docker_remove_delay="6hrs" --docker_socket="/var/run/docker.sock" --docker_stop_timeout="0ns"
--docker_store_dir="/tmp/Endpoint_SlaveEndpointTest_NoAuthorizer_1_uVr0ZP/store/docker" --docker_volume_checkpoint_dir="/var/run/mesos/isolators/docker/volume"
--enforce_container_disk_quota="false" --executor_registration_timeout="1mins" --executor_reregistration_timeout="2secs"
--executor_secret_key="/tmp/Endpoint_SlaveEndpointTest_NoAuthorizer_1_uVr0ZP/executor_secret_key"
--executor_shutdown_grace_period="5secs" --fetcher_cache_dir="/tmp/Endpoint_SlaveEndpointTest_NoAuthorizer_1_uVr0ZP/fetch"
--fetcher_cache_size="2GB" --frameworks_home="" --gc_delay="1weeks" --gc_disk_headroom="0.1"
--hadoop_home="" --help="false" --hostname_lookup="true" --http_command_executor="false" --http_credentials="/tmp/Endpoint_SlaveEndpointTest_NoAuthorizer_1_uVr0ZP/http_credentials"
--http_heartbeat_interval="30secs" --initialize_driver_logging="true" --isolation="posix/cpu,posix/mem"
--launcher="posix" --launcher_dir="/mesos/mesos-1.5.0/_build/src" --logbufsecs="0" --logging_level="INFO"
--max_completed_executors_per_framework="150" --oversubscribed_resources_interval="15secs"
--perf_duration="10secs" --perf_interval="1mins" --port="5051" --qos_correction_interval_min="0ns"
--quiet="false" --recover="reconnect" --recovery_timeout="15mins" --registration_backoff_factor="10ms"
--resources="cpus:2;gpus:0;mem:1024;disk:1024;ports:[31000-32000]" --revocable_cpu_low_priority="true"
--runtime_dir="/tmp/Endpoint_SlaveEndpointTest_NoAuthorizer_1_uVr0ZP" --sandbox_directory="/mnt/mesos/sandbox"
--strict="true" --switch_user="true" --systemd_enable_support="true" --systemd_runtime_directory="/run/systemd/system"
--version="false" --work_dir="/tmp/Endpoint_SlaveEndpointTest_NoAuthorizer_1_xLlkiq" --zk_session_timeout="10secs"
I1106 06:26:52.472905 19763 credentials.hpp:86] Loading credential for authentication from
'/tmp/Endpoint_SlaveEndpointTest_NoAuthorizer_1_uVr0ZP/credential'
I1106 06:26:52.473109 19763 slave.cpp:287] Agent using credential for: test-principal
I1106 06:26:52.473141 19763 credentials.hpp:37] Loading credentials for authentication from
'/tmp/Endpoint_SlaveEndpointTest_NoAuthorizer_1_uVr0ZP/http_credentials'
I1106 06:26:52.473569 19763 http.cpp:1045] Creating default 'basic' HTTP authenticator for
realm 'mesos-agent-executor'
I1106 06:26:52.473784 19763 http.cpp:1066] Creating default 'jwt' HTTP authenticator for realm
'mesos-agent-executor'
I1106 06:26:52.474102 19763 http.cpp:1045] Creating default 'basic' HTTP authenticator for
realm 'mesos-agent-readonly'
I1106 06:26:52.474212 19763 http.cpp:1066] Creating default 'jwt' HTTP authenticator for realm
'mesos-agent-readonly'
I1106 06:26:52.474429 19763 http.cpp:1045] Creating default 'basic' HTTP authenticator for
realm 'mesos-agent-readwrite'
I1106 06:26:52.474546 19763 http.cpp:1066] Creating default 'jwt' HTTP authenticator for realm
'mesos-agent-readwrite'
I1106 06:26:52.476128 19763 slave.cpp:585] Agent resources: [{"name":"cpus","scalar":{"value":2.0},"type":"SCALAR"},{"name":"mem","scalar":{"value":1024.0},"type":"SCALAR"},{"name":"disk","scalar":{"value":1024.0},"type":"SCALAR"},{"name":"ports","ranges":{"range":[{"begin":31000,"end":32000}]},"type":"RANGES"}]
I1106 06:26:52.476378 19763 slave.cpp:593] Agent attributes: [  ]
I1106 06:26:52.476397 19763 slave.cpp:602] Agent hostname: 39e987b9a3e1
I1106 06:26:52.476613 19779 status_update_manager.cpp:177] Pausing sending status updates
I1106 06:26:52.478348 19770 state.cpp:64] Recovering state from '/tmp/Endpoint_SlaveEndpointTest_NoAuthorizer_1_xLlkiq/meta'
I1106 06:26:52.478766 19770 status_update_manager.cpp:203] Recovering status update manager
I1106 06:26:52.479089 19768 containerizer.cpp:662] Recovering containerizer
I1106 06:26:52.480789 19783 provisioner.cpp:416] Provisioner recovery complete
I1106 06:26:52.481245 19779 slave.cpp:6333] Finished recovery
I1106 06:26:52.484601 19772 process.cpp:3938] Handling HTTP event for process 'slave(832)'
with path: '/slave(832)/monitor/statistics.json'
I1106 06:26:52.486820 19765 http.cpp:1185] HTTP GET for /slave(832)/monitor/statistics.json
from 172.17.0.2:46690
I1106 06:26:52.486904 19765 http.cpp:976] Authorizing principal 'test-principal' to GET the
'/monitor/statistics.json' endpoint
I1106 06:26:52.490588 19770 slave.cpp:875] Agent terminating
[       OK ] Endpoint/SlaveEndpointTest.NoAuthorizer/1 (37 ms)
[ RUN      ] Endpoint/SlaveEndpointTest.NoAuthorizer/2
I1106 06:26:52.504042  9659 containerizer.cpp:301] Using isolation { environment_secret, posix/cpu,
posix/mem, filesystem/posix, network/cni }
W1106 06:26:52.504519  9659 backend.cpp:76] Failed to create 'aufs' backend: AufsBackend requires
root privileges
W1106 06:26:52.504626  9659 backend.cpp:76] Failed to create 'bind' backend: BindBackend requires
root privileges
I1106 06:26:52.504658  9659 provisioner.cpp:255] Using default backend 'copy'
I1106 06:26:52.506290  9659 cluster.cpp:448] Creating default 'local' authorizer
I1106 06:26:52.508414 19779 slave.cpp:254] Mesos agent started on (833)@172.17.0.2:34812
I1106 06:26:52.508447 19779 slave.cpp:255] Flags at startup: --acls="" --appc_simple_discovery_uri_prefix="http://"
--appc_store_dir="/tmp/Endpoint_SlaveEndpointTest_NoAuthorizer_2_01pu7u/store/appc" --authenticate_http_executors="true"
--authenticate_http_readonly="true" --authenticate_http_readwrite="true" --authenticatee="crammd5"
--authentication_backoff_factor="1secs" --authorizer="local" --cgroups_cpu_enable_pids_and_tids_count="false"
--cgroups_enable_cfs="false" --cgroups_hierarchy="/sys/fs/cgroup" --cgroups_limit_swap="false"
--cgroups_root="mesos" --container_disk_watch_interval="15secs" --containerizers="mesos" --credential="/tmp/Endpoint_SlaveEndpointTest_NoAuthorizer_2_01pu7u/credential"
--default_role="*" --disallow_sharing_agent_pid_namespace="false" --disk_watch_interval="1mins"
--docker="docker" --docker_kill_orphans="true" --docker_registry="https://registry-1.docker.io"
--docker_remove_delay="6hrs" --docker_socket="/var/run/docker.sock" --docker_stop_timeout="0ns"
--docker_store_dir="/tmp/Endpoint_SlaveEndpointTest_NoAuthorizer_2_01pu7u/store/docker" --docker_volume_checkpoint_dir="/var/run/mesos/isolators/docker/volume"
--enforce_container_disk_quota="false" --executor_registration_timeout="1mins" --executor_reregistration_timeout="2secs"
--executor_secret_key="/tmp/Endpoint_SlaveEndpointTest_NoAuthorizer_2_01pu7u/executor_secret_key"
--executor_shutdown_grace_period="5secs" --fetcher_cache_dir="/tmp/Endpoint_SlaveEndpointTest_NoAuthorizer_2_01pu7u/fetch"
--fetcher_cache_size="2GB" --frameworks_home="" --gc_delay="1weeks" --gc_disk_headroom="0.1"
--hadoop_home="" --help="false" --hostname_lookup="true" --http_command_executor="false" --http_credentials="/tmp/Endpoint_SlaveEndpointTest_NoAuthorizer_2_01pu7u/http_credentials"
--http_heartbeat_interval="30secs" --initialize_driver_logging="true" --isolation="posix/cpu,posix/mem"
--launcher="posix" --launcher_dir="/mesos/mesos-1.5.0/_build/src" --logbufsecs="0" --logging_level="INFO"
--max_completed_executors_per_framework="150" --oversubscribed_resources_interval="15secs"
--perf_duration="10secs" --perf_interval="1mins" --port="5051" --qos_correction_interval_min="0ns"
--quiet="false" --recover="reconnect" --recovery_timeout="15mins" --registration_backoff_factor="10ms"
--resources="cpus:2;gpus:0;mem:1024;disk:1024;ports:[31000-32000]" --revocable_cpu_low_priority="true"
--runtime_dir="/tmp/Endpoint_SlaveEndpointTest_NoAuthorizer_2_01pu7u" --sandbox_directory="/mnt/mesos/sandbox"
--strict="true" --switch_user="true" --systemd_enable_support="true" --systemd_runtime_directory="/run/systemd/system"
--version="false" --work_dir="/tmp/Endpoint_SlaveEndpointTest_NoAuthorizer_2_bCBjk5" --zk_session_timeout="10secs"
I1106 06:26:52.508828 19779 credentials.hpp:86] Loading credential for authentication from
'/tmp/Endpoint_SlaveEndpointTest_NoAuthorizer_2_01pu7u/credential'
I1106 06:26:52.508978 19779 slave.cpp:287] Agent using credential for: test-principal
I1106 06:26:52.509001 19779 credentials.hpp:37] Loading credentials for authentication from
'/tmp/Endpoint_SlaveEndpointTest_NoAuthorizer_2_01pu7u/http_credentials'
I1106 06:26:52.509274 19779 http.cpp:1045] Creating default 'basic' HTTP authenticator for
realm 'mesos-agent-executor'
I1106 06:26:52.509392 19779 http.cpp:1066] Creating default 'jwt' HTTP authenticator for realm
'mesos-agent-executor'
I1106 06:26:52.509590 19779 http.cpp:1045] Creating default 'basic' HTTP authenticator for
realm 'mesos-agent-readonly'
I1106 06:26:52.509692 19779 http.cpp:1066] Creating default 'jwt' HTTP authenticator for realm
'mesos-agent-readonly'
I1106 06:26:52.509902 19779 http.cpp:1045] Creating default 'basic' HTTP authenticator for
realm 'mesos-agent-readwrite'
I1106 06:26:52.510030 19779 http.cpp:1066] Creating default 'jwt' HTTP authenticator for realm
'mesos-agent-readwrite'
I1106 06:26:52.511456 19779 slave.cpp:585] Agent resources: [{"name":"cpus","scalar":{"value":2.0},"type":"SCALAR"},{"name":"mem","scalar":{"value":1024.0},"type":"SCALAR"},{"name":"disk","scalar":{"value":1024.0},"type":"SCALAR"},{"name":"ports","ranges":{"range":[{"begin":31000,"end":32000}]},"type":"RANGES"}]
I1106 06:26:52.511687 19779 slave.cpp:593] Agent attributes: [  ]
I1106 06:26:52.511701 19779 slave.cpp:602] Agent hostname: 39e987b9a3e1
I1106 06:26:52.511909 19772 status_update_manager.cpp:177] Pausing sending status updates
I1106 06:26:52.513273 19765 state.cpp:64] Recovering state from '/tmp/Endpoint_SlaveEndpointTest_NoAuthorizer_2_bCBjk5/meta'
I1106 06:26:52.513728 19780 status_update_manager.cpp:203] Recovering status update manager
I1106 06:26:52.513969 19780 containerizer.cpp:662] Recovering containerizer
I1106 06:26:52.515938 19768 provisioner.cpp:416] Provisioner recovery complete
I1106 06:26:52.516440 19764 slave.cpp:6333] Finished recovery
I1106 06:26:52.519315 19782 process.cpp:3938] Handling HTTP event for process 'slave(833)'
with path: '/slave(833)/containers'
I1106 06:26:52.521370 19767 http.cpp:1185] HTTP GET for /slave(833)/containers from 172.17.0.2:46692
I1106 06:26:52.521457 19767 http.cpp:976] Authorizing principal 'test-principal' to GET the
'/containers' endpoint
I1106 06:26:52.525873  9659 slave.cpp:875] Agent terminating
[       OK ] Endpoint/SlaveEndpointTest.NoAuthorizer/2 (34 ms)
[----------] 9 tests from Endpoint/SlaveEndpointTest (351 ms total)

[----------] 2 tests from ContainerizerType/DefaultContainerDNSFlagTest
[ RUN      ] ContainerizerType/DefaultContainerDNSFlagTest.ValidateFlag/0
[       OK ] ContainerizerType/DefaultContainerDNSFlagTest.ValidateFlag/0 (10 ms)
[ RUN      ] ContainerizerType/DefaultContainerDNSFlagTest.ValidateFlag/1
[       OK ] ContainerizerType/DefaultContainerDNSFlagTest.ValidateFlag/1 (10 ms)
[----------] 2 tests from ContainerizerType/DefaultContainerDNSFlagTest (20 ms total)

[----------] Global test environment tear-down
[==========] 1711 tests from 188 test cases ran. (860265 ms total)
[  PASSED  ] 1709 tests.
[  FAILED  ] 2 tests, listed below:
[  FAILED  ] SlaveRecoveryTest/0.RecoverUnregisteredExecutor, where TypeParam = mesos::internal::slave::MesosContainerizer
[  FAILED  ] MesosContainerizer/DefaultExecutorTest.KillTaskGroupOnTaskFailure/0, where GetParam()
= "mesos"

 2 FAILED TESTS
  YOU HAVE 21 DISABLED TESTS

I1106 06:26:52.618743 19787 process.cpp:1067] Failed to accept socket: future discarded
make[4]: *** [check-local] Error 1
make[4]: Leaving directory `/mesos/mesos-1.5.0/_build/src'
make[3]: *** [check-am] Error 2
make[3]: Leaving directory `/mesos/mesos-1.5.0/_build/src'
make[2]: *** [check] Error 2
make[2]: Leaving directory `/mesos/mesos-1.5.0/_build/src'
make[1]: *** [check-recursive] Error 1
make[1]: Leaving directory `/mesos/mesos-1.5.0/_build'
make: *** [distcheck] Error 1
+ docker rmi mesos-1509946613-17884
Untagged: mesos-1509946613-17884:latest
Deleted: sha256:43ce949c398d95b6cfda2c76f418ec2e068ee3633dde73b4ac63e7c3829521cc
Deleted: sha256:fbbd5af823a60791368f290b33df5b6d32d362af9a2842ae32c65f970a583a4e
Deleted: sha256:fd6fce9d07f75e0784788a76c5aa13d70a2e8663d06d0498f337a53b3fc5e6c9
Deleted: sha256:cba45b265f3c4d88eb99e255a1374ea5029cad72c7c229300ad0fadb850d7c43
Deleted: sha256:8348f00591d883fcc7f9c9927457fc79048bd80bd7a77e290dbd3874ca2ca1cd
Deleted: sha256:9eaa11077d6136ba297b16aef8dc8d9b56e34584c5777794a47347bcb7cfd0df
Deleted: sha256:278ef6a1d3f82cc1725ce7097cb2e3936519a2831305982e62f4920a7f25cf5d
Deleted: sha256:db5b92f6615e8de2aacbced33903c1281c81188bf4e1180ed0d6807fbe1ba869
Deleted: sha256:95deef2e8f3600f5715cf788ba8a8d9210d82b9c5f2dbc78f07e4a1f0f25ee54
Deleted: sha256:a00cc9842259232ba90d633cfc0b3f453c9a7119eeefa5726ac276210f5849cd
Deleted: sha256:315c4fe27978026bde6b81d227c33ab08ff6a14caa80c1e1c97381bce7d425f7
Deleted: sha256:94111546da4a9da8af26b69248642db65bec34c036081355fbc157cc45dd4f91
Deleted: sha256:e512fa0481f1502cee3ad360d0e6b81ee25a55aa08505f5cb4463f52adbadd45
Deleted: sha256:e898e3fde9554560a66c219d46f6e8da20b7fe75745ce2d782decb66282966bf
Deleted: sha256:3463d705fb5e5f3621812180672dc2e05f6165383d186779f0a1cb1382d91bfc
Deleted: sha256:4243679cb51be662bbee841daeb5a6e51f3d6db7409c2f6def30edb6ee597242
Deleted: sha256:442b6a4eb02a3d25d4908e42ac295ea6601674c6948e812df26ce8b6d3d03f01
Deleted: sha256:fc6abc72373fc0780675c88a0c448b87e12b0c42ca6b7ac8214b29f0863dccf7
Deleted: sha256:82e957a89593eab8f0b0ad49a5ac9c1b83693869312625d8d9a5b35cef7f1388
Deleted: sha256:243fce7be3d64d7bcdec689ac170bbf3e6f938de855b3cdb0035dc707af335fe
Deleted: sha256:9aff1ad8b75c0f37e988df440626c9aac6306a80fd9511c469ac172485419098
Deleted: sha256:6f48a737f7de8e9017c295edb14ddefdb1eb07faa3cdbc3f1e4aafe85abbd629
Deleted: sha256:0b6666c01f388243bca17cd48cece8809ca6f0cdab5ab84e86b6a55c6bbeb84d
Deleted: sha256:246b1797ce6a9c488427c38e442e8bc0be4c5aab3abcfb3acf819e76413499cb
Deleted: sha256:d875d4ac79ea28c4077fbd0b098f04e5fbdf3911bf4df740fc562bc57ac82c4c
Deleted: sha256:5de4f3776e9f14c871bf3e0e4eca27c6e6187bf17d179ce40dacc1a1f3cceda3
Deleted: sha256:5407d4af2c183a5b7327ab76eb06412383ea8fb6666ed915ffe16a3b89cebdf5
Deleted: sha256:af8d821b6936342634a3a95c543778ff4a3e97cae21e1e7b497a278a0e4056f3
Deleted: sha256:11cc64681d4f35e7790960b6728b8c1d33f3fa3ccf87c547c3c0acec77e965e5
Build step 'Execute shell' marked build as failure


Mime
View raw message