mesos-builds mailing list archives

Site index · List index
Message view « Date » · « Thread »
Top « Date » · « Thread »
From Apache Jenkins Server <jenk...@builds.apache.org>
Subject Build failed in Jenkins: Mesos-Buildbot » cmake,clang,--verbose --disable-libtool-wrappers --enable-libevent --enable-ssl,GLOG_v=1 MESOS_VERBOSE=1,ubuntu:14.04,(ubuntu)&&(!ubuntu-us1)&&(!ubuntu-eu2)&&(!qnode3)&&(!H23) #4475
Date Mon, 20 Nov 2017 03:04:32 GMT
See <https://builds.apache.org/job/Mesos-Buildbot/BUILDTOOL=cmake,COMPILER=clang,CONFIGURATION=--verbose%20--disable-libtool-wrappers%20--enable-libevent%20--enable-ssl,ENVIRONMENT=GLOG_v=1%20MESOS_VERBOSE=1,OS=ubuntu%3A14.04,label_exp=(ubuntu)&&(!ubuntu-us1)&&(!ubuntu-eu2)&&(!qnode3)&&(!H23)/4475/display/redirect>

------------------------------------------
[...truncated 451.70 KB...]
Socket<inet::Address>::operator Try<Socket<T>>() const = delete;
                                                         ^
/mesos/3rdparty/libprocess/src/../include/process/socket.hpp:422:3: note: previous declaration is here
  operator Try<Socket<T>>() const;
  ^
/mesos/3rdparty/libprocess/src/../include/process/socket.hpp:537:58: error: deleted definition must be first declaration
Socket<unix::Address>::operator Try<Socket<T>>() const = delete;
                                                         ^
/mesos/3rdparty/libprocess/src/../include/process/socket.hpp:422:3: note: previous declaration is here
  operator Try<Socket<T>>() const;
  ^
/mesos/3rdparty/libprocess/src/../include/process/socket.hpp:537:58: error: deleted definition must be first declaration
Socket<unix::Address>::operator Try<Socket<T>>() const = delete;
                                                         ^
/mesos/3rdparty/libprocess/src/../include/process/socket.hpp:422:3: note: previous declaration is here
  operator Try<Socket<T>>() const;
  ^
[ 21%] Building CXX object 3rdparty/stout/tests/CMakeFiles/stout-tests.dir/bytes_tests.cpp.o
cd /mesos/build/3rdparty/stout/tests && /usr/bin/clang++-3.5  -DHAVE_LIBZ -DLIBDIR=\"/usr/local/libmesos\" -DPICOJSON_USE_INT64 -DPKGDATADIR=\"/usr/local/share/mesos\" -DPKGLIBEXECDIR=\"/usr/local/libexec/mesos\" -DUSE_SSL_SOCKET=1 -DVERSION=\"1.5.0\" -D__STDC_FORMAT_MACROS -I/mesos/build/3rdparty/stout/tests -I/mesos/3rdparty/stout/include -isystem /usr/include/apr-1.0 -isystem /mesos/build/3rdparty/boost-1.53.0/src/boost-1.53.0 -isystem /mesos/build/3rdparty/elfio-3.2/src/elfio-3.2 -isystem /mesos/build/3rdparty/glog-0.3.3/src/glog-0.3.3-build/include -isystem /mesos/build/3rdparty/picojson-1.3.0/src/picojson-1.3.0 -isystem /mesos/build/3rdparty/protobuf-3.5.0/src/protobuf-3.5.0/src -isystem /usr/include/subversion-1 -isystem /mesos/build/3rdparty/googletest-1.8.0/src/googletest-1.8.0/googlemock/include -isystem /mesos/build/3rdparty/googletest-1.8.0/src/googletest-1.8.0/googletest/include  -std=c++11 -Wformat-security -fstack-protector-strong -fPIE   -o CMakeFiles/stout-tests.dir/bytes_tests.cpp.o -c /mesos/3rdparty/stout/tests/bytes_tests.cpp
2 errors generated.
make[3]: *** [3rdparty/libprocess/src/CMakeFiles/process.dir/firewall.cpp.o] Error 1
make[3]: *** Waiting for unfinished jobs....
[ 21%] Building CXX object 3rdparty/stout/tests/CMakeFiles/stout-tests.dir/cache_tests.cpp.o
cd /mesos/build/3rdparty/stout/tests && /usr/bin/clang++-3.5  -DHAVE_LIBZ -DLIBDIR=\"/usr/local/libmesos\" -DPICOJSON_USE_INT64 -DPKGDATADIR=\"/usr/local/share/mesos\" -DPKGLIBEXECDIR=\"/usr/local/libexec/mesos\" -DUSE_SSL_SOCKET=1 -DVERSION=\"1.5.0\" -D__STDC_FORMAT_MACROS -I/mesos/build/3rdparty/stout/tests -I/mesos/3rdparty/stout/include -isystem /usr/include/apr-1.0 -isystem /mesos/build/3rdparty/boost-1.53.0/src/boost-1.53.0 -isystem /mesos/build/3rdparty/elfio-3.2/src/elfio-3.2 -isystem /mesos/build/3rdparty/glog-0.3.3/src/glog-0.3.3-build/include -isystem /mesos/build/3rdparty/picojson-1.3.0/src/picojson-1.3.0 -isystem /mesos/build/3rdparty/protobuf-3.5.0/src/protobuf-3.5.0/src -isystem /usr/include/subversion-1 -isystem /mesos/build/3rdparty/googletest-1.8.0/src/googletest-1.8.0/googlemock/include -isystem /mesos/build/3rdparty/googletest-1.8.0/src/googletest-1.8.0/googletest/include  -std=c++11 -Wformat-security -fstack-protector-strong -fPIE   -o CMakeFiles/stout-tests.dir/cache_tests.cpp.o -c /mesos/3rdparty/stout/tests/cache_tests.cpp
2 errors generated.
make[3]: *** [3rdparty/libprocess/src/CMakeFiles/process.dir/clock.cpp.o] Error 1
[ 22%] Building CXX object 3rdparty/stout/tests/CMakeFiles/stout-tests.dir/duration_tests.cpp.o
cd /mesos/build/3rdparty/stout/tests && /usr/bin/clang++-3.5  -DHAVE_LIBZ -DLIBDIR=\"/usr/local/libmesos\" -DPICOJSON_USE_INT64 -DPKGDATADIR=\"/usr/local/share/mesos\" -DPKGLIBEXECDIR=\"/usr/local/libexec/mesos\" -DUSE_SSL_SOCKET=1 -DVERSION=\"1.5.0\" -D__STDC_FORMAT_MACROS -I/mesos/build/3rdparty/stout/tests -I/mesos/3rdparty/stout/include -isystem /usr/include/apr-1.0 -isystem /mesos/build/3rdparty/boost-1.53.0/src/boost-1.53.0 -isystem /mesos/build/3rdparty/elfio-3.2/src/elfio-3.2 -isystem /mesos/build/3rdparty/glog-0.3.3/src/glog-0.3.3-build/include -isystem /mesos/build/3rdparty/picojson-1.3.0/src/picojson-1.3.0 -isystem /mesos/build/3rdparty/protobuf-3.5.0/src/protobuf-3.5.0/src -isystem /usr/include/subversion-1 -isystem /mesos/build/3rdparty/googletest-1.8.0/src/googletest-1.8.0/googlemock/include -isystem /mesos/build/3rdparty/googletest-1.8.0/src/googletest-1.8.0/googletest/include  -std=c++11 -Wformat-security -fstack-protector-strong -fPIE   -o CMakeFiles/stout-tests.dir/duration_tests.cpp.o -c /mesos/3rdparty/stout/tests/duration_tests.cpp
2 errors generated.
make[3]: *** [3rdparty/libprocess/src/CMakeFiles/process.dir/authenticator.cpp.o] Error 1
[ 22%] Building CXX object src/CMakeFiles/mesos-protobufs.dir/__/include/mesos/allocator/allocator.pb.cc.o
cd /mesos/build/src && /usr/bin/clang++-3.5  -DLIBDIR=\"/usr/local/libmesos\" -DPKGDATADIR=\"/usr/local/share/mesos\" -DPKGLIBEXECDIR=\"/usr/local/libexec/mesos\" -DUSE_SSL_SOCKET=1 -DVERSION=\"1.5.0\" -Dmesos_protobufs_EXPORTS -I/mesos/build/include -I/mesos/build/include/mesos -I/mesos/build/src -I/mesos/src -isystem /mesos/build/3rdparty/protobuf-3.5.0/src/protobuf-3.5.0/src  -std=c++11 -Wformat-security -fstack-protector-strong -fPIC   -o CMakeFiles/mesos-protobufs.dir/__/include/mesos/allocator/allocator.pb.cc.o -c /mesos/build/include/mesos/allocator/allocator.pb.cc
2 errors generated.
make[3]: *** [3rdparty/libprocess/src/CMakeFiles/process.dir/authenticator_manager.cpp.o] Error 1
make[3]: Leaving directory `/mesos/build'
make[2]: *** [3rdparty/libprocess/src/CMakeFiles/process.dir/all] Error 2
make[2]: *** Waiting for unfinished jobs....
[ 23%] Building CXX object src/CMakeFiles/mesos-protobufs.dir/__/include/mesos/appc/spec.pb.cc.o
cd /mesos/build/src && /usr/bin/clang++-3.5  -DLIBDIR=\"/usr/local/libmesos\" -DPKGDATADIR=\"/usr/local/share/mesos\" -DPKGLIBEXECDIR=\"/usr/local/libexec/mesos\" -DUSE_SSL_SOCKET=1 -DVERSION=\"1.5.0\" -Dmesos_protobufs_EXPORTS -I/mesos/build/include -I/mesos/build/include/mesos -I/mesos/build/src -I/mesos/src -isystem /mesos/build/3rdparty/protobuf-3.5.0/src/protobuf-3.5.0/src  -std=c++11 -Wformat-security -fstack-protector-strong -fPIC   -o CMakeFiles/mesos-protobufs.dir/__/include/mesos/appc/spec.pb.cc.o -c /mesos/build/include/mesos/appc/spec.pb.cc
[ 23%] Building CXX object src/CMakeFiles/mesos-protobufs.dir/__/include/mesos/authentication/authentication.pb.cc.o
cd /mesos/build/src && /usr/bin/clang++-3.5  -DLIBDIR=\"/usr/local/libmesos\" -DPKGDATADIR=\"/usr/local/share/mesos\" -DPKGLIBEXECDIR=\"/usr/local/libexec/mesos\" -DUSE_SSL_SOCKET=1 -DVERSION=\"1.5.0\" -Dmesos_protobufs_EXPORTS -I/mesos/build/include -I/mesos/build/include/mesos -I/mesos/build/src -I/mesos/src -isystem /mesos/build/3rdparty/protobuf-3.5.0/src/protobuf-3.5.0/src  -std=c++11 -Wformat-security -fstack-protector-strong -fPIC   -o CMakeFiles/mesos-protobufs.dir/__/include/mesos/authentication/authentication.pb.cc.o -c /mesos/build/include/mesos/authentication/authentication.pb.cc
[ 23%] Building CXX object 3rdparty/stout/tests/CMakeFiles/stout-tests.dir/dynamiclibrary_tests.cpp.o
cd /mesos/build/3rdparty/stout/tests && /usr/bin/clang++-3.5  -DHAVE_LIBZ -DLIBDIR=\"/usr/local/libmesos\" -DPICOJSON_USE_INT64 -DPKGDATADIR=\"/usr/local/share/mesos\" -DPKGLIBEXECDIR=\"/usr/local/libexec/mesos\" -DUSE_SSL_SOCKET=1 -DVERSION=\"1.5.0\" -D__STDC_FORMAT_MACROS -I/mesos/build/3rdparty/stout/tests -I/mesos/3rdparty/stout/include -isystem /usr/include/apr-1.0 -isystem /mesos/build/3rdparty/boost-1.53.0/src/boost-1.53.0 -isystem /mesos/build/3rdparty/elfio-3.2/src/elfio-3.2 -isystem /mesos/build/3rdparty/glog-0.3.3/src/glog-0.3.3-build/include -isystem /mesos/build/3rdparty/picojson-1.3.0/src/picojson-1.3.0 -isystem /mesos/build/3rdparty/protobuf-3.5.0/src/protobuf-3.5.0/src -isystem /usr/include/subversion-1 -isystem /mesos/build/3rdparty/googletest-1.8.0/src/googletest-1.8.0/googlemock/include -isystem /mesos/build/3rdparty/googletest-1.8.0/src/googletest-1.8.0/googletest/include  -std=c++11 -Wformat-security -fstack-protector-strong -fPIE   -o CMakeFiles/stout-tests.dir/dynamiclibrary_tests.cpp.o -c /mesos/3rdparty/stout/tests/dynamiclibrary_tests.cpp
[ 23%] Building CXX object src/CMakeFiles/mesos-protobufs.dir/__/include/mesos/authorizer/acls.pb.cc.o
cd /mesos/build/src && /usr/bin/clang++-3.5  -DLIBDIR=\"/usr/local/libmesos\" -DPKGDATADIR=\"/usr/local/share/mesos\" -DPKGLIBEXECDIR=\"/usr/local/libexec/mesos\" -DUSE_SSL_SOCKET=1 -DVERSION=\"1.5.0\" -Dmesos_protobufs_EXPORTS -I/mesos/build/include -I/mesos/build/include/mesos -I/mesos/build/src -I/mesos/src -isystem /mesos/build/3rdparty/protobuf-3.5.0/src/protobuf-3.5.0/src  -std=c++11 -Wformat-security -fstack-protector-strong -fPIC   -o CMakeFiles/mesos-protobufs.dir/__/include/mesos/authorizer/acls.pb.cc.o -c /mesos/build/include/mesos/authorizer/acls.pb.cc
[ 23%] Building CXX object src/CMakeFiles/mesos-protobufs.dir/__/include/mesos/authorizer/authorizer.pb.cc.o
cd /mesos/build/src && /usr/bin/clang++-3.5  -DLIBDIR=\"/usr/local/libmesos\" -DPKGDATADIR=\"/usr/local/share/mesos\" -DPKGLIBEXECDIR=\"/usr/local/libexec/mesos\" -DUSE_SSL_SOCKET=1 -DVERSION=\"1.5.0\" -Dmesos_protobufs_EXPORTS -I/mesos/build/include -I/mesos/build/include/mesos -I/mesos/build/src -I/mesos/src -isystem /mesos/build/3rdparty/protobuf-3.5.0/src/protobuf-3.5.0/src  -std=c++11 -Wformat-security -fstack-protector-strong -fPIC   -o CMakeFiles/mesos-protobufs.dir/__/include/mesos/authorizer/authorizer.pb.cc.o -c /mesos/build/include/mesos/authorizer/authorizer.pb.cc
[ 23%] Building CXX object 3rdparty/stout/tests/CMakeFiles/stout-tests.dir/error_tests.cpp.o
cd /mesos/build/3rdparty/stout/tests && /usr/bin/clang++-3.5  -DHAVE_LIBZ -DLIBDIR=\"/usr/local/libmesos\" -DPICOJSON_USE_INT64 -DPKGDATADIR=\"/usr/local/share/mesos\" -DPKGLIBEXECDIR=\"/usr/local/libexec/mesos\" -DUSE_SSL_SOCKET=1 -DVERSION=\"1.5.0\" -D__STDC_FORMAT_MACROS -I/mesos/build/3rdparty/stout/tests -I/mesos/3rdparty/stout/include -isystem /usr/include/apr-1.0 -isystem /mesos/build/3rdparty/boost-1.53.0/src/boost-1.53.0 -isystem /mesos/build/3rdparty/elfio-3.2/src/elfio-3.2 -isystem /mesos/build/3rdparty/glog-0.3.3/src/glog-0.3.3-build/include -isystem /mesos/build/3rdparty/picojson-1.3.0/src/picojson-1.3.0 -isystem /mesos/build/3rdparty/protobuf-3.5.0/src/protobuf-3.5.0/src -isystem /usr/include/subversion-1 -isystem /mesos/build/3rdparty/googletest-1.8.0/src/googletest-1.8.0/googlemock/include -isystem /mesos/build/3rdparty/googletest-1.8.0/src/googletest-1.8.0/googletest/include  -std=c++11 -Wformat-security -fstack-protector-strong -fPIE   -o CMakeFiles/stout-tests.dir/error_tests.cpp.o -c /mesos/3rdparty/stout/tests/error_tests.cpp
[ 23%] Building CXX object 3rdparty/stout/tests/CMakeFiles/stout-tests.dir/flags_tests.cpp.o
cd /mesos/build/3rdparty/stout/tests && /usr/bin/clang++-3.5  -DHAVE_LIBZ -DLIBDIR=\"/usr/local/libmesos\" -DPICOJSON_USE_INT64 -DPKGDATADIR=\"/usr/local/share/mesos\" -DPKGLIBEXECDIR=\"/usr/local/libexec/mesos\" -DUSE_SSL_SOCKET=1 -DVERSION=\"1.5.0\" -D__STDC_FORMAT_MACROS -I/mesos/build/3rdparty/stout/tests -I/mesos/3rdparty/stout/include -isystem /usr/include/apr-1.0 -isystem /mesos/build/3rdparty/boost-1.53.0/src/boost-1.53.0 -isystem /mesos/build/3rdparty/elfio-3.2/src/elfio-3.2 -isystem /mesos/build/3rdparty/glog-0.3.3/src/glog-0.3.3-build/include -isystem /mesos/build/3rdparty/picojson-1.3.0/src/picojson-1.3.0 -isystem /mesos/build/3rdparty/protobuf-3.5.0/src/protobuf-3.5.0/src -isystem /usr/include/subversion-1 -isystem /mesos/build/3rdparty/googletest-1.8.0/src/googletest-1.8.0/googlemock/include -isystem /mesos/build/3rdparty/googletest-1.8.0/src/googletest-1.8.0/googletest/include  -std=c++11 -Wformat-security -fstack-protector-strong -fPIE   -o CMakeFiles/stout-tests.dir/flags_tests.cpp.o -c /mesos/3rdparty/stout/tests/flags_tests.cpp
[ 23%] Building CXX object src/CMakeFiles/mesos-protobufs.dir/__/include/mesos/docker/spec.pb.cc.o
cd /mesos/build/src && /usr/bin/clang++-3.5  -DLIBDIR=\"/usr/local/libmesos\" -DPKGDATADIR=\"/usr/local/share/mesos\" -DPKGLIBEXECDIR=\"/usr/local/libexec/mesos\" -DUSE_SSL_SOCKET=1 -DVERSION=\"1.5.0\" -Dmesos_protobufs_EXPORTS -I/mesos/build/include -I/mesos/build/include/mesos -I/mesos/build/src -I/mesos/src -isystem /mesos/build/3rdparty/protobuf-3.5.0/src/protobuf-3.5.0/src  -std=c++11 -Wformat-security -fstack-protector-strong -fPIC   -o CMakeFiles/mesos-protobufs.dir/__/include/mesos/docker/spec.pb.cc.o -c /mesos/build/include/mesos/docker/spec.pb.cc
[ 23%] Building CXX object src/CMakeFiles/mesos-protobufs.dir/__/include/mesos/docker/v1.pb.cc.o
cd /mesos/build/src && /usr/bin/clang++-3.5  -DLIBDIR=\"/usr/local/libmesos\" -DPKGDATADIR=\"/usr/local/share/mesos\" -DPKGLIBEXECDIR=\"/usr/local/libexec/mesos\" -DUSE_SSL_SOCKET=1 -DVERSION=\"1.5.0\" -Dmesos_protobufs_EXPORTS -I/mesos/build/include -I/mesos/build/include/mesos -I/mesos/build/src -I/mesos/src -isystem /mesos/build/3rdparty/protobuf-3.5.0/src/protobuf-3.5.0/src  -std=c++11 -Wformat-security -fstack-protector-strong -fPIC   -o CMakeFiles/mesos-protobufs.dir/__/include/mesos/docker/v1.pb.cc.o -c /mesos/build/include/mesos/docker/v1.pb.cc
[ 23%] Building CXX object src/CMakeFiles/mesos-protobufs.dir/__/include/mesos/docker/v2.pb.cc.o
cd /mesos/build/src && /usr/bin/clang++-3.5  -DLIBDIR=\"/usr/local/libmesos\" -DPKGDATADIR=\"/usr/local/share/mesos\" -DPKGLIBEXECDIR=\"/usr/local/libexec/mesos\" -DUSE_SSL_SOCKET=1 -DVERSION=\"1.5.0\" -Dmesos_protobufs_EXPORTS -I/mesos/build/include -I/mesos/build/include/mesos -I/mesos/build/src -I/mesos/src -isystem /mesos/build/3rdparty/protobuf-3.5.0/src/protobuf-3.5.0/src  -std=c++11 -Wformat-security -fstack-protector-strong -fPIC   -o CMakeFiles/mesos-protobufs.dir/__/include/mesos/docker/v2.pb.cc.o -c /mesos/build/include/mesos/docker/v2.pb.cc
[ 23%] Building CXX object 3rdparty/stout/tests/CMakeFiles/stout-tests.dir/gzip_tests.cpp.o
cd /mesos/build/3rdparty/stout/tests && /usr/bin/clang++-3.5  -DHAVE_LIBZ -DLIBDIR=\"/usr/local/libmesos\" -DPICOJSON_USE_INT64 -DPKGDATADIR=\"/usr/local/share/mesos\" -DPKGLIBEXECDIR=\"/usr/local/libexec/mesos\" -DUSE_SSL_SOCKET=1 -DVERSION=\"1.5.0\" -D__STDC_FORMAT_MACROS -I/mesos/build/3rdparty/stout/tests -I/mesos/3rdparty/stout/include -isystem /usr/include/apr-1.0 -isystem /mesos/build/3rdparty/boost-1.53.0/src/boost-1.53.0 -isystem /mesos/build/3rdparty/elfio-3.2/src/elfio-3.2 -isystem /mesos/build/3rdparty/glog-0.3.3/src/glog-0.3.3-build/include -isystem /mesos/build/3rdparty/picojson-1.3.0/src/picojson-1.3.0 -isystem /mesos/build/3rdparty/protobuf-3.5.0/src/protobuf-3.5.0/src -isystem /usr/include/subversion-1 -isystem /mesos/build/3rdparty/googletest-1.8.0/src/googletest-1.8.0/googlemock/include -isystem /mesos/build/3rdparty/googletest-1.8.0/src/googletest-1.8.0/googletest/include  -std=c++11 -Wformat-security -fstack-protector-strong -fPIE   -o CMakeFiles/stout-tests.dir/gzip_tests.cpp.o -c /mesos/3rdparty/stout/tests/gzip_tests.cpp
[ 23%] Building CXX object src/CMakeFiles/mesos-protobufs.dir/__/include/mesos/maintenance/maintenance.pb.cc.o
cd /mesos/build/src && /usr/bin/clang++-3.5  -DLIBDIR=\"/usr/local/libmesos\" -DPKGDATADIR=\"/usr/local/share/mesos\" -DPKGLIBEXECDIR=\"/usr/local/libexec/mesos\" -DUSE_SSL_SOCKET=1 -DVERSION=\"1.5.0\" -Dmesos_protobufs_EXPORTS -I/mesos/build/include -I/mesos/build/include/mesos -I/mesos/build/src -I/mesos/src -isystem /mesos/build/3rdparty/protobuf-3.5.0/src/protobuf-3.5.0/src  -std=c++11 -Wformat-security -fstack-protector-strong -fPIC   -o CMakeFiles/mesos-protobufs.dir/__/include/mesos/maintenance/maintenance.pb.cc.o -c /mesos/build/include/mesos/maintenance/maintenance.pb.cc
[ 24%] Building CXX object src/CMakeFiles/mesos-protobufs.dir/__/include/mesos/master/master.pb.cc.o
cd /mesos/build/src && /usr/bin/clang++-3.5  -DLIBDIR=\"/usr/local/libmesos\" -DPKGDATADIR=\"/usr/local/share/mesos\" -DPKGLIBEXECDIR=\"/usr/local/libexec/mesos\" -DUSE_SSL_SOCKET=1 -DVERSION=\"1.5.0\" -Dmesos_protobufs_EXPORTS -I/mesos/build/include -I/mesos/build/include/mesos -I/mesos/build/src -I/mesos/src -isystem /mesos/build/3rdparty/protobuf-3.5.0/src/protobuf-3.5.0/src  -std=c++11 -Wformat-security -fstack-protector-strong -fPIC   -o CMakeFiles/mesos-protobufs.dir/__/include/mesos/master/master.pb.cc.o -c /mesos/build/include/mesos/master/master.pb.cc
[ 24%] Building CXX object src/CMakeFiles/mesos-protobufs.dir/__/include/mesos/module/hook.pb.cc.o
cd /mesos/build/src && /usr/bin/clang++-3.5  -DLIBDIR=\"/usr/local/libmesos\" -DPKGDATADIR=\"/usr/local/share/mesos\" -DPKGLIBEXECDIR=\"/usr/local/libexec/mesos\" -DUSE_SSL_SOCKET=1 -DVERSION=\"1.5.0\" -Dmesos_protobufs_EXPORTS -I/mesos/build/include -I/mesos/build/include/mesos -I/mesos/build/src -I/mesos/src -isystem /mesos/build/3rdparty/protobuf-3.5.0/src/protobuf-3.5.0/src  -std=c++11 -Wformat-security -fstack-protector-strong -fPIC   -o CMakeFiles/mesos-protobufs.dir/__/include/mesos/module/hook.pb.cc.o -c /mesos/build/include/mesos/module/hook.pb.cc
[ 24%] Building CXX object 3rdparty/stout/tests/CMakeFiles/stout-tests.dir/hashmap_tests.cpp.o
cd /mesos/build/3rdparty/stout/tests && /usr/bin/clang++-3.5  -DHAVE_LIBZ -DLIBDIR=\"/usr/local/libmesos\" -DPICOJSON_USE_INT64 -DPKGDATADIR=\"/usr/local/share/mesos\" -DPKGLIBEXECDIR=\"/usr/local/libexec/mesos\" -DUSE_SSL_SOCKET=1 -DVERSION=\"1.5.0\" -D__STDC_FORMAT_MACROS -I/mesos/build/3rdparty/stout/tests -I/mesos/3rdparty/stout/include -isystem /usr/include/apr-1.0 -isystem /mesos/build/3rdparty/boost-1.53.0/src/boost-1.53.0 -isystem /mesos/build/3rdparty/elfio-3.2/src/elfio-3.2 -isystem /mesos/build/3rdparty/glog-0.3.3/src/glog-0.3.3-build/include -isystem /mesos/build/3rdparty/picojson-1.3.0/src/picojson-1.3.0 -isystem /mesos/build/3rdparty/protobuf-3.5.0/src/protobuf-3.5.0/src -isystem /usr/include/subversion-1 -isystem /mesos/build/3rdparty/googletest-1.8.0/src/googletest-1.8.0/googlemock/include -isystem /mesos/build/3rdparty/googletest-1.8.0/src/googletest-1.8.0/googletest/include  -std=c++11 -Wformat-security -fstack-protector-strong -fPIE   -o CMakeFiles/stout-tests.dir/hashmap_tests.cpp.o -c /mesos/3rdparty/stout/tests/hashmap_tests.cpp
[ 24%] Building CXX object 3rdparty/stout/tests/CMakeFiles/stout-tests.dir/hashset_tests.cpp.o
cd /mesos/build/3rdparty/stout/tests && /usr/bin/clang++-3.5  -DHAVE_LIBZ -DLIBDIR=\"/usr/local/libmesos\" -DPICOJSON_USE_INT64 -DPKGDATADIR=\"/usr/local/share/mesos\" -DPKGLIBEXECDIR=\"/usr/local/libexec/mesos\" -DUSE_SSL_SOCKET=1 -DVERSION=\"1.5.0\" -D__STDC_FORMAT_MACROS -I/mesos/build/3rdparty/stout/tests -I/mesos/3rdparty/stout/include -isystem /usr/include/apr-1.0 -isystem /mesos/build/3rdparty/boost-1.53.0/src/boost-1.53.0 -isystem /mesos/build/3rdparty/elfio-3.2/src/elfio-3.2 -isystem /mesos/build/3rdparty/glog-0.3.3/src/glog-0.3.3-build/include -isystem /mesos/build/3rdparty/picojson-1.3.0/src/picojson-1.3.0 -isystem /mesos/build/3rdparty/protobuf-3.5.0/src/protobuf-3.5.0/src -isystem /usr/include/subversion-1 -isystem /mesos/build/3rdparty/googletest-1.8.0/src/googletest-1.8.0/googlemock/include -isystem /mesos/build/3rdparty/googletest-1.8.0/src/googletest-1.8.0/googletest/include  -std=c++11 -Wformat-security -fstack-protector-strong -fPIE   -o CMakeFiles/stout-tests.dir/hashset_tests.cpp.o -c /mesos/3rdparty/stout/tests/hashset_tests.cpp
[ 25%] Building CXX object 3rdparty/stout/tests/CMakeFiles/stout-tests.dir/interval_tests.cpp.o
cd /mesos/build/3rdparty/stout/tests && /usr/bin/clang++-3.5  -DHAVE_LIBZ -DLIBDIR=\"/usr/local/libmesos\" -DPICOJSON_USE_INT64 -DPKGDATADIR=\"/usr/local/share/mesos\" -DPKGLIBEXECDIR=\"/usr/local/libexec/mesos\" -DUSE_SSL_SOCKET=1 -DVERSION=\"1.5.0\" -D__STDC_FORMAT_MACROS -I/mesos/build/3rdparty/stout/tests -I/mesos/3rdparty/stout/include -isystem /usr/include/apr-1.0 -isystem /mesos/build/3rdparty/boost-1.53.0/src/boost-1.53.0 -isystem /mesos/build/3rdparty/elfio-3.2/src/elfio-3.2 -isystem /mesos/build/3rdparty/glog-0.3.3/src/glog-0.3.3-build/include -isystem /mesos/build/3rdparty/picojson-1.3.0/src/picojson-1.3.0 -isystem /mesos/build/3rdparty/protobuf-3.5.0/src/protobuf-3.5.0/src -isystem /usr/include/subversion-1 -isystem /mesos/build/3rdparty/googletest-1.8.0/src/googletest-1.8.0/googlemock/include -isystem /mesos/build/3rdparty/googletest-1.8.0/src/googletest-1.8.0/googletest/include  -std=c++11 -Wformat-security -fstack-protector-strong -fPIE   -o CMakeFiles/stout-tests.dir/interval_tests.cpp.o -c /mesos/3rdparty/stout/tests/interval_tests.cpp
[ 25%] Building CXX object src/CMakeFiles/mesos-protobufs.dir/__/include/mesos/module/module.pb.cc.o
cd /mesos/build/src && /usr/bin/clang++-3.5  -DLIBDIR=\"/usr/local/libmesos\" -DPKGDATADIR=\"/usr/local/share/mesos\" -DPKGLIBEXECDIR=\"/usr/local/libexec/mesos\" -DUSE_SSL_SOCKET=1 -DVERSION=\"1.5.0\" -Dmesos_protobufs_EXPORTS -I/mesos/build/include -I/mesos/build/include/mesos -I/mesos/build/src -I/mesos/src -isystem /mesos/build/3rdparty/protobuf-3.5.0/src/protobuf-3.5.0/src  -std=c++11 -Wformat-security -fstack-protector-strong -fPIC   -o CMakeFiles/mesos-protobufs.dir/__/include/mesos/module/module.pb.cc.o -c /mesos/build/include/mesos/module/module.pb.cc
[ 25%] Building CXX object src/CMakeFiles/mesos-protobufs.dir/__/include/mesos/oci/spec.pb.cc.o
cd /mesos/build/src && /usr/bin/clang++-3.5  -DLIBDIR=\"/usr/local/libmesos\" -DPKGDATADIR=\"/usr/local/share/mesos\" -DPKGLIBEXECDIR=\"/usr/local/libexec/mesos\" -DUSE_SSL_SOCKET=1 -DVERSION=\"1.5.0\" -Dmesos_protobufs_EXPORTS -I/mesos/build/include -I/mesos/build/include/mesos -I/mesos/build/src -I/mesos/src -isystem /mesos/build/3rdparty/protobuf-3.5.0/src/protobuf-3.5.0/src  -std=c++11 -Wformat-security -fstack-protector-strong -fPIC   -o CMakeFiles/mesos-protobufs.dir/__/include/mesos/oci/spec.pb.cc.o -c /mesos/build/include/mesos/oci/spec.pb.cc
[ 25%] Building CXX object 3rdparty/stout/tests/CMakeFiles/stout-tests.dir/ip_tests.cpp.o
cd /mesos/build/3rdparty/stout/tests && /usr/bin/clang++-3.5  -DHAVE_LIBZ -DLIBDIR=\"/usr/local/libmesos\" -DPICOJSON_USE_INT64 -DPKGDATADIR=\"/usr/local/share/mesos\" -DPKGLIBEXECDIR=\"/usr/local/libexec/mesos\" -DUSE_SSL_SOCKET=1 -DVERSION=\"1.5.0\" -D__STDC_FORMAT_MACROS -I/mesos/build/3rdparty/stout/tests -I/mesos/3rdparty/stout/include -isystem /usr/include/apr-1.0 -isystem /mesos/build/3rdparty/boost-1.53.0/src/boost-1.53.0 -isystem /mesos/build/3rdparty/elfio-3.2/src/elfio-3.2 -isystem /mesos/build/3rdparty/glog-0.3.3/src/glog-0.3.3-build/include -isystem /mesos/build/3rdparty/picojson-1.3.0/src/picojson-1.3.0 -isystem /mesos/build/3rdparty/protobuf-3.5.0/src/protobuf-3.5.0/src -isystem /usr/include/subversion-1 -isystem /mesos/build/3rdparty/googletest-1.8.0/src/googletest-1.8.0/googlemock/include -isystem /mesos/build/3rdparty/googletest-1.8.0/src/googletest-1.8.0/googletest/include  -std=c++11 -Wformat-security -fstack-protector-strong -fPIE   -o CMakeFiles/stout-tests.dir/ip_tests.cpp.o -c /mesos/3rdparty/stout/tests/ip_tests.cpp
[ 25%] Building CXX object src/CMakeFiles/mesos-protobufs.dir/__/include/mesos/quota/quota.pb.cc.o
cd /mesos/build/src && /usr/bin/clang++-3.5  -DLIBDIR=\"/usr/local/libmesos\" -DPKGDATADIR=\"/usr/local/share/mesos\" -DPKGLIBEXECDIR=\"/usr/local/libexec/mesos\" -DUSE_SSL_SOCKET=1 -DVERSION=\"1.5.0\" -Dmesos_protobufs_EXPORTS -I/mesos/build/include -I/mesos/build/include/mesos -I/mesos/build/src -I/mesos/src -isystem /mesos/build/3rdparty/protobuf-3.5.0/src/protobuf-3.5.0/src  -std=c++11 -Wformat-security -fstack-protector-strong -fPIC   -o CMakeFiles/mesos-protobufs.dir/__/include/mesos/quota/quota.pb.cc.o -c /mesos/build/include/mesos/quota/quota.pb.cc
[ 25%] Building CXX object src/CMakeFiles/mesos-protobufs.dir/__/include/mesos/resource_provider/resource_provider.pb.cc.o
cd /mesos/build/src && /usr/bin/clang++-3.5  -DLIBDIR=\"/usr/local/libmesos\" -DPKGDATADIR=\"/usr/local/share/mesos\" -DPKGLIBEXECDIR=\"/usr/local/libexec/mesos\" -DUSE_SSL_SOCKET=1 -DVERSION=\"1.5.0\" -Dmesos_protobufs_EXPORTS -I/mesos/build/include -I/mesos/build/include/mesos -I/mesos/build/src -I/mesos/src -isystem /mesos/build/3rdparty/protobuf-3.5.0/src/protobuf-3.5.0/src  -std=c++11 -Wformat-security -fstack-protector-strong -fPIC   -o CMakeFiles/mesos-protobufs.dir/__/include/mesos/resource_provider/resource_provider.pb.cc.o -c /mesos/build/include/mesos/resource_provider/resource_provider.pb.cc
[ 25%] Building CXX object src/CMakeFiles/mesos-protobufs.dir/__/include/mesos/slave/containerizer.pb.cc.o
cd /mesos/build/src && /usr/bin/clang++-3.5  -DLIBDIR=\"/usr/local/libmesos\" -DPKGDATADIR=\"/usr/local/share/mesos\" -DPKGLIBEXECDIR=\"/usr/local/libexec/mesos\" -DUSE_SSL_SOCKET=1 -DVERSION=\"1.5.0\" -Dmesos_protobufs_EXPORTS -I/mesos/build/include -I/mesos/build/include/mesos -I/mesos/build/src -I/mesos/src -isystem /mesos/build/3rdparty/protobuf-3.5.0/src/protobuf-3.5.0/src  -std=c++11 -Wformat-security -fstack-protector-strong -fPIC   -o CMakeFiles/mesos-protobufs.dir/__/include/mesos/slave/containerizer.pb.cc.o -c /mesos/build/include/mesos/slave/containerizer.pb.cc
[ 25%] Building CXX object 3rdparty/stout/tests/CMakeFiles/stout-tests.dir/json_tests.cpp.o
cd /mesos/build/3rdparty/stout/tests && /usr/bin/clang++-3.5  -DHAVE_LIBZ -DLIBDIR=\"/usr/local/libmesos\" -DPICOJSON_USE_INT64 -DPKGDATADIR=\"/usr/local/share/mesos\" -DPKGLIBEXECDIR=\"/usr/local/libexec/mesos\" -DUSE_SSL_SOCKET=1 -DVERSION=\"1.5.0\" -D__STDC_FORMAT_MACROS -I/mesos/build/3rdparty/stout/tests -I/mesos/3rdparty/stout/include -isystem /usr/include/apr-1.0 -isystem /mesos/build/3rdparty/boost-1.53.0/src/boost-1.53.0 -isystem /mesos/build/3rdparty/elfio-3.2/src/elfio-3.2 -isystem /mesos/build/3rdparty/glog-0.3.3/src/glog-0.3.3-build/include -isystem /mesos/build/3rdparty/picojson-1.3.0/src/picojson-1.3.0 -isystem /mesos/build/3rdparty/protobuf-3.5.0/src/protobuf-3.5.0/src -isystem /usr/include/subversion-1 -isystem /mesos/build/3rdparty/googletest-1.8.0/src/googletest-1.8.0/googlemock/include -isystem /mesos/build/3rdparty/googletest-1.8.0/src/googletest-1.8.0/googletest/include  -std=c++11 -Wformat-security -fstack-protector-strong -fPIE   -o CMakeFiles/stout-tests.dir/json_tests.cpp.o -c /mesos/3rdparty/stout/tests/json_tests.cpp
[ 26%] Building CXX object src/CMakeFiles/mesos-protobufs.dir/__/include/mesos/slave/oversubscription.pb.cc.o
cd /mesos/build/src && /usr/bin/clang++-3.5  -DLIBDIR=\"/usr/local/libmesos\" -DPKGDATADIR=\"/usr/local/share/mesos\" -DPKGLIBEXECDIR=\"/usr/local/libexec/mesos\" -DUSE_SSL_SOCKET=1 -DVERSION=\"1.5.0\" -Dmesos_protobufs_EXPORTS -I/mesos/build/include -I/mesos/build/include/mesos -I/mesos/build/src -I/mesos/src -isystem /mesos/build/3rdparty/protobuf-3.5.0/src/protobuf-3.5.0/src  -std=c++11 -Wformat-security -fstack-protector-strong -fPIC   -o CMakeFiles/mesos-protobufs.dir/__/include/mesos/slave/oversubscription.pb.cc.o -c /mesos/build/include/mesos/slave/oversubscription.pb.cc
[ 26%] Building CXX object src/CMakeFiles/mesos-protobufs.dir/__/include/mesos/state/state.pb.cc.o
cd /mesos/build/src && /usr/bin/clang++-3.5  -DLIBDIR=\"/usr/local/libmesos\" -DPKGDATADIR=\"/usr/local/share/mesos\" -DPKGLIBEXECDIR=\"/usr/local/libexec/mesos\" -DUSE_SSL_SOCKET=1 -DVERSION=\"1.5.0\" -Dmesos_protobufs_EXPORTS -I/mesos/build/include -I/mesos/build/include/mesos -I/mesos/build/src -I/mesos/src -isystem /mesos/build/3rdparty/protobuf-3.5.0/src/protobuf-3.5.0/src  -std=c++11 -Wformat-security -fstack-protector-strong -fPIC   -o CMakeFiles/mesos-protobufs.dir/__/include/mesos/state/state.pb.cc.o -c /mesos/build/include/mesos/state/state.pb.cc
[ 26%] Building CXX object 3rdparty/stout/tests/CMakeFiles/stout-tests.dir/jsonify_tests.cpp.o
cd /mesos/build/3rdparty/stout/tests && /usr/bin/clang++-3.5  -DHAVE_LIBZ -DLIBDIR=\"/usr/local/libmesos\" -DPICOJSON_USE_INT64 -DPKGDATADIR=\"/usr/local/share/mesos\" -DPKGLIBEXECDIR=\"/usr/local/libexec/mesos\" -DUSE_SSL_SOCKET=1 -DVERSION=\"1.5.0\" -D__STDC_FORMAT_MACROS -I/mesos/build/3rdparty/stout/tests -I/mesos/3rdparty/stout/include -isystem /usr/include/apr-1.0 -isystem /mesos/build/3rdparty/boost-1.53.0/src/boost-1.53.0 -isystem /mesos/build/3rdparty/elfio-3.2/src/elfio-3.2 -isystem /mesos/build/3rdparty/glog-0.3.3/src/glog-0.3.3-build/include -isystem /mesos/build/3rdparty/picojson-1.3.0/src/picojson-1.3.0 -isystem /mesos/build/3rdparty/protobuf-3.5.0/src/protobuf-3.5.0/src -isystem /usr/include/subversion-1 -isystem /mesos/build/3rdparty/googletest-1.8.0/src/googletest-1.8.0/googlemock/include -isystem /mesos/build/3rdparty/googletest-1.8.0/src/googletest-1.8.0/googletest/include  -std=c++11 -Wformat-security -fstack-protector-strong -fPIE   -o CMakeFiles/stout-tests.dir/jsonify_tests.cpp.o -c /mesos/3rdparty/stout/tests/jsonify_tests.cpp
[ 26%] Building CXX object 3rdparty/stout/tests/CMakeFiles/stout-tests.dir/lambda_tests.cpp.o
cd /mesos/build/3rdparty/stout/tests && /usr/bin/clang++-3.5  -DHAVE_LIBZ -DLIBDIR=\"/usr/local/libmesos\" -DPICOJSON_USE_INT64 -DPKGDATADIR=\"/usr/local/share/mesos\" -DPKGLIBEXECDIR=\"/usr/local/libexec/mesos\" -DUSE_SSL_SOCKET=1 -DVERSION=\"1.5.0\" -D__STDC_FORMAT_MACROS -I/mesos/build/3rdparty/stout/tests -I/mesos/3rdparty/stout/include -isystem /usr/include/apr-1.0 -isystem /mesos/build/3rdparty/boost-1.53.0/src/boost-1.53.0 -isystem /mesos/build/3rdparty/elfio-3.2/src/elfio-3.2 -isystem /mesos/build/3rdparty/glog-0.3.3/src/glog-0.3.3-build/include -isystem /mesos/build/3rdparty/picojson-1.3.0/src/picojson-1.3.0 -isystem /mesos/build/3rdparty/protobuf-3.5.0/src/protobuf-3.5.0/src -isystem /usr/include/subversion-1 -isystem /mesos/build/3rdparty/googletest-1.8.0/src/googletest-1.8.0/googlemock/include -isystem /mesos/build/3rdparty/googletest-1.8.0/src/googletest-1.8.0/googletest/include  -std=c++11 -Wformat-security -fstack-protector-strong -fPIE   -o CMakeFiles/stout-tests.dir/lambda_tests.cpp.o -c /mesos/3rdparty/stout/tests/lambda_tests.cpp
[ 26%] Building CXX object src/CMakeFiles/mesos-protobufs.dir/__/include/mesos/uri/uri.pb.cc.o
cd /mesos/build/src && /usr/bin/clang++-3.5  -DLIBDIR=\"/usr/local/libmesos\" -DPKGDATADIR=\"/usr/local/share/mesos\" -DPKGLIBEXECDIR=\"/usr/local/libexec/mesos\" -DUSE_SSL_SOCKET=1 -DVERSION=\"1.5.0\" -Dmesos_protobufs_EXPORTS -I/mesos/build/include -I/mesos/build/include/mesos -I/mesos/build/src -I/mesos/src -isystem /mesos/build/3rdparty/protobuf-3.5.0/src/protobuf-3.5.0/src  -std=c++11 -Wformat-security -fstack-protector-strong -fPIC   -o CMakeFiles/mesos-protobufs.dir/__/include/mesos/uri/uri.pb.cc.o -c /mesos/build/include/mesos/uri/uri.pb.cc
[ 26%] Building CXX object src/CMakeFiles/mesos-protobufs.dir/__/include/mesos/executor/executor.pb.cc.o
cd /mesos/build/src && /usr/bin/clang++-3.5  -DLIBDIR=\"/usr/local/libmesos\" -DPKGDATADIR=\"/usr/local/share/mesos\" -DPKGLIBEXECDIR=\"/usr/local/libexec/mesos\" -DUSE_SSL_SOCKET=1 -DVERSION=\"1.5.0\" -Dmesos_protobufs_EXPORTS -I/mesos/build/include -I/mesos/build/include/mesos -I/mesos/build/src -I/mesos/src -isystem /mesos/build/3rdparty/protobuf-3.5.0/src/protobuf-3.5.0/src  -std=c++11 -Wformat-security -fstack-protector-strong -fPIC   -o CMakeFiles/mesos-protobufs.dir/__/include/mesos/executor/executor.pb.cc.o -c /mesos/build/include/mesos/executor/executor.pb.cc
[ 26%] Building CXX object 3rdparty/stout/tests/CMakeFiles/stout-tests.dir/linkedhashmap_tests.cpp.o
cd /mesos/build/3rdparty/stout/tests && /usr/bin/clang++-3.5  -DHAVE_LIBZ -DLIBDIR=\"/usr/local/libmesos\" -DPICOJSON_USE_INT64 -DPKGDATADIR=\"/usr/local/share/mesos\" -DPKGLIBEXECDIR=\"/usr/local/libexec/mesos\" -DUSE_SSL_SOCKET=1 -DVERSION=\"1.5.0\" -D__STDC_FORMAT_MACROS -I/mesos/build/3rdparty/stout/tests -I/mesos/3rdparty/stout/include -isystem /usr/include/apr-1.0 -isystem /mesos/build/3rdparty/boost-1.53.0/src/boost-1.53.0 -isystem /mesos/build/3rdparty/elfio-3.2/src/elfio-3.2 -isystem /mesos/build/3rdparty/glog-0.3.3/src/glog-0.3.3-build/include -isystem /mesos/build/3rdparty/picojson-1.3.0/src/picojson-1.3.0 -isystem /mesos/build/3rdparty/protobuf-3.5.0/src/protobuf-3.5.0/src -isystem /usr/include/subversion-1 -isystem /mesos/build/3rdparty/googletest-1.8.0/src/googletest-1.8.0/googlemock/include -isystem /mesos/build/3rdparty/googletest-1.8.0/src/googletest-1.8.0/googletest/include  -std=c++11 -Wformat-security -fstack-protector-strong -fPIE   -o CMakeFiles/stout-tests.dir/linkedhashmap_tests.cpp.o -c /mesos/3rdparty/stout/tests/linkedhashmap_tests.cpp
[ 26%] Building CXX object 3rdparty/stout/tests/CMakeFiles/stout-tests.dir/mac_tests.cpp.o
cd /mesos/build/3rdparty/stout/tests && /usr/bin/clang++-3.5  -DHAVE_LIBZ -DLIBDIR=\"/usr/local/libmesos\" -DPICOJSON_USE_INT64 -DPKGDATADIR=\"/usr/local/share/mesos\" -DPKGLIBEXECDIR=\"/usr/local/libexec/mesos\" -DUSE_SSL_SOCKET=1 -DVERSION=\"1.5.0\" -D__STDC_FORMAT_MACROS -I/mesos/build/3rdparty/stout/tests -I/mesos/3rdparty/stout/include -isystem /usr/include/apr-1.0 -isystem /mesos/build/3rdparty/boost-1.53.0/src/boost-1.53.0 -isystem /mesos/build/3rdparty/elfio-3.2/src/elfio-3.2 -isystem /mesos/build/3rdparty/glog-0.3.3/src/glog-0.3.3-build/include -isystem /mesos/build/3rdparty/picojson-1.3.0/src/picojson-1.3.0 -isystem /mesos/build/3rdparty/protobuf-3.5.0/src/protobuf-3.5.0/src -isystem /usr/include/subversion-1 -isystem /mesos/build/3rdparty/googletest-1.8.0/src/googletest-1.8.0/googlemock/include -isystem /mesos/build/3rdparty/googletest-1.8.0/src/googletest-1.8.0/googletest/include  -std=c++11 -Wformat-security -fstack-protector-strong -fPIE   -o CMakeFiles/stout-tests.dir/mac_tests.cpp.o -c /mesos/3rdparty/stout/tests/mac_tests.cpp
[ 26%] Building CXX object src/CMakeFiles/mesos-protobufs.dir/__/include/mesos/fetcher/fetcher.pb.cc.o
cd /mesos/build/src && /usr/bin/clang++-3.5  -DLIBDIR=\"/usr/local/libmesos\" -DPKGDATADIR=\"/usr/local/share/mesos\" -DPKGLIBEXECDIR=\"/usr/local/libexec/mesos\" -DUSE_SSL_SOCKET=1 -DVERSION=\"1.5.0\" -Dmesos_protobufs_EXPORTS -I/mesos/build/include -I/mesos/build/include/mesos -I/mesos/build/src -I/mesos/src -isystem /mesos/build/3rdparty/protobuf-3.5.0/src/protobuf-3.5.0/src  -std=c++11 -Wformat-security -fstack-protector-strong -fPIC   -o CMakeFiles/mesos-protobufs.dir/__/include/mesos/fetcher/fetcher.pb.cc.o -c /mesos/build/include/mesos/fetcher/fetcher.pb.cc
[ 26%] Building CXX object 3rdparty/stout/tests/CMakeFiles/stout-tests.dir/main.cpp.o
cd /mesos/build/3rdparty/stout/tests && /usr/bin/clang++-3.5  -DHAVE_LIBZ -DLIBDIR=\"/usr/local/libmesos\" -DPICOJSON_USE_INT64 -DPKGDATADIR=\"/usr/local/share/mesos\" -DPKGLIBEXECDIR=\"/usr/local/libexec/mesos\" -DUSE_SSL_SOCKET=1 -DVERSION=\"1.5.0\" -D__STDC_FORMAT_MACROS -I/mesos/build/3rdparty/stout/tests -I/mesos/3rdparty/stout/include -isystem /usr/include/apr-1.0 -isystem /mesos/build/3rdparty/boost-1.53.0/src/boost-1.53.0 -isystem /mesos/build/3rdparty/elfio-3.2/src/elfio-3.2 -isystem /mesos/build/3rdparty/glog-0.3.3/src/glog-0.3.3-build/include -isystem /mesos/build/3rdparty/picojson-1.3.0/src/picojson-1.3.0 -isystem /mesos/build/3rdparty/protobuf-3.5.0/src/protobuf-3.5.0/src -isystem /usr/include/subversion-1 -isystem /mesos/build/3rdparty/googletest-1.8.0/src/googletest-1.8.0/googlemock/include -isystem /mesos/build/3rdparty/googletest-1.8.0/src/googletest-1.8.0/googletest/include  -std=c++11 -Wformat-security -fstack-protector-strong -fPIE   -o CMakeFiles/stout-tests.dir/main.cpp.o -c /mesos/3rdparty/stout/tests/main.cpp
[ 26%] Building CXX object src/CMakeFiles/mesos-protobufs.dir/__/include/mesos/mesos.pb.cc.o
cd /mesos/build/src && /usr/bin/clang++-3.5  -DLIBDIR=\"/usr/local/libmesos\" -DPKGDATADIR=\"/usr/local/share/mesos\" -DPKGLIBEXECDIR=\"/usr/local/libexec/mesos\" -DUSE_SSL_SOCKET=1 -DVERSION=\"1.5.0\" -Dmesos_protobufs_EXPORTS -I/mesos/build/include -I/mesos/build/include/mesos -I/mesos/build/src -I/mesos/src -isystem /mesos/build/3rdparty/protobuf-3.5.0/src/protobuf-3.5.0/src  -std=c++11 -Wformat-security -fstack-protector-strong -fPIC   -o CMakeFiles/mesos-protobufs.dir/__/include/mesos/mesos.pb.cc.o -c /mesos/build/include/mesos/mesos.pb.cc
[ 27%] Building CXX object 3rdparty/stout/tests/CMakeFiles/stout-tests.dir/multimap_tests.cpp.o
cd /mesos/build/3rdparty/stout/tests && /usr/bin/clang++-3.5  -DHAVE_LIBZ -DLIBDIR=\"/usr/local/libmesos\" -DPICOJSON_USE_INT64 -DPKGDATADIR=\"/usr/local/share/mesos\" -DPKGLIBEXECDIR=\"/usr/local/libexec/mesos\" -DUSE_SSL_SOCKET=1 -DVERSION=\"1.5.0\" -D__STDC_FORMAT_MACROS -I/mesos/build/3rdparty/stout/tests -I/mesos/3rdparty/stout/include -isystem /usr/include/apr-1.0 -isystem /mesos/build/3rdparty/boost-1.53.0/src/boost-1.53.0 -isystem /mesos/build/3rdparty/elfio-3.2/src/elfio-3.2 -isystem /mesos/build/3rdparty/glog-0.3.3/src/glog-0.3.3-build/include -isystem /mesos/build/3rdparty/picojson-1.3.0/src/picojson-1.3.0 -isystem /mesos/build/3rdparty/protobuf-3.5.0/src/protobuf-3.5.0/src -isystem /usr/include/subversion-1 -isystem /mesos/build/3rdparty/googletest-1.8.0/src/googletest-1.8.0/googlemock/include -isystem /mesos/build/3rdparty/googletest-1.8.0/src/googletest-1.8.0/googletest/include  -std=c++11 -Wformat-security -fstack-protector-strong -fPIE   -o CMakeFiles/stout-tests.dir/multimap_tests.cpp.o -c /mesos/3rdparty/stout/tests/multimap_tests.cpp
[ 27%] Building CXX object 3rdparty/stout/tests/CMakeFiles/stout-tests.dir/none_tests.cpp.o
cd /mesos/build/3rdparty/stout/tests && /usr/bin/clang++-3.5  -DHAVE_LIBZ -DLIBDIR=\"/usr/local/libmesos\" -DPICOJSON_USE_INT64 -DPKGDATADIR=\"/usr/local/share/mesos\" -DPKGLIBEXECDIR=\"/usr/local/libexec/mesos\" -DUSE_SSL_SOCKET=1 -DVERSION=\"1.5.0\" -D__STDC_FORMAT_MACROS -I/mesos/build/3rdparty/stout/tests -I/mesos/3rdparty/stout/include -isystem /usr/include/apr-1.0 -isystem /mesos/build/3rdparty/boost-1.53.0/src/boost-1.53.0 -isystem /mesos/build/3rdparty/elfio-3.2/src/elfio-3.2 -isystem /mesos/build/3rdparty/glog-0.3.3/src/glog-0.3.3-build/include -isystem /mesos/build/3rdparty/picojson-1.3.0/src/picojson-1.3.0 -isystem /mesos/build/3rdparty/protobuf-3.5.0/src/protobuf-3.5.0/src -isystem /usr/include/subversion-1 -isystem /mesos/build/3rdparty/googletest-1.8.0/src/googletest-1.8.0/googlemock/include -isystem /mesos/build/3rdparty/googletest-1.8.0/src/googletest-1.8.0/googletest/include  -std=c++11 -Wformat-security -fstack-protector-strong -fPIE   -o CMakeFiles/stout-tests.dir/none_tests.cpp.o -c /mesos/3rdparty/stout/tests/none_tests.cpp
[ 27%] Building CXX object 3rdparty/stout/tests/CMakeFiles/stout-tests.dir/numify_tests.cpp.o
cd /mesos/build/3rdparty/stout/tests && /usr/bin/clang++-3.5  -DHAVE_LIBZ -DLIBDIR=\"/usr/local/libmesos\" -DPICOJSON_USE_INT64 -DPKGDATADIR=\"/usr/local/share/mesos\" -DPKGLIBEXECDIR=\"/usr/local/libexec/mesos\" -DUSE_SSL_SOCKET=1 -DVERSION=\"1.5.0\" -D__STDC_FORMAT_MACROS -I/mesos/build/3rdparty/stout/tests -I/mesos/3rdparty/stout/include -isystem /usr/include/apr-1.0 -isystem /mesos/build/3rdparty/boost-1.53.0/src/boost-1.53.0 -isystem /mesos/build/3rdparty/elfio-3.2/src/elfio-3.2 -isystem /mesos/build/3rdparty/glog-0.3.3/src/glog-0.3.3-build/include -isystem /mesos/build/3rdparty/picojson-1.3.0/src/picojson-1.3.0 -isystem /mesos/build/3rdparty/protobuf-3.5.0/src/protobuf-3.5.0/src -isystem /usr/include/subversion-1 -isystem /mesos/build/3rdparty/googletest-1.8.0/src/googletest-1.8.0/googlemock/include -isystem /mesos/build/3rdparty/googletest-1.8.0/src/googletest-1.8.0/googletest/include  -std=c++11 -Wformat-security -fstack-protector-strong -fPIE   -o CMakeFiles/stout-tests.dir/numify_tests.cpp.o -c /mesos/3rdparty/stout/tests/numify_tests.cpp
[ 27%] Building CXX object 3rdparty/stout/tests/CMakeFiles/stout-tests.dir/option_tests.cpp.o
cd /mesos/build/3rdparty/stout/tests && /usr/bin/clang++-3.5  -DHAVE_LIBZ -DLIBDIR=\"/usr/local/libmesos\" -DPICOJSON_USE_INT64 -DPKGDATADIR=\"/usr/local/share/mesos\" -DPKGLIBEXECDIR=\"/usr/local/libexec/mesos\" -DUSE_SSL_SOCKET=1 -DVERSION=\"1.5.0\" -D__STDC_FORMAT_MACROS -I/mesos/build/3rdparty/stout/tests -I/mesos/3rdparty/stout/include -isystem /usr/include/apr-1.0 -isystem /mesos/build/3rdparty/boost-1.53.0/src/boost-1.53.0 -isystem /mesos/build/3rdparty/elfio-3.2/src/elfio-3.2 -isystem /mesos/build/3rdparty/glog-0.3.3/src/glog-0.3.3-build/include -isystem /mesos/build/3rdparty/picojson-1.3.0/src/picojson-1.3.0 -isystem /mesos/build/3rdparty/protobuf-3.5.0/src/protobuf-3.5.0/src -isystem /usr/include/subversion-1 -isystem /mesos/build/3rdparty/googletest-1.8.0/src/googletest-1.8.0/googlemock/include -isystem /mesos/build/3rdparty/googletest-1.8.0/src/googletest-1.8.0/googletest/include  -std=c++11 -Wformat-security -fstack-protector-strong -fPIE   -o CMakeFiles/stout-tests.dir/option_tests.cpp.o -c /mesos/3rdparty/stout/tests/option_tests.cpp
[ 27%] Building CXX object 3rdparty/stout/tests/CMakeFiles/stout-tests.dir/os_tests.cpp.o
cd /mesos/build/3rdparty/stout/tests && /usr/bin/clang++-3.5  -DHAVE_LIBZ -DLIBDIR=\"/usr/local/libmesos\" -DPICOJSON_USE_INT64 -DPKGDATADIR=\"/usr/local/share/mesos\" -DPKGLIBEXECDIR=\"/usr/local/libexec/mesos\" -DUSE_SSL_SOCKET=1 -DVERSION=\"1.5.0\" -D__STDC_FORMAT_MACROS -I/mesos/build/3rdparty/stout/tests -I/mesos/3rdparty/stout/include -isystem /usr/include/apr-1.0 -isystem /mesos/build/3rdparty/boost-1.53.0/src/boost-1.53.0 -isystem /mesos/build/3rdparty/elfio-3.2/src/elfio-3.2 -isystem /mesos/build/3rdparty/glog-0.3.3/src/glog-0.3.3-build/include -isystem /mesos/build/3rdparty/picojson-1.3.0/src/picojson-1.3.0 -isystem /mesos/build/3rdparty/protobuf-3.5.0/src/protobuf-3.5.0/src -isystem /usr/include/subversion-1 -isystem /mesos/build/3rdparty/googletest-1.8.0/src/googletest-1.8.0/googlemock/include -isystem /mesos/build/3rdparty/googletest-1.8.0/src/googletest-1.8.0/googletest/include  -std=c++11 -Wformat-security -fstack-protector-strong -fPIE   -o CMakeFiles/stout-tests.dir/os_tests.cpp.o -c /mesos/3rdparty/stout/tests/os_tests.cpp
[ 27%] Building CXX object 3rdparty/stout/tests/CMakeFiles/stout-tests.dir/path_tests.cpp.o
cd /mesos/build/3rdparty/stout/tests && /usr/bin/clang++-3.5  -DHAVE_LIBZ -DLIBDIR=\"/usr/local/libmesos\" -DPICOJSON_USE_INT64 -DPKGDATADIR=\"/usr/local/share/mesos\" -DPKGLIBEXECDIR=\"/usr/local/libexec/mesos\" -DUSE_SSL_SOCKET=1 -DVERSION=\"1.5.0\" -D__STDC_FORMAT_MACROS -I/mesos/build/3rdparty/stout/tests -I/mesos/3rdparty/stout/include -isystem /usr/include/apr-1.0 -isystem /mesos/build/3rdparty/boost-1.53.0/src/boost-1.53.0 -isystem /mesos/build/3rdparty/elfio-3.2/src/elfio-3.2 -isystem /mesos/build/3rdparty/glog-0.3.3/src/glog-0.3.3-build/include -isystem /mesos/build/3rdparty/picojson-1.3.0/src/picojson-1.3.0 -isystem /mesos/build/3rdparty/protobuf-3.5.0/src/protobuf-3.5.0/src -isystem /usr/include/subversion-1 -isystem /mesos/build/3rdparty/googletest-1.8.0/src/googletest-1.8.0/googlemock/include -isystem /mesos/build/3rdparty/googletest-1.8.0/src/googletest-1.8.0/googletest/include  -std=c++11 -Wformat-security -fstack-protector-strong -fPIE   -o CMakeFiles/stout-tests.dir/path_tests.cpp.o -c /mesos/3rdparty/stout/tests/path_tests.cpp
[ 27%] Building CXX object 3rdparty/stout/tests/CMakeFiles/stout-tests.dir/recordio_tests.cpp.o
cd /mesos/build/3rdparty/stout/tests && /usr/bin/clang++-3.5  -DHAVE_LIBZ -DLIBDIR=\"/usr/local/libmesos\" -DPICOJSON_USE_INT64 -DPKGDATADIR=\"/usr/local/share/mesos\" -DPKGLIBEXECDIR=\"/usr/local/libexec/mesos\" -DUSE_SSL_SOCKET=1 -DVERSION=\"1.5.0\" -D__STDC_FORMAT_MACROS -I/mesos/build/3rdparty/stout/tests -I/mesos/3rdparty/stout/include -isystem /usr/include/apr-1.0 -isystem /mesos/build/3rdparty/boost-1.53.0/src/boost-1.53.0 -isystem /mesos/build/3rdparty/elfio-3.2/src/elfio-3.2 -isystem /mesos/build/3rdparty/glog-0.3.3/src/glog-0.3.3-build/include -isystem /mesos/build/3rdparty/picojson-1.3.0/src/picojson-1.3.0 -isystem /mesos/build/3rdparty/protobuf-3.5.0/src/protobuf-3.5.0/src -isystem /usr/include/subversion-1 -isystem /mesos/build/3rdparty/googletest-1.8.0/src/googletest-1.8.0/googlemock/include -isystem /mesos/build/3rdparty/googletest-1.8.0/src/googletest-1.8.0/googletest/include  -std=c++11 -Wformat-security -fstack-protector-strong -fPIE   -o CMakeFiles/stout-tests.dir/recordio_tests.cpp.o -c /mesos/3rdparty/stout/tests/recordio_tests.cpp
[ 28%] Building CXX object 3rdparty/stout/tests/CMakeFiles/stout-tests.dir/result_tests.cpp.o
cd /mesos/build/3rdparty/stout/tests && /usr/bin/clang++-3.5  -DHAVE_LIBZ -DLIBDIR=\"/usr/local/libmesos\" -DPICOJSON_USE_INT64 -DPKGDATADIR=\"/usr/local/share/mesos\" -DPKGLIBEXECDIR=\"/usr/local/libexec/mesos\" -DUSE_SSL_SOCKET=1 -DVERSION=\"1.5.0\" -D__STDC_FORMAT_MACROS -I/mesos/build/3rdparty/stout/tests -I/mesos/3rdparty/stout/include -isystem /usr/include/apr-1.0 -isystem /mesos/build/3rdparty/boost-1.53.0/src/boost-1.53.0 -isystem /mesos/build/3rdparty/elfio-3.2/src/elfio-3.2 -isystem /mesos/build/3rdparty/glog-0.3.3/src/glog-0.3.3-build/include -isystem /mesos/build/3rdparty/picojson-1.3.0/src/picojson-1.3.0 -isystem /mesos/build/3rdparty/protobuf-3.5.0/src/protobuf-3.5.0/src -isystem /usr/include/subversion-1 -isystem /mesos/build/3rdparty/googletest-1.8.0/src/googletest-1.8.0/googlemock/include -isystem /mesos/build/3rdparty/googletest-1.8.0/src/googletest-1.8.0/googletest/include  -std=c++11 -Wformat-security -fstack-protector-strong -fPIE   -o CMakeFiles/stout-tests.dir/result_tests.cpp.o -c /mesos/3rdparty/stout/tests/result_tests.cpp
[ 28%] Building CXX object src/CMakeFiles/mesos-protobufs.dir/__/include/mesos/scheduler/scheduler.pb.cc.o
cd /mesos/build/src && /usr/bin/clang++-3.5  -DLIBDIR=\"/usr/local/libmesos\" -DPKGDATADIR=\"/usr/local/share/mesos\" -DPKGLIBEXECDIR=\"/usr/local/libexec/mesos\" -DUSE_SSL_SOCKET=1 -DVERSION=\"1.5.0\" -Dmesos_protobufs_EXPORTS -I/mesos/build/include -I/mesos/build/include/mesos -I/mesos/build/src -I/mesos/src -isystem /mesos/build/3rdparty/protobuf-3.5.0/src/protobuf-3.5.0/src  -std=c++11 -Wformat-security -fstack-protector-strong -fPIC   -o CMakeFiles/mesos-protobufs.dir/__/include/mesos/scheduler/scheduler.pb.cc.o -c /mesos/build/include/mesos/scheduler/scheduler.pb.cc
[ 28%] Building CXX object src/CMakeFiles/mesos-protobufs.dir/__/include/mesos/v1/agent/agent.pb.cc.o
cd /mesos/build/src && /usr/bin/clang++-3.5  -DLIBDIR=\"/usr/local/libmesos\" -DPKGDATADIR=\"/usr/local/share/mesos\" -DPKGLIBEXECDIR=\"/usr/local/libexec/mesos\" -DUSE_SSL_SOCKET=1 -DVERSION=\"1.5.0\" -Dmesos_protobufs_EXPORTS -I/mesos/build/include -I/mesos/build/include/mesos -I/mesos/build/src -I/mesos/src -isystem /mesos/build/3rdparty/protobuf-3.5.0/src/protobuf-3.5.0/src  -std=c++11 -Wformat-security -fstack-protector-strong -fPIC   -o CMakeFiles/mesos-protobufs.dir/__/include/mesos/v1/agent/agent.pb.cc.o -c /mesos/build/include/mesos/v1/agent/agent.pb.cc
[ 29%] Building CXX object src/CMakeFiles/mesos-protobufs.dir/__/include/mesos/v1/allocator/allocator.pb.cc.o
cd /mesos/build/src && /usr/bin/clang++-3.5  -DLIBDIR=\"/usr/local/libmesos\" -DPKGDATADIR=\"/usr/local/share/mesos\" -DPKGLIBEXECDIR=\"/usr/local/libexec/mesos\" -DUSE_SSL_SOCKET=1 -DVERSION=\"1.5.0\" -Dmesos_protobufs_EXPORTS -I/mesos/build/include -I/mesos/build/include/mesos -I/mesos/build/src -I/mesos/src -isystem /mesos/build/3rdparty/protobuf-3.5.0/src/protobuf-3.5.0/src  -std=c++11 -Wformat-security -fstack-protector-strong -fPIC   -o CMakeFiles/mesos-protobufs.dir/__/include/mesos/v1/allocator/allocator.pb.cc.o -c /mesos/build/include/mesos/v1/allocator/allocator.pb.cc
[ 29%] Building CXX object 3rdparty/stout/tests/CMakeFiles/stout-tests.dir/some_tests.cpp.o
cd /mesos/build/3rdparty/stout/tests && /usr/bin/clang++-3.5  -DHAVE_LIBZ -DLIBDIR=\"/usr/local/libmesos\" -DPICOJSON_USE_INT64 -DPKGDATADIR=\"/usr/local/share/mesos\" -DPKGLIBEXECDIR=\"/usr/local/libexec/mesos\" -DUSE_SSL_SOCKET=1 -DVERSION=\"1.5.0\" -D__STDC_FORMAT_MACROS -I/mesos/build/3rdparty/stout/tests -I/mesos/3rdparty/stout/include -isystem /usr/include/apr-1.0 -isystem /mesos/build/3rdparty/boost-1.53.0/src/boost-1.53.0 -isystem /mesos/build/3rdparty/elfio-3.2/src/elfio-3.2 -isystem /mesos/build/3rdparty/glog-0.3.3/src/glog-0.3.3-build/include -isystem /mesos/build/3rdparty/picojson-1.3.0/src/picojson-1.3.0 -isystem /mesos/build/3rdparty/protobuf-3.5.0/src/protobuf-3.5.0/src -isystem /usr/include/subversion-1 -isystem /mesos/build/3rdparty/googletest-1.8.0/src/googletest-1.8.0/googlemock/include -isystem /mesos/build/3rdparty/googletest-1.8.0/src/googletest-1.8.0/googletest/include  -std=c++11 -Wformat-security -fstack-protector-strong -fPIE   -o CMakeFiles/stout-tests.dir/some_tests.cpp.o -c /mesos/3rdparty/stout/tests/some_tests.cpp
[ 29%] Building CXX object src/CMakeFiles/mesos-protobufs.dir/__/include/mesos/v1/executor/executor.pb.cc.o
cd /mesos/build/src && /usr/bin/clang++-3.5  -DLIBDIR=\"/usr/local/libmesos\" -DPKGDATADIR=\"/usr/local/share/mesos\" -DPKGLIBEXECDIR=\"/usr/local/libexec/mesos\" -DUSE_SSL_SOCKET=1 -DVERSION=\"1.5.0\" -Dmesos_protobufs_EXPORTS -I/mesos/build/include -I/mesos/build/include/mesos -I/mesos/build/src -I/mesos/src -isystem /mesos/build/3rdparty/protobuf-3.5.0/src/protobuf-3.5.0/src  -std=c++11 -Wformat-security -fstack-protector-strong -fPIC   -o CMakeFiles/mesos-protobufs.dir/__/include/mesos/v1/executor/executor.pb.cc.o -c /mesos/build/include/mesos/v1/executor/executor.pb.cc
[ 29%] Building CXX object 3rdparty/stout/tests/CMakeFiles/stout-tests.dir/strings_tests.cpp.o
cd /mesos/build/3rdparty/stout/tests && /usr/bin/clang++-3.5  -DHAVE_LIBZ -DLIBDIR=\"/usr/local/libmesos\" -DPICOJSON_USE_INT64 -DPKGDATADIR=\"/usr/local/share/mesos\" -DPKGLIBEXECDIR=\"/usr/local/libexec/mesos\" -DUSE_SSL_SOCKET=1 -DVERSION=\"1.5.0\" -D__STDC_FORMAT_MACROS -I/mesos/build/3rdparty/stout/tests -I/mesos/3rdparty/stout/include -isystem /usr/include/apr-1.0 -isystem /mesos/build/3rdparty/boost-1.53.0/src/boost-1.53.0 -isystem /mesos/build/3rdparty/elfio-3.2/src/elfio-3.2 -isystem /mesos/build/3rdparty/glog-0.3.3/src/glog-0.3.3-build/include -isystem /mesos/build/3rdparty/picojson-1.3.0/src/picojson-1.3.0 -isystem /mesos/build/3rdparty/protobuf-3.5.0/src/protobuf-3.5.0/src -isystem /usr/include/subversion-1 -isystem /mesos/build/3rdparty/googletest-1.8.0/src/googletest-1.8.0/googlemock/include -isystem /mesos/build/3rdparty/googletest-1.8.0/src/googletest-1.8.0/googletest/include  -std=c++11 -Wformat-security -fstack-protector-strong -fPIE   -o CMakeFiles/stout-tests.dir/strings_tests.cpp.o -c /mesos/3rdparty/stout/tests/strings_tests.cpp
[ 29%] Building CXX object src/CMakeFiles/mesos-protobufs.dir/__/include/mesos/v1/maintenance/maintenance.pb.cc.o
cd /mesos/build/src && /usr/bin/clang++-3.5  -DLIBDIR=\"/usr/local/libmesos\" -DPKGDATADIR=\"/usr/local/share/mesos\" -DPKGLIBEXECDIR=\"/usr/local/libexec/mesos\" -DUSE_SSL_SOCKET=1 -DVERSION=\"1.5.0\" -Dmesos_protobufs_EXPORTS -I/mesos/build/include -I/mesos/build/include/mesos -I/mesos/build/src -I/mesos/src -isystem /mesos/build/3rdparty/protobuf-3.5.0/src/protobuf-3.5.0/src  -std=c++11 -Wformat-security -fstack-protector-strong -fPIC   -o CMakeFiles/mesos-protobufs.dir/__/include/mesos/v1/maintenance/maintenance.pb.cc.o -c /mesos/build/include/mesos/v1/maintenance/maintenance.pb.cc
[ 29%] Building CXX object 3rdparty/stout/tests/CMakeFiles/stout-tests.dir/subcommand_tests.cpp.o
cd /mesos/build/3rdparty/stout/tests && /usr/bin/clang++-3.5  -DHAVE_LIBZ -DLIBDIR=\"/usr/local/libmesos\" -DPICOJSON_USE_INT64 -DPKGDATADIR=\"/usr/local/share/mesos\" -DPKGLIBEXECDIR=\"/usr/local/libexec/mesos\" -DUSE_SSL_SOCKET=1 -DVERSION=\"1.5.0\" -D__STDC_FORMAT_MACROS -I/mesos/build/3rdparty/stout/tests -I/mesos/3rdparty/stout/include -isystem /usr/include/apr-1.0 -isystem /mesos/build/3rdparty/boost-1.53.0/src/boost-1.53.0 -isystem /mesos/build/3rdparty/elfio-3.2/src/elfio-3.2 -isystem /mesos/build/3rdparty/glog-0.3.3/src/glog-0.3.3-build/include -isystem /mesos/build/3rdparty/picojson-1.3.0/src/picojson-1.3.0 -isystem /mesos/build/3rdparty/protobuf-3.5.0/src/protobuf-3.5.0/src -isystem /usr/include/subversion-1 -isystem /mesos/build/3rdparty/googletest-1.8.0/src/googletest-1.8.0/googlemock/include -isystem /mesos/build/3rdparty/googletest-1.8.0/src/googletest-1.8.0/googletest/include  -std=c++11 -Wformat-security -fstack-protector-strong -fPIE   -o CMakeFiles/stout-tests.dir/subcommand_tests.cpp.o -c /mesos/3rdparty/stout/tests/subcommand_tests.cpp
[ 29%] Building CXX object src/CMakeFiles/mesos-protobufs.dir/__/include/mesos/v1/master/master.pb.cc.o
cd /mesos/build/src && /usr/bin/clang++-3.5  -DLIBDIR=\"/usr/local/libmesos\" -DPKGDATADIR=\"/usr/local/share/mesos\" -DPKGLIBEXECDIR=\"/usr/local/libexec/mesos\" -DUSE_SSL_SOCKET=1 -DVERSION=\"1.5.0\" -Dmesos_protobufs_EXPORTS -I/mesos/build/include -I/mesos/build/include/mesos -I/mesos/build/src -I/mesos/src -isystem /mesos/build/3rdparty/protobuf-3.5.0/src/protobuf-3.5.0/src  -std=c++11 -Wformat-security -fstack-protector-strong -fPIC   -o CMakeFiles/mesos-protobufs.dir/__/include/mesos/v1/master/master.pb.cc.o -c /mesos/build/include/mesos/v1/master/master.pb.cc
[ 29%] Building CXX object src/CMakeFiles/mesos-protobufs.dir/__/include/mesos/v1/mesos.pb.cc.o
cd /mesos/build/src && /usr/bin/clang++-3.5  -DLIBDIR=\"/usr/local/libmesos\" -DPKGDATADIR=\"/usr/local/share/mesos\" -DPKGLIBEXECDIR=\"/usr/local/libexec/mesos\" -DUSE_SSL_SOCKET=1 -DVERSION=\"1.5.0\" -Dmesos_protobufs_EXPORTS -I/mesos/build/include -I/mesos/build/include/mesos -I/mesos/build/src -I/mesos/src -isystem /mesos/build/3rdparty/protobuf-3.5.0/src/protobuf-3.5.0/src  -std=c++11 -Wformat-security -fstack-protector-strong -fPIC   -o CMakeFiles/mesos-protobufs.dir/__/include/mesos/v1/mesos.pb.cc.o -c /mesos/build/include/mesos/v1/mesos.pb.cc
[ 29%] Building CXX object 3rdparty/stout/tests/CMakeFiles/stout-tests.dir/try_tests.cpp.o
cd /mesos/build/3rdparty/stout/tests && /usr/bin/clang++-3.5  -DHAVE_LIBZ -DLIBDIR=\"/usr/local/libmesos\" -DPICOJSON_USE_INT64 -DPKGDATADIR=\"/usr/local/share/mesos\" -DPKGLIBEXECDIR=\"/usr/local/libexec/mesos\" -DUSE_SSL_SOCKET=1 -DVERSION=\"1.5.0\" -D__STDC_FORMAT_MACROS -I/mesos/build/3rdparty/stout/tests -I/mesos/3rdparty/stout/include -isystem /usr/include/apr-1.0 -isystem /mesos/build/3rdparty/boost-1.53.0/src/boost-1.53.0 -isystem /mesos/build/3rdparty/elfio-3.2/src/elfio-3.2 -isystem /mesos/build/3rdparty/glog-0.3.3/src/glog-0.3.3-build/include -isystem /mesos/build/3rdparty/picojson-1.3.0/src/picojson-1.3.0 -isystem /mesos/build/3rdparty/protobuf-3.5.0/src/protobuf-3.5.0/src -isystem /usr/include/subversion-1 -isystem /mesos/build/3rdparty/googletest-1.8.0/src/googletest-1.8.0/googlemock/include -isystem /mesos/build/3rdparty/googletest-1.8.0/src/googletest-1.8.0/googletest/include  -std=c++11 -Wformat-security -fstack-protector-strong -fPIE   -o CMakeFiles/stout-tests.dir/try_tests.cpp.o -c /mesos/3rdparty/stout/tests/try_tests.cpp
[ 29%] Building CXX object 3rdparty/stout/tests/CMakeFiles/stout-tests.dir/uuid_tests.cpp.o
cd /mesos/build/3rdparty/stout/tests && /usr/bin/clang++-3.5  -DHAVE_LIBZ -DLIBDIR=\"/usr/local/libmesos\" -DPICOJSON_USE_INT64 -DPKGDATADIR=\"/usr/local/share/mesos\" -DPKGLIBEXECDIR=\"/usr/local/libexec/mesos\" -DUSE_SSL_SOCKET=1 -DVERSION=\"1.5.0\" -D__STDC_FORMAT_MACROS -I/mesos/build/3rdparty/stout/tests -I/mesos/3rdparty/stout/include -isystem /usr/include/apr-1.0 -isystem /mesos/build/3rdparty/boost-1.53.0/src/boost-1.53.0 -isystem /mesos/build/3rdparty/elfio-3.2/src/elfio-3.2 -isystem /mesos/build/3rdparty/glog-0.3.3/src/glog-0.3.3-build/include -isystem /mesos/build/3rdparty/picojson-1.3.0/src/picojson-1.3.0 -isystem /mesos/build/3rdparty/protobuf-3.5.0/src/protobuf-3.5.0/src -isystem /usr/include/subversion-1 -isystem /mesos/build/3rdparty/googletest-1.8.0/src/googletest-1.8.0/googlemock/include -isystem /mesos/build/3rdparty/googletest-1.8.0/src/googletest-1.8.0/googletest/include  -std=c++11 -Wformat-security -fstack-protector-strong -fPIE   -o CMakeFiles/stout-tests.dir/uuid_tests.cpp.o -c /mesos/3rdparty/stout/tests/uuid_tests.cpp
[ 29%] Building CXX object src/CMakeFiles/mesos-protobufs.dir/__/include/mesos/v1/quota/quota.pb.cc.o
cd /mesos/build/src && /usr/bin/clang++-3.5  -DLIBDIR=\"/usr/local/libmesos\" -DPKGDATADIR=\"/usr/local/share/mesos\" -DPKGLIBEXECDIR=\"/usr/local/libexec/mesos\" -DUSE_SSL_SOCKET=1 -DVERSION=\"1.5.0\" -Dmesos_protobufs_EXPORTS -I/mesos/build/include -I/mesos/build/include/mesos -I/mesos/build/src -I/mesos/src -isystem /mesos/build/3rdparty/protobuf-3.5.0/src/protobuf-3.5.0/src  -std=c++11 -Wformat-security -fstack-protector-strong -fPIC   -o CMakeFiles/mesos-protobufs.dir/__/include/mesos/v1/quota/quota.pb.cc.o -c /mesos/build/include/mesos/v1/quota/quota.pb.cc
[ 29%] Building CXX object src/CMakeFiles/mesos-protobufs.dir/__/include/mesos/v1/resource_provider/resource_provider.pb.cc.o
cd /mesos/build/src && /usr/bin/clang++-3.5  -DLIBDIR=\"/usr/local/libmesos\" -DPKGDATADIR=\"/usr/local/share/mesos\" -DPKGLIBEXECDIR=\"/usr/local/libexec/mesos\" -DUSE_SSL_SOCKET=1 -DVERSION=\"1.5.0\" -Dmesos_protobufs_EXPORTS -I/mesos/build/include -I/mesos/build/include/mesos -I/mesos/build/src -I/mesos/src -isystem /mesos/build/3rdparty/protobuf-3.5.0/src/protobuf-3.5.0/src  -std=c++11 -Wformat-security -fstack-protector-strong -fPIC   -o CMakeFiles/mesos-protobufs.dir/__/include/mesos/v1/resource_provider/resource_provider.pb.cc.o -c /mesos/build/include/mesos/v1/resource_provider/resource_provider.pb.cc
[ 30%] Building CXX object src/CMakeFiles/mesos-protobufs.dir/__/include/mesos/v1/scheduler/scheduler.pb.cc.o
cd /mesos/build/src && /usr/bin/clang++-3.5  -DLIBDIR=\"/usr/local/libmesos\" -DPKGDATADIR=\"/usr/local/share/mesos\" -DPKGLIBEXECDIR=\"/usr/local/libexec/mesos\" -DUSE_SSL_SOCKET=1 -DVERSION=\"1.5.0\" -Dmesos_protobufs_EXPORTS -I/mesos/build/include -I/mesos/build/include/mesos -I/mesos/build/src -I/mesos/src -isystem /mesos/build/3rdparty/protobuf-3.5.0/src/protobuf-3.5.0/src  -std=c++11 -Wformat-security -fstack-protector-strong -fPIC   -o CMakeFiles/mesos-protobufs.dir/__/include/mesos/v1/scheduler/scheduler.pb.cc.o -c /mesos/build/include/mesos/v1/scheduler/scheduler.pb.cc
[ 30%] Building CXX object 3rdparty/stout/tests/CMakeFiles/stout-tests.dir/variant_tests.cpp.o
cd /mesos/build/3rdparty/stout/tests && /usr/bin/clang++-3.5  -DHAVE_LIBZ -DLIBDIR=\"/usr/local/libmesos\" -DPICOJSON_USE_INT64 -DPKGDATADIR=\"/usr/local/share/mesos\" -DPKGLIBEXECDIR=\"/usr/local/libexec/mesos\" -DUSE_SSL_SOCKET=1 -DVERSION=\"1.5.0\" -D__STDC_FORMAT_MACROS -I/mesos/build/3rdparty/stout/tests -I/mesos/3rdparty/stout/include -isystem /usr/include/apr-1.0 -isystem /mesos/build/3rdparty/boost-1.53.0/src/boost-1.53.0 -isystem /mesos/build/3rdparty/elfio-3.2/src/elfio-3.2 -isystem /mesos/build/3rdparty/glog-0.3.3/src/glog-0.3.3-build/include -isystem /mesos/build/3rdparty/picojson-1.3.0/src/picojson-1.3.0 -isystem /mesos/build/3rdparty/protobuf-3.5.0/src/protobuf-3.5.0/src -isystem /usr/include/subversion-1 -isystem /mesos/build/3rdparty/googletest-1.8.0/src/googletest-1.8.0/googlemock/include -isystem /mesos/build/3rdparty/googletest-1.8.0/src/googletest-1.8.0/googletest/include  -std=c++11 -Wformat-security -fstack-protector-strong -fPIE   -o CMakeFiles/stout-tests.dir/variant_tests.cpp.o -c /mesos/3rdparty/stout/tests/variant_tests.cpp
[ 30%] Building CXX object 3rdparty/stout/tests/CMakeFiles/stout-tests.dir/version_tests.cpp.o
cd /mesos/build/3rdparty/stout/tests && /usr/bin/clang++-3.5  -DHAVE_LIBZ -DLIBDIR=\"/usr/local/libmesos\" -DPICOJSON_USE_INT64 -DPKGDATADIR=\"/usr/local/share/mesos\" -DPKGLIBEXECDIR=\"/usr/local/libexec/mesos\" -DUSE_SSL_SOCKET=1 -DVERSION=\"1.5.0\" -D__STDC_FORMAT_MACROS -I/mesos/build/3rdparty/stout/tests -I/mesos/3rdparty/stout/include -isystem /usr/include/apr-1.0 -isystem /mesos/build/3rdparty/boost-1.53.0/src/boost-1.53.0 -isystem /mesos/build/3rdparty/elfio-3.2/src/elfio-3.2 -isystem /mesos/build/3rdparty/glog-0.3.3/src/glog-0.3.3-build/include -isystem /mesos/build/3rdparty/picojson-1.3.0/src/picojson-1.3.0 -isystem /mesos/build/3rdparty/protobuf-3.5.0/src/protobuf-3.5.0/src -isystem /usr/include/subversion-1 -isystem /mesos/build/3rdparty/googletest-1.8.0/src/googletest-1.8.0/googlemock/include -isystem /mesos/build/3rdparty/googletest-1.8.0/src/googletest-1.8.0/googletest/include  -std=c++11 -Wformat-security -fstack-protector-strong -fPIE   -o CMakeFiles/stout-tests.dir/version_tests.cpp.o -c /mesos/3rdparty/stout/tests/version_tests.cpp
[ 30%] Building CXX object src/CMakeFiles/mesos-protobufs.dir/messages/flags.pb.cc.o
cd /mesos/build/src && /usr/bin/clang++-3.5  -DLIBDIR=\"/usr/local/libmesos\" -DPKGDATADIR=\"/usr/local/share/mesos\" -DPKGLIBEXECDIR=\"/usr/local/libexec/mesos\" -DUSE_SSL_SOCKET=1 -DVERSION=\"1.5.0\" -Dmesos_protobufs_EXPORTS -I/mesos/build/include -I/mesos/build/include/mesos -I/mesos/build/src -I/mesos/src -isystem /mesos/build/3rdparty/protobuf-3.5.0/src/protobuf-3.5.0/src  -std=c++11 -Wformat-security -fstack-protector-strong -fPIC   -o CMakeFiles/mesos-protobufs.dir/messages/flags.pb.cc.o -c /mesos/build/src/messages/flags.pb.cc
[ 31%] Building CXX object 3rdparty/stout/tests/CMakeFiles/stout-tests.dir/protobuf_tests.cpp.o
cd /mesos/build/3rdparty/stout/tests && /usr/bin/clang++-3.5  -DHAVE_LIBZ -DLIBDIR=\"/usr/local/libmesos\" -DPICOJSON_USE_INT64 -DPKGDATADIR=\"/usr/local/share/mesos\" -DPKGLIBEXECDIR=\"/usr/local/libexec/mesos\" -DUSE_SSL_SOCKET=1 -DVERSION=\"1.5.0\" -D__STDC_FORMAT_MACROS -I/mesos/build/3rdparty/stout/tests -I/mesos/3rdparty/stout/include -isystem /usr/include/apr-1.0 -isystem /mesos/build/3rdparty/boost-1.53.0/src/boost-1.53.0 -isystem /mesos/build/3rdparty/elfio-3.2/src/elfio-3.2 -isystem /mesos/build/3rdparty/glog-0.3.3/src/glog-0.3.3-build/include -isystem /mesos/build/3rdparty/picojson-1.3.0/src/picojson-1.3.0 -isystem /mesos/build/3rdparty/protobuf-3.5.0/src/protobuf-3.5.0/src -isystem /usr/include/subversion-1 -isystem /mesos/build/3rdparty/googletest-1.8.0/src/googletest-1.8.0/googlemock/include -isystem /mesos/build/3rdparty/googletest-1.8.0/src/googletest-1.8.0/googletest/include  -std=c++11 -Wformat-security -fstack-protector-strong -fPIE   -o CMakeFiles/stout-tests.dir/protobuf_tests.cpp.o -c /mesos/3rdparty/stout/tests/protobuf_tests.cpp
[ 31%] Building CXX object 3rdparty/stout/tests/CMakeFiles/stout-tests.dir/protobuf_tests.pb.cc.o
cd /mesos/build/3rdparty/stout/tests && /usr/bin/clang++-3.5  -DHAVE_LIBZ -DLIBDIR=\"/usr/local/libmesos\" -DPICOJSON_USE_INT64 -DPKGDATADIR=\"/usr/local/share/mesos\" -DPKGLIBEXECDIR=\"/usr/local/libexec/mesos\" -DUSE_SSL_SOCKET=1 -DVERSION=\"1.5.0\" -D__STDC_FORMAT_MACROS -I/mesos/build/3rdparty/stout/tests -I/mesos/3rdparty/stout/include -isystem /usr/include/apr-1.0 -isystem /mesos/build/3rdparty/boost-1.53.0/src/boost-1.53.0 -isystem /mesos/build/3rdparty/elfio-3.2/src/elfio-3.2 -isystem /mesos/build/3rdparty/glog-0.3.3/src/glog-0.3.3-build/include -isystem /mesos/build/3rdparty/picojson-1.3.0/src/picojson-1.3.0 -isystem /mesos/build/3rdparty/protobuf-3.5.0/src/protobuf-3.5.0/src -isystem /usr/include/subversion-1 -isystem /mesos/build/3rdparty/googletest-1.8.0/src/googletest-1.8.0/googlemock/include -isystem /mesos/build/3rdparty/googletest-1.8.0/src/googletest-1.8.0/googletest/include  -std=c++11 -Wformat-security -fstack-protector-strong -fPIE   -o CMakeFiles/stout-tests.dir/protobuf_tests.pb.cc.o -c /mesos/build/3rdparty/stout/tests/protobuf_tests.pb.cc
[ 31%] Building CXX object 3rdparty/stout/tests/CMakeFiles/stout-tests.dir/svn_tests.cpp.o
cd /mesos/build/3rdparty/stout/tests && /usr/bin/clang++-3.5  -DHAVE_LIBZ -DLIBDIR=\"/usr/local/libmesos\" -DPICOJSON_USE_INT64 -DPKGDATADIR=\"/usr/local/share/mesos\" -DPKGLIBEXECDIR=\"/usr/local/libexec/mesos\" -DUSE_SSL_SOCKET=1 -DVERSION=\"1.5.0\" -D__STDC_FORMAT_MACROS -I/mesos/build/3rdparty/stout/tests -I/mesos/3rdparty/stout/include -isystem /usr/include/apr-1.0 -isystem /mesos/build/3rdparty/boost-1.53.0/src/boost-1.53.0 -isystem /mesos/build/3rdparty/elfio-3.2/src/elfio-3.2 -isystem /mesos/build/3rdparty/glog-0.3.3/src/glog-0.3.3-build/include -isystem /mesos/build/3rdparty/picojson-1.3.0/src/picojson-1.3.0 -isystem /mesos/build/3rdparty/protobuf-3.5.0/src/protobuf-3.5.0/src -isystem /usr/include/subversion-1 -isystem /mesos/build/3rdparty/googletest-1.8.0/src/googletest-1.8.0/googlemock/include -isystem /mesos/build/3rdparty/googletest-1.8.0/src/googletest-1.8.0/googletest/include  -std=c++11 -Wformat-security -fstack-protector-strong -fPIE   -o CMakeFiles/stout-tests.dir/svn_tests.cpp.o -c /mesos/3rdparty/stout/tests/svn_tests.cpp
[ 31%] Building CXX object src/CMakeFiles/mesos-protobufs.dir/messages/log.pb.cc.o
cd /mesos/build/src && /usr/bin/clang++-3.5  -DLIBDIR=\"/usr/local/libmesos\" -DPKGDATADIR=\"/usr/local/share/mesos\" -DPKGLIBEXECDIR=\"/usr/local/libexec/mesos\" -DUSE_SSL_SOCKET=1 -DVERSION=\"1.5.0\" -Dmesos_protobufs_EXPORTS -I/mesos/build/include -I/mesos/build/include/mesos -I/mesos/build/src -I/mesos/src -isystem /mesos/build/3rdparty/protobuf-3.5.0/src/protobuf-3.5.0/src  -std=c++11 -Wformat-security -fstack-protector-strong -fPIC   -o CMakeFiles/mesos-protobufs.dir/messages/log.pb.cc.o -c /mesos/build/src/messages/log.pb.cc
[ 31%] Building CXX object src/CMakeFiles/mesos-protobufs.dir/messages/messages.pb.cc.o
cd /mesos/build/src && /usr/bin/clang++-3.5  -DLIBDIR=\"/usr/local/libmesos\" -DPKGDATADIR=\"/usr/local/share/mesos\" -DPKGLIBEXECDIR=\"/usr/local/libexec/mesos\" -DUSE_SSL_SOCKET=1 -DVERSION=\"1.5.0\" -Dmesos_protobufs_EXPORTS -I/mesos/build/include -I/mesos/build/include/mesos -I/mesos/build/src -I/mesos/src -isystem /mesos/build/3rdparty/protobuf-3.5.0/src/protobuf-3.5.0/src  -std=c++11 -Wformat-security -fstack-protector-strong -fPIC   -o CMakeFiles/mesos-protobufs.dir/messages/messages.pb.cc.o -c /mesos/build/src/messages/messages.pb.cc
[ 31%] Building CXX object src/CMakeFiles/mesos-protobufs.dir/messages/state.pb.cc.o
cd /mesos/build/src && /usr/bin/clang++-3.5  -DLIBDIR=\"/usr/local/libmesos\" -DPKGDATADIR=\"/usr/local/share/mesos\" -DPKGLIBEXECDIR=\"/usr/local/libexec/mesos\" -DUSE_SSL_SOCKET=1 -DVERSION=\"1.5.0\" -Dmesos_protobufs_EXPORTS -I/mesos/build/include -I/mesos/build/include/mesos -I/mesos/build/src -I/mesos/src -isystem /mesos/build/3rdparty/protobuf-3.5.0/src/protobuf-3.5.0/src  -std=c++11 -Wformat-security -fstack-protector-strong -fPIC   -o CMakeFiles/mesos-protobufs.dir/messages/state.pb.cc.o -c /mesos/build/src/messages/state.pb.cc
[ 31%] Building CXX object 3rdparty/stout/tests/CMakeFiles/stout-tests.dir/proc_tests.cpp.o
cd /mesos/build/3rdparty/stout/tests && /usr/bin/clang++-3.5  -DHAVE_LIBZ -DLIBDIR=\"/usr/local/libmesos\" -DPICOJSON_USE_INT64 -DPKGDATADIR=\"/usr/local/share/mesos\" -DPKGLIBEXECDIR=\"/usr/local/libexec/mesos\" -DUSE_SSL_SOCKET=1 -DVERSION=\"1.5.0\" -D__STDC_FORMAT_MACROS -I/mesos/build/3rdparty/stout/tests -I/mesos/3rdparty/stout/include -isystem /usr/include/apr-1.0 -isystem /mesos/build/3rdparty/boost-1.53.0/src/boost-1.53.0 -isystem /mesos/build/3rdparty/elfio-3.2/src/elfio-3.2 -isystem /mesos/build/3rdparty/glog-0.3.3/src/glog-0.3.3-build/include -isystem /mesos/build/3rdparty/picojson-1.3.0/src/picojson-1.3.0 -isystem /mesos/build/3rdparty/protobuf-3.5.0/src/protobuf-3.5.0/src -isystem /usr/include/subversion-1 -isystem /mesos/build/3rdparty/googletest-1.8.0/src/googletest-1.8.0/googlemock/include -isystem /mesos/build/3rdparty/googletest-1.8.0/src/googletest-1.8.0/googletest/include  -std=c++11 -Wformat-security -fstack-protector-strong -fPIE   -o CMakeFiles/stout-tests.dir/proc_tests.cpp.o -c /mesos/3rdparty/stout/tests/proc_tests.cpp
[ 31%] Building CXX object src/CMakeFiles/mesos-protobufs.dir/slave/containerizer/mesos/isolators/network/cni/spec.pb.cc.o
cd /mesos/build/src && /usr/bin/clang++-3.5  -DLIBDIR=\"/usr/local/libmesos\" -DPKGDATADIR=\"/usr/local/share/mesos\" -DPKGLIBEXECDIR=\"/usr/local/libexec/mesos\" -DUSE_SSL_SOCKET=1 -DVERSION=\"1.5.0\" -Dmesos_protobufs_EXPORTS -I/mesos/build/include -I/mesos/build/include/mesos -I/mesos/build/src -I/mesos/src -isystem /mesos/build/3rdparty/protobuf-3.5.0/src/protobuf-3.5.0/src  -std=c++11 -Wformat-security -fstack-protector-strong -fPIC   -o CMakeFiles/mesos-protobufs.dir/slave/containerizer/mesos/isolators/network/cni/spec.pb.cc.o -c /mesos/build/src/slave/containerizer/mesos/isolators/network/cni/spec.pb.cc
[ 31%] Building CXX object src/CMakeFiles/mesos-protobufs.dir/slave/containerizer/mesos/isolators/docker/volume/state.pb.cc.o
cd /mesos/build/src && /usr/bin/clang++-3.5  -DLIBDIR=\"/usr/local/libmesos\" -DPKGDATADIR=\"/usr/local/share/mesos\" -DPKGLIBEXECDIR=\"/usr/local/libexec/mesos\" -DUSE_SSL_SOCKET=1 -DVERSION=\"1.5.0\" -Dmesos_protobufs_EXPORTS -I/mesos/build/include -I/mesos/build/include/mesos -I/mesos/build/src -I/mesos/src -isystem /mesos/build/3rdparty/protobuf-3.5.0/src/protobuf-3.5.0/src  -std=c++11 -Wformat-security -fstack-protector-strong -fPIC   -o CMakeFiles/mesos-protobufs.dir/slave/containerizer/mesos/isolators/docker/volume/state.pb.cc.o -c /mesos/build/src/slave/containerizer/mesos/isolators/docker/volume/state.pb.cc
[ 31%] Building CXX object 3rdparty/stout/tests/CMakeFiles/stout-tests.dir/os/env_tests.cpp.o
cd /mesos/build/3rdparty/stout/tests && /usr/bin/clang++-3.5  -DHAVE_LIBZ -DLIBDIR=\"/usr/local/libmesos\" -DPICOJSON_USE_INT64 -DPKGDATADIR=\"/usr/local/share/mesos\" -DPKGLIBEXECDIR=\"/usr/local/libexec/mesos\" -DUSE_SSL_SOCKET=1 -DVERSION=\"1.5.0\" -D__STDC_FORMAT_MACROS -I/mesos/build/3rdparty/stout/tests -I/mesos/3rdparty/stout/include -isystem /usr/include/apr-1.0 -isystem /mesos/build/3rdparty/boost-1.53.0/src/boost-1.53.0 -isystem /mesos/build/3rdparty/elfio-3.2/src/elfio-3.2 -isystem /mesos/build/3rdparty/glog-0.3.3/src/glog-0.3.3-build/include -isystem /mesos/build/3rdparty/picojson-1.3.0/src/picojson-1.3.0 -isystem /mesos/build/3rdparty/protobuf-3.5.0/src/protobuf-3.5.0/src -isystem /usr/include/subversion-1 -isystem /mesos/build/3rdparty/googletest-1.8.0/src/googletest-1.8.0/googlemock/include -isystem /mesos/build/3rdparty/googletest-1.8.0/src/googletest-1.8.0/googletest/include  -std=c++11 -Wformat-security -fstack-protector-strong -fPIE   -o CMakeFiles/stout-tests.dir/os/env_tests.cpp.o -c /mesos/3rdparty/stout/tests/os/env_tests.cpp
[ 31%] Building CXX object 3rdparty/stout/tests/CMakeFiles/stout-tests.dir/os/filesystem_tests.cpp.o
cd /mesos/build/3rdparty/stout/tests && /usr/bin/clang++-3.5  -DHAVE_LIBZ -DLIBDIR=\"/usr/local/libmesos\" -DPICOJSON_USE_INT64 -DPKGDATADIR=\"/usr/local/share/mesos\" -DPKGLIBEXECDIR=\"/usr/local/libexec/mesos\" -DUSE_SSL_SOCKET=1 -DVERSION=\"1.5.0\" -D__STDC_FORMAT_MACROS -I/mesos/build/3rdparty/stout/tests -I/mesos/3rdparty/stout/include -isystem /usr/include/apr-1.0 -isystem /mesos/build/3rdparty/boost-1.53.0/src/boost-1.53.0 -isystem /mesos/build/3rdparty/elfio-3.2/src/elfio-3.2 -isystem /mesos/build/3rdparty/glog-0.3.3/src/glog-0.3.3-build/include -isystem /mesos/build/3rdparty/picojson-1.3.0/src/picojson-1.3.0 -isystem /mesos/build/3rdparty/protobuf-3.5.0/src/protobuf-3.5.0/src -isystem /usr/include/subversion-1 -isystem /mesos/build/3rdparty/googletest-1.8.0/src/googletest-1.8.0/googlemock/include -isystem /mesos/build/3rdparty/googletest-1.8.0/src/googletest-1.8.0/googletest/include  -std=c++11 -Wformat-security -fstack-protector-strong -fPIE   -o CMakeFiles/stout-tests.dir/os/filesystem_tests.cpp.o -c /mesos/3rdparty/stout/tests/os/filesystem_tests.cpp
[ 31%] Building CXX object 3rdparty/stout/tests/CMakeFiles/stout-tests.dir/os/process_tests.cpp.o
cd /mesos/build/3rdparty/stout/tests && /usr/bin/clang++-3.5  -DHAVE_LIBZ -DLIBDIR=\"/usr/local/libmesos\" -DPICOJSON_USE_INT64 -DPKGDATADIR=\"/usr/local/share/mesos\" -DPKGLIBEXECDIR=\"/usr/local/libexec/mesos\" -DUSE_SSL_SOCKET=1 -DVERSION=\"1.5.0\" -D__STDC_FORMAT_MACROS -I/mesos/build/3rdparty/stout/tests -I/mesos/3rdparty/stout/include -isystem /usr/include/apr-1.0 -isystem /mesos/build/3rdparty/boost-1.53.0/src/boost-1.53.0 -isystem /mesos/build/3rdparty/elfio-3.2/src/elfio-3.2 -isystem /mesos/build/3rdparty/glog-0.3.3/src/glog-0.3.3-build/include -isystem /mesos/build/3rdparty/picojson-1.3.0/src/picojson-1.3.0 -isystem /mesos/build/3rdparty/protobuf-3.5.0/src/protobuf-3.5.0/src -isystem /usr/include/subversion-1 -isystem /mesos/build/3rdparty/googletest-1.8.0/src/googletest-1.8.0/googlemock/include -isystem /mesos/build/3rdparty/googletest-1.8.0/src/googletest-1.8.0/googletest/include  -std=c++11 -Wformat-security -fstack-protector-strong -fPIE   -o CMakeFiles/stout-tests.dir/os/process_tests.cpp.o -c /mesos/3rdparty/stout/tests/os/process_tests.cpp
[ 32%] Building CXX object 3rdparty/stout/tests/CMakeFiles/stout-tests.dir/os/rmdir_tests.cpp.o
cd /mesos/build/3rdparty/stout/tests && /usr/bin/clang++-3.5  -DHAVE_LIBZ -DLIBDIR=\"/usr/local/libmesos\" -DPICOJSON_USE_INT64 -DPKGDATADIR=\"/usr/local/share/mesos\" -DPKGLIBEXECDIR=\"/usr/local/libexec/mesos\" -DUSE_SSL_SOCKET=1 -DVERSION=\"1.5.0\" -D__STDC_FORMAT_MACROS -I/mesos/build/3rdparty/stout/tests -I/mesos/3rdparty/stout/include -isystem /usr/include/apr-1.0 -isystem /mesos/build/3rdparty/boost-1.53.0/src/boost-1.53.0 -isystem /mesos/build/3rdparty/elfio-3.2/src/elfio-3.2 -isystem /mesos/build/3rdparty/glog-0.3.3/src/glog-0.3.3-build/include -isystem /mesos/build/3rdparty/picojson-1.3.0/src/picojson-1.3.0 -isystem /mesos/build/3rdparty/protobuf-3.5.0/src/protobuf-3.5.0/src -isystem /usr/include/subversion-1 -isystem /mesos/build/3rdparty/googletest-1.8.0/src/googletest-1.8.0/googlemock/include -isystem /mesos/build/3rdparty/googletest-1.8.0/src/googletest-1.8.0/googletest/include  -std=c++11 -Wformat-security -fstack-protector-strong -fPIE   -o CMakeFiles/stout-tests.dir/os/rmdir_tests.cpp.o -c /mesos/3rdparty/stout/tests/os/rmdir_tests.cpp
[ 33%] Building CXX object src/CMakeFiles/mesos-protobufs.dir/slave/containerizer/mesos/provisioner/docker/message.pb.cc.o
cd /mesos/build/src && /usr/bin/clang++-3.5  -DLIBDIR=\"/usr/local/libmesos\" -DPKGDATADIR=\"/usr/local/share/mesos\" -DPKGLIBEXECDIR=\"/usr/local/libexec/mesos\" -DUSE_SSL_SOCKET=1 -DVERSION=\"1.5.0\" -Dmesos_protobufs_EXPORTS -I/mesos/build/include -I/mesos/build/include/mesos -I/mesos/build/src -I/mesos/src -isystem /mesos/build/3rdparty/protobuf-3.5.0/src/protobuf-3.5.0/src  -std=c++11 -Wformat-security -fstack-protector-strong -fPIC   -o CMakeFiles/mesos-protobufs.dir/slave/containerizer/mesos/provisioner/docker/message.pb.cc.o -c /mesos/build/src/slave/containerizer/mesos/provisioner/docker/message.pb.cc
[ 33%] Building CXX object src/CMakeFiles/mesos-protobufs.dir/master/registry.pb.cc.o
cd /mesos/build/src && /usr/bin/clang++-3.5  -DLIBDIR=\"/usr/local/libmesos\" -DPKGDATADIR=\"/usr/local/share/mesos\" -DPKGLIBEXECDIR=\"/usr/local/libexec/mesos\" -DUSE_SSL_SOCKET=1 -DVERSION=\"1.5.0\" -Dmesos_protobufs_EXPORTS -I/mesos/build/include -I/mesos/build/include/mesos -I/mesos/build/src -I/mesos/src -isystem /mesos/build/3rdparty/protobuf-3.5.0/src/protobuf-3.5.0/src  -std=c++11 -Wformat-security -fstack-protector-strong -fPIC   -o CMakeFiles/mesos-protobufs.dir/master/registry.pb.cc.o -c /mesos/build/src/master/registry.pb.cc
[ 33%] Building CXX object src/CMakeFiles/mesos-protobufs.dir/resource_provider/registry.pb.cc.o
cd /mesos/build/src && /usr/bin/clang++-3.5  -DLIBDIR=\"/usr/local/libmesos\" -DPKGDATADIR=\"/usr/local/share/mesos\" -DPKGLIBEXECDIR=\"/usr/local/libexec/mesos\" -DUSE_SSL_SOCKET=1 -DVERSION=\"1.5.0\" -Dmesos_protobufs_EXPORTS -I/mesos/build/include -I/mesos/build/include/mesos -I/mesos/build/src -I/mesos/src -isystem /mesos/build/3rdparty/protobuf-3.5.0/src/protobuf-3.5.0/src  -std=c++11 -Wformat-security -fstack-protector-strong -fPIC   -o CMakeFiles/mesos-protobufs.dir/resource_provider/registry.pb.cc.o -c /mesos/build/src/resource_provider/registry.pb.cc
[ 33%] Building CXX object 3rdparty/stout/tests/CMakeFiles/stout-tests.dir/os/socket_tests.cpp.o
cd /mesos/build/3rdparty/stout/tests && /usr/bin/clang++-3.5  -DHAVE_LIBZ -DLIBDIR=\"/usr/local/libmesos\" -DPICOJSON_USE_INT64 -DPKGDATADIR=\"/usr/local/share/mesos\" -DPKGLIBEXECDIR=\"/usr/local/libexec/mesos\" -DUSE_SSL_SOCKET=1 -DVERSION=\"1.5.0\" -D__STDC_FORMAT_MACROS -I/mesos/build/3rdparty/stout/tests -I/mesos/3rdparty/stout/include -isystem /usr/include/apr-1.0 -isystem /mesos/build/3rdparty/boost-1.53.0/src/boost-1.53.0 -isystem /mesos/build/3rdparty/elfio-3.2/src/elfio-3.2 -isystem /mesos/build/3rdparty/glog-0.3.3/src/glog-0.3.3-build/include -isystem /mesos/build/3rdparty/picojson-1.3.0/src/picojson-1.3.0 -isystem /mesos/build/3rdparty/protobuf-3.5.0/src/protobuf-3.5.0/src -isystem /usr/include/subversion-1 -isystem /mesos/build/3rdparty/googletest-1.8.0/src/googletest-1.8.0/googlemock/include -isystem /mesos/build/3rdparty/googletest-1.8.0/src/googletest-1.8.0/googletest/include  -std=c++11 -Wformat-security -fstack-protector-strong -fPIE   -o CMakeFiles/stout-tests.dir/os/socket_tests.cpp.o -c /mesos/3rdparty/stout/tests/os/socket_tests.cpp
[ 33%] Building CXX object 3rdparty/stout/tests/CMakeFiles/stout-tests.dir/os/strerror_tests.cpp.o
cd /mesos/build/3rdparty/stout/tests && /usr/bin/clang++-3.5  -DHAVE_LIBZ -DLIBDIR=\"/usr/local/libmesos\" -DPICOJSON_USE_INT64 -DPKGDATADIR=\"/usr/local/share/mesos\" -DPKGLIBEXECDIR=\"/usr/local/libexec/mesos\" -DUSE_SSL_SOCKET=1 -DVERSION=\"1.5.0\" -D__STDC_FORMAT_MACROS -I/mesos/build/3rdparty/stout/tests -I/mesos/3rdparty/stout/include -isystem /usr/include/apr-1.0 -isystem /mesos/build/3rdparty/boost-1.53.0/src/boost-1.53.0 -isystem /mesos/build/3rdparty/elfio-3.2/src/elfio-3.2 -isystem /mesos/build/3rdparty/glog-0.3.3/src/glog-0.3.3-build/include -isystem /mesos/build/3rdparty/picojson-1.3.0/src/picojson-1.3.0 -isystem /mesos/build/3rdparty/protobuf-3.5.0/src/protobuf-3.5.0/src -isystem /usr/include/subversion-1 -isystem /mesos/build/3rdparty/googletest-1.8.0/src/googletest-1.8.0/googlemock/include -isystem /mesos/build/3rdparty/googletest-1.8.0/src/googletest-1.8.0/googletest/include  -std=c++11 -Wformat-security -fstack-protector-strong -fPIE   -o CMakeFiles/stout-tests.dir/os/strerror_tests.cpp.o -c /mesos/3rdparty/stout/tests/os/strerror_tests.cpp
[ 33%] Building CXX object 3rdparty/stout/tests/CMakeFiles/stout-tests.dir/os/systems_tests.cpp.o
cd /mesos/build/3rdparty/stout/tests && /usr/bin/clang++-3.5  -DHAVE_LIBZ -DLIBDIR=\"/usr/local/libmesos\" -DPICOJSON_USE_INT64 -DPKGDATADIR=\"/usr/local/share/mesos\" -DPKGLIBEXECDIR=\"/usr/local/libexec/mesos\" -DUSE_SSL_SOCKET=1 -DVERSION=\"1.5.0\" -D__STDC_FORMAT_MACROS -I/mesos/build/3rdparty/stout/tests -I/mesos/3rdparty/stout/include -isystem /usr/include/apr-1.0 -isystem /mesos/build/3rdparty/boost-1.53.0/src/boost-1.53.0 -isystem /mesos/build/3rdparty/elfio-3.2/src/elfio-3.2 -isystem /mesos/build/3rdparty/glog-0.3.3/src/glog-0.3.3-build/include -isystem /mesos/build/3rdparty/picojson-1.3.0/src/picojson-1.3.0 -isystem /mesos/build/3rdparty/protobuf-3.5.0/src/protobuf-3.5.0/src -isystem /usr/include/subversion-1 -isystem /mesos/build/3rdparty/googletest-1.8.0/src/googletest-1.8.0/googlemock/include -isystem /mesos/build/3rdparty/googletest-1.8.0/src/googletest-1.8.0/googletest/include  -std=c++11 -Wformat-security -fstack-protector-strong -fPIE   -o CMakeFiles/stout-tests.dir/os/systems_tests.cpp.o -c /mesos/3rdparty/stout/tests/os/systems_tests.cpp
[ 33%] Building CXX object 3rdparty/stout/tests/CMakeFiles/stout-tests.dir/os/sendfile_tests.cpp.o
cd /mesos/build/3rdparty/stout/tests && /usr/bin/clang++-3.5  -DHAVE_LIBZ -DLIBDIR=\"/usr/local/libmesos\" -DPICOJSON_USE_INT64 -DPKGDATADIR=\"/usr/local/share/mesos\" -DPKGLIBEXECDIR=\"/usr/local/libexec/mesos\" -DUSE_SSL_SOCKET=1 -DVERSION=\"1.5.0\" -D__STDC_FORMAT_MACROS -I/mesos/build/3rdparty/stout/tests -I/mesos/3rdparty/stout/include -isystem /usr/include/apr-1.0 -isystem /mesos/build/3rdparty/boost-1.53.0/src/boost-1.53.0 -isystem /mesos/build/3rdparty/elfio-3.2/src/elfio-3.2 -isystem /mesos/build/3rdparty/glog-0.3.3/src/glog-0.3.3-build/include -isystem /mesos/build/3rdparty/picojson-1.3.0/src/picojson-1.3.0 -isystem /mesos/build/3rdparty/protobuf-3.5.0/src/protobuf-3.5.0/src -isystem /usr/include/subversion-1 -isystem /mesos/build/3rdparty/googletest-1.8.0/src/googletest-1.8.0/googlemock/include -isystem /mesos/build/3rdparty/googletest-1.8.0/src/googletest-1.8.0/googletest/include  -std=c++11 -Wformat-security -fstack-protector-strong -fPIE   -o CMakeFiles/stout-tests.dir/os/sendfile_tests.cpp.o -c /mesos/3rdparty/stout/tests/os/sendfile_tests.cpp
[ 33%] Building CXX object 3rdparty/stout/tests/CMakeFiles/stout-tests.dir/os/signals_tests.cpp.o
cd /mesos/build/3rdparty/stout/tests && /usr/bin/clang++-3.5  -DHAVE_LIBZ -DLIBDIR=\"/usr/local/libmesos\" -DPICOJSON_USE_INT64 -DPKGDATADIR=\"/usr/local/share/mesos\" -DPKGLIBEXECDIR=\"/usr/local/libexec/mesos\" -DUSE_SSL_SOCKET=1 -DVERSION=\"1.5.0\" -D__STDC_FORMAT_MACROS -I/mesos/build/3rdparty/stout/tests -I/mesos/3rdparty/stout/include -isystem /usr/include/apr-1.0 -isystem /mesos/build/3rdparty/boost-1.53.0/src/boost-1.53.0 -isystem /mesos/build/3rdparty/elfio-3.2/src/elfio-3.2 -isystem /mesos/build/3rdparty/glog-0.3.3/src/glog-0.3.3-build/include -isystem /mesos/build/3rdparty/picojson-1.3.0/src/picojson-1.3.0 -isystem /mesos/build/3rdparty/protobuf-3.5.0/src/protobuf-3.5.0/src -isystem /usr/include/subversion-1 -isystem /mesos/build/3rdparty/googletest-1.8.0/src/googletest-1.8.0/googlemock/include -isystem /mesos/build/3rdparty/googletest-1.8.0/src/googletest-1.8.0/googletest/include  -std=c++11 -Wformat-security -fstack-protector-strong -fPIE   -o CMakeFiles/stout-tests.dir/os/signals_tests.cpp.o -c /mesos/3rdparty/stout/tests/os/signals_tests.cpp
[ 33%] Linking CXX shared library libmesos-protobufs.so
cd /mesos/build/src && /usr/local/bin/cmake -E cmake_link_script CMakeFiles/mesos-protobufs.dir/link.txt --verbose=1
/usr/bin/clang++-3.5 -fPIC  -std=c++11 -Wformat-security -fstack-protector-strong  -shared -Wl,-soname,libmesos-protobufs.so -o libmesos-protobufs.so CMakeFiles/mesos-protobufs.dir/__/include/mesos/agent/agent.pb.cc.o CMakeFiles/mesos-protobufs.dir/__/include/mesos/allocator/allocator.pb.cc.o CMakeFiles/mesos-protobufs.dir/__/include/mesos/appc/spec.pb.cc.o CMakeFiles/mesos-protobufs.dir/__/include/mesos/authentication/authentication.pb.cc.o CMakeFiles/mesos-protobufs.dir/__/include/mesos/authorizer/acls.pb.cc.o CMakeFiles/mesos-protobufs.dir/__/include/mesos/authorizer/authorizer.pb.cc.o CMakeFiles/mesos-protobufs.dir/__/include/mesos/docker/spec.pb.cc.o CMakeFiles/mesos-protobufs.dir/__/include/mesos/docker/v1.pb.cc.o CMakeFiles/mesos-protobufs.dir/__/include/mesos/docker/v2.pb.cc.o CMakeFiles/mesos-protobufs.dir/__/include/mesos/maintenance/maintenance.pb.cc.o CMakeFiles/mesos-protobufs.dir/__/include/mesos/master/master.pb.cc.o CMakeFiles/mesos-protobufs.dir/__/include/mesos/module/hook.pb.cc.o CMakeFiles/mesos-protobufs.dir/__/include/mesos/module/module.pb.cc.o CMakeFiles/mesos-protobufs.dir/__/include/mesos/oci/spec.pb.cc.o CMakeFiles/mesos-protobufs.dir/__/include/mesos/quota/quota.pb.cc.o CMakeFiles/mesos-protobufs.dir/__/include/mesos/resource_provider/resource_provider.pb.cc.o CMakeFiles/mesos-protobufs.dir/__/include/mesos/slave/containerizer.pb.cc.o CMakeFiles/mesos-protobufs.dir/__/include/mesos/slave/oversubscription.pb.cc.o CMakeFiles/mesos-protobufs.dir/__/include/mesos/state/state.pb.cc.o CMakeFiles/mesos-protobufs.dir/__/include/mesos/uri/uri.pb.cc.o CMakeFiles/mesos-protobufs.dir/__/include/mesos/executor/executor.pb.cc.o CMakeFiles/mesos-protobufs.dir/__/include/mesos/fetcher/fetcher.pb.cc.o CMakeFiles/mesos-protobufs.dir/__/include/mesos/mesos.pb.cc.o CMakeFiles/mesos-protobufs.dir/__/include/mesos/scheduler/scheduler.pb.cc.o CMakeFiles/mesos-protobufs.dir/__/include/mesos/v1/agent/agent.pb.cc.o CMakeFiles/mesos-protobufs.dir/__/include/mesos/v1/allocator/allocator.pb.cc.o CMakeFiles/mesos-protobufs.dir/__/include/mesos/v1/executor/executor.pb.cc.o CMakeFiles/mesos-protobufs.dir/__/include/mesos/v1/maintenance/maintenance.pb.cc.o CMakeFiles/mesos-protobufs.dir/__/include/mesos/v1/master/master.pb.cc.o CMakeFiles/mesos-protobufs.dir/__/include/mesos/v1/mesos.pb.cc.o CMakeFiles/mesos-protobufs.dir/__/include/mesos/v1/quota/quota.pb.cc.o CMakeFiles/mesos-protobufs.dir/__/include/mesos/v1/resource_provider/resource_provider.pb.cc.o CMakeFiles/mesos-protobufs.dir/__/include/mesos/v1/scheduler/scheduler.pb.cc.o CMakeFiles/mesos-protobufs.dir/messages/flags.pb.cc.o CMakeFiles/mesos-protobufs.dir/messages/log.pb.cc.o CMakeFiles/mesos-protobufs.dir/messages/messages.pb.cc.o CMakeFiles/mesos-protobufs.dir/messages/state.pb.cc.o CMakeFiles/mesos-protobufs.dir/slave/containerizer/mesos/isolators/network/cni/spec.pb.cc.o CMakeFiles/mesos-protobufs.dir/slave/containerizer/mesos/isolators/docker/volume/state.pb.cc.o CMakeFiles/mesos-protobufs.dir/slave/containerizer/mesos/provisioner/docker/message.pb.cc.o CMakeFiles/mesos-protobufs.dir/master/registry.pb.cc.o CMakeFiles/mesos-protobufs.dir/resource_provider/registry.pb.cc.o -Wl,-rpath,/mesos/build/3rdparty/protobuf-3.5.0/src/protobuf-3.5.0-build ../3rdparty/protobuf-3.5.0/src/protobuf-3.5.0-build/libprotobuf.so 
make[3]: Leaving directory `/mesos/build'
[ 33%] Built target mesos-protobufs
[ 33%] Linking CXX executable stout-tests
cd /mesos/build/3rdparty/stout/tests && /usr/local/bin/cmake -E cmake_link_script CMakeFiles/stout-tests.dir/link.txt --verbose=1
/usr/bin/clang++-3.5   -std=c++11 -Wformat-security -fstack-protector-strong   CMakeFiles/stout-tests.dir/base64_tests.cpp.o CMakeFiles/stout-tests.dir/bits_tests.cpp.o CMakeFiles/stout-tests.dir/bytes_tests.cpp.o CMakeFiles/stout-tests.dir/cache_tests.cpp.o CMakeFiles/stout-tests.dir/duration_tests.cpp.o CMakeFiles/stout-tests.dir/dynamiclibrary_tests.cpp.o CMakeFiles/stout-tests.dir/error_tests.cpp.o CMakeFiles/stout-tests.dir/flags_tests.cpp.o CMakeFiles/stout-tests.dir/gzip_tests.cpp.o CMakeFiles/stout-tests.dir/hashmap_tests.cpp.o CMakeFiles/stout-tests.dir/hashset_tests.cpp.o CMakeFiles/stout-tests.dir/interval_tests.cpp.o CMakeFiles/stout-tests.dir/ip_tests.cpp.o CMakeFiles/stout-tests.dir/json_tests.cpp.o CMakeFiles/stout-tests.dir/jsonify_tests.cpp.o CMakeFiles/stout-tests.dir/lambda_tests.cpp.o CMakeFiles/stout-tests.dir/linkedhashmap_tests.cpp.o CMakeFiles/stout-tests.dir/mac_tests.cpp.o CMakeFiles/stout-tests.dir/main.cpp.o CMakeFiles/stout-tests.dir/multimap_tests.cpp.o CMakeFiles/stout-tests.dir/none_tests.cpp.o CMakeFiles/stout-tests.dir/numify_tests.cpp.o CMakeFiles/stout-tests.dir/option_tests.cpp.o CMakeFiles/stout-tests.dir/os_tests.cpp.o CMakeFiles/stout-tests.dir/path_tests.cpp.o CMakeFiles/stout-tests.dir/recordio_tests.cpp.o CMakeFiles/stout-tests.dir/result_tests.cpp.o CMakeFiles/stout-tests.dir/some_tests.cpp.o CMakeFiles/stout-tests.dir/strings_tests.cpp.o CMakeFiles/stout-tests.dir/subcommand_tests.cpp.o CMakeFiles/stout-tests.dir/try_tests.cpp.o CMakeFiles/stout-tests.dir/uuid_tests.cpp.o CMakeFiles/stout-tests.dir/variant_tests.cpp.o CMakeFiles/stout-tests.dir/version_tests.cpp.o CMakeFiles/stout-tests.dir/protobuf_tests.cpp.o CMakeFiles/stout-tests.dir/protobuf_tests.pb.cc.o CMakeFiles/stout-tests.dir/svn_tests.cpp.o CMakeFiles/stout-tests.dir/proc_tests.cpp.o CMakeFiles/stout-tests.dir/os/env_tests.cpp.o CMakeFiles/stout-tests.dir/os/filesystem_tests.cpp.o CMakeFiles/stout-tests.dir/os/process_tests.cpp.o CMakeFiles/stout-tests.dir/os/rmdir_tests.cpp.o CMakeFiles/stout-tests.dir/os/socket_tests.cpp.o CMakeFiles/stout-tests.dir/os/strerror_tests.cpp.o CMakeFiles/stout-tests.dir/os/systems_tests.cpp.o CMakeFiles/stout-tests.dir/os/sendfile_tests.cpp.o CMakeFiles/stout-tests.dir/os/signals_tests.cpp.o  -o stout-tests -Wl,-rpath,/mesos/build/3rdparty/glog-0.3.3/src/glog-0.3.3-build/lib:/mesos/build/3rdparty/protobuf-3.5.0/src/protobuf-3.5.0-build /usr/lib/x86_64-linux-gnu/libapr-1.so /usr/lib/x86_64-linux-gnu/libcurl.so ../../glog-0.3.3/src/glog-0.3.3-build/lib/libglog.so ../../protobuf-3.5.0/src/protobuf-3.5.0-build/libprotobuf.so -lpthread /usr/lib/x86_64-linux-gnu/libz.so -lrt -ldl /usr/lib/x86_64-linux-gnu/libsvn_delta-1.so /usr/lib/x86_64-linux-gnu/libsvn_diff-1.so /usr/lib/x86_64-linux-gnu/libsvn_subr-1.so ../../googletest-1.8.0/src/googletest-1.8.0-build/googlemock/libgmock.a ../../googletest-1.8.0/src/googletest-1.8.0-build/googlemock/gtest/libgtest.a 
make[3]: Leaving directory `/mesos/build'
[ 33%] Built target stout-tests
make[2]: Leaving directory `/mesos/build'
make[1]: *** [CMakeFiles/check.dir/rule] Error 2
make[1]: Leaving directory `/mesos/build'
make: *** [check] Error 2
+ docker rmi mesos-1511146648-13928
Untagged: mesos-1511146648-13928:latest
Deleted: sha256:0d8bd773e504aa9d04e4bc6ec9e6299abd8d9b208d9dfe43f6609fe0bf452072
Deleted: sha256:3fd1f7c1b2f323b0c0b836c8d5657563c13936d00d5c5f22247969f06450d3f8
Deleted: sha256:f554083ab5517d3d165fcb2116f58ab75b53a037c9dd88c3ec4dbb577c4deedf
Deleted: sha256:d3eb71e6cf0076cdf6f75c07c10de43e2d8dc1d999dbe8ac8d4fa33e1dac3417
Deleted: sha256:b383a9f519eec762aa217fe0477c659723d3e1897435ca686062b4e603a0e9ee
Deleted: sha256:15c33943f8289ce96c38b5821754c19602577cbb66fdfd0b034524023b73f261
Deleted: sha256:6cfa0e191638e0282a117a609ffeec40e833f7ad358e2bb929c428a8a3b213c6
Deleted: sha256:7fff90d02b974d68b513be6ba9d4c67a7a4b72365ddd0e32318ecb86f1afb391
Deleted: sha256:32121c99bb2440084b045422d2a0adf9d4e89cc9cea26907914a03a05c1b1f9a
Deleted: sha256:11a87df5f8a6bd063ac4117b61c20f26a7fead0d94f2059e84390a364cecf905
Deleted: sha256:129c471fc00f933fd50d255bec6b987f8c36db5851293b93efddfeb2f2510ee3
Deleted: sha256:16aea07ed0171ad56b6a0decfdb04fc8964913eddafeed2257a3fc41ef65fd25
Deleted: sha256:b2c00af8d095386d02a1c5742a520fd276661f0b88a71e375df100d81c548418
Deleted: sha256:26e89c9f026df3d3c3abcf105dba85ae6c7af68473efd7ca13acd54d9204e4ec
Deleted: sha256:316fe7fafb848ae0ae3c29cff5ec2813d7eaa98bc828c81c5c23e7ab9a2d0726
Deleted: sha256:277570616314bb1f1f3e12f3e496e80c8b7cc3120ed7e22723e4e20bfbe20b0c
Deleted: sha256:f1bbddb1a0bca309888c048f42adfee8590adfd1f4f60b80015a6d0dc42f18c1
Deleted: sha256:0ac7b9a3390765a6e51ed6f2784a98feb6b57f8a0b90924c712b269888edd080
Deleted: sha256:235151cadf8c54344998d80d44ff39cd10b15125af35f310d53304d4464b8443
Deleted: sha256:8b83567d3647488e081497e3bd26107f36248c36bcec560ea0caf3ce812b40d3
Deleted: sha256:6a279ff80eb3728204044ea584ec28009d5202bd255c2031b42145724108c991
Deleted: sha256:d35051e461b6ceb3f0a660093ddc0d7c93b45efe7c1b5a56cd9ae112b20ef68f
Deleted: sha256:3703dfc4e223d5d5688368e8f6213afc4b190af1c40e9c8f2d4faaaf5f4a920b
Deleted: sha256:0c59aaaed5e690da2c5fcb59353b8b3c9c3b210a66e821659050753c679eac39
Deleted: sha256:add0858679d8e2f5178b6cc2724deebf5d1c70004a03da9a435242cf931b4333
Deleted: sha256:cf20b15d5ab4575cd4326ed29fc8c38928f300fe13159bbc7cf5ac148affca4b
Deleted: sha256:8972ef2d2867b99c55961031653253f943e5ed38585439d7d25c46b70ea8661d
Deleted: sha256:832947d6d29bdf3816ee919c6ba4d2775936a1858e76187bdcd6c79b957709c2
Deleted: sha256:5637f00496b5e5b5a9dcecf081f80dab263c98ee9260e087367621870bebd6f9
Deleted: sha256:488a8067da5f5ae83bdfa3dacf6bc9348700f10564403b53ff5f192b95ee4d74
Build step 'Execute shell' marked build as failure
Not sending mail to unregistered user benjamin.hindman@gmail.com


Mime
View raw message