mesos-builds mailing list archives

Site index · List index
Message view « Date » · « Thread »
Top « Date » · « Thread »
From Apache Jenkins Server <jenk...@builds.apache.org>
Subject Build failed in Jenkins: Mesos-Buildbot » autotools,gcc,--verbose --disable-libtool-wrappers,GLOG_v=1 MESOS_VERBOSE=1,centos:7,(ubuntu)&&(!ubuntu-us1)&&(!ubuntu-eu2)&&(!qnode3)&&(!H23) #4404
Date Sat, 04 Nov 2017 11:11:39 GMT
See <https://builds.apache.org/job/Mesos-Buildbot/BUILDTOOL=autotools,COMPILER=gcc,CONFIGURATION=--verbose%20--disable-libtool-wrappers,ENVIRONMENT=GLOG_v=1%20MESOS_VERBOSE=1,OS=centos%3A7,label_exp=(ubuntu)&&(!ubuntu-us1)&&(!ubuntu-eu2)&&(!qnode3)&&(!H23)/4404/display/redirect?page=changes>

Changes:

[jpeach] Fixed default executor handling of nested container status.

[jpeach] Added MESOS-8080 to the 1.4.1 CHANGELOG.

------------------------------------------
[...truncated 30.85 MB...]
I1104 11:11:23.367745  6158 http.cpp:1045] Creating default 'basic' HTTP authenticator for
realm 'mesos-agent-readwrite'
I1104 11:11:23.369953  6158 slave.cpp:565] Agent resources: [{"name":"cpus","scalar":{"value":2.0},"type":"SCALAR"},{"name":"mem","scalar":{"value":1024.0},"type":"SCALAR"},{"name":"disk","scalar":{"value":1024.0},"type":"SCALAR"},{"name":"ports","ranges":{"range":[{"begin":31000,"end":32000}]},"type":"RANGES"}]
I1104 11:11:23.370395  6158 slave.cpp:573] Agent attributes: [  ]
I1104 11:11:23.370415  6158 slave.cpp:582] Agent hostname: 83a518e9c198
I1104 11:11:23.370646  6156 status_update_manager.cpp:177] Pausing sending status updates
I1104 11:11:23.372691  6153 state.cpp:64] Recovering state from '/tmp/Endpoint_SlaveEndpointTest_AuthorizedRequest_2_xo4w6i/meta'
I1104 11:11:23.373147  6155 status_update_manager.cpp:203] Recovering status update manager
I1104 11:11:23.373508  6157 containerizer.cpp:609] Recovering containerizer
I1104 11:11:23.375556  6154 provisioner.cpp:416] Provisioner recovery complete
I1104 11:11:23.376011  6158 slave.cpp:6288] Finished recovery
I1104 11:11:23.376622  6158 slave.cpp:6470] Querying resource estimator for oversubscribable
resources
I1104 11:11:23.376971  6154 slave.cpp:6484] Received oversubscribable resources {} from the
resource estimator
I1104 11:11:23.380903  6153 process.cpp:3938] Handling HTTP event for process 'slave(796)'
with path: '/slave(796)/containers'
I1104 11:11:23.383002  6158 http.cpp:1185] HTTP GET for /slave(796)/containers from 172.17.0.2:56298
I1104 11:11:23.383113  6158 http.cpp:976] Authorizing principal 'test-principal' to GET the
'/containers' endpoint
I1104 11:11:23.388890  6133 slave.cpp:843] Agent terminating
[       OK ] Endpoint/SlaveEndpointTest.AuthorizedRequest/2 (46 ms)
[ RUN      ] Endpoint/SlaveEndpointTest.UnauthorizedRequest/0
I1104 11:11:23.406121  6133 containerizer.cpp:246] Using isolation: posix/cpu,posix/mem,filesystem/posix,network/cni,environment_secret
W1104 11:11:23.406934  6133 backend.cpp:76] Failed to create 'overlay' backend: OverlayBackend
requires root privileges
W1104 11:11:23.407155  6133 backend.cpp:76] Failed to create 'bind' backend: BindBackend requires
root privileges
I1104 11:11:23.407204  6133 provisioner.cpp:255] Using default backend 'copy'
I1104 11:11:23.412793  6155 slave.cpp:250] Mesos agent started on (797)@172.17.0.2:33337
I1104 11:11:23.412844  6155 slave.cpp:251] Flags at startup: --acls="" --appc_simple_discovery_uri_prefix="http://"
--appc_store_dir="/tmp/Endpoint_SlaveEndpointTest_UnauthorizedRequest_0_Mh1B5A/store/appc"
--authenticate_http_readonly="true" --authenticate_http_readwrite="true" --authenticatee="crammd5"
--authentication_backoff_factor="1secs" --authorizer="local" --cgroups_cpu_enable_pids_and_tids_count="false"
--cgroups_enable_cfs="false" --cgroups_hierarchy="/sys/fs/cgroup" --cgroups_limit_swap="false"
--cgroups_root="mesos" --container_disk_watch_interval="15secs" --containerizers="mesos" --credential="/tmp/Endpoint_SlaveEndpointTest_UnauthorizedRequest_0_Mh1B5A/credential"
--default_role="*" --disallow_sharing_agent_pid_namespace="false" --disk_watch_interval="1mins"
--docker="docker" --docker_kill_orphans="true" --docker_registry="https://registry-1.docker.io"
--docker_remove_delay="6hrs" --docker_socket="/var/run/docker.sock" --docker_stop_timeout="0ns"
--docker_store_dir="/tmp/Endpoint_SlaveEndpointTest_UnauthorizedRequest_0_Mh1B5A/store/docker"
--docker_volume_checkpoint_dir="/var/run/mesos/isolators/docker/volume" --enforce_container_disk_quota="false"
--executor_registration_timeout="1mins" --executor_reregistration_timeout="2secs" --executor_shutdown_grace_period="5secs"
--fetcher_cache_dir="/tmp/Endpoint_SlaveEndpointTest_UnauthorizedRequest_0_Mh1B5A/fetch" --fetcher_cache_size="2GB"
--frameworks_home="" --gc_delay="1weeks" --gc_disk_headroom="0.1" --hadoop_home="" --help="false"
--hostname_lookup="true" --http_command_executor="false" --http_credentials="/tmp/Endpoint_SlaveEndpointTest_UnauthorizedRequest_0_Mh1B5A/http_credentials"
--http_heartbeat_interval="30secs" --initialize_driver_logging="true" --isolation="posix/cpu,posix/mem"
--launcher="posix" --launcher_dir="/mesos/mesos-1.4.1/_build/src" --logbufsecs="0" --logging_level="INFO"
--max_completed_executors_per_framework="150" --oversubscribed_resources_interval="15secs"
--perf_duration="10secs" --perf_interval="1mins" --port="5051" --qos_correction_interval_min="0ns"
--quiet="false" --recover="reconnect" --recovery_timeout="15mins" --registration_backoff_factor="10ms"
--resources="cpus:2;gpus:0;mem:1024;disk:1024;ports:[31000-32000]" --revocable_cpu_low_priority="true"
--runtime_dir="/tmp/Endpoint_SlaveEndpointTest_UnauthorizedRequest_0_Mh1B5A" --sandbox_directory="/mnt/mesos/sandbox"
--strict="true" --switch_user="true" --systemd_enable_support="true" --systemd_runtime_directory="/run/systemd/system"
--version="false" --work_dir="/tmp/Endpoint_SlaveEndpointTest_UnauthorizedRequest_0_zNzXQJ"
I1104 11:11:23.414306  6155 credentials.hpp:86] Loading credential for authentication from
'/tmp/Endpoint_SlaveEndpointTest_UnauthorizedRequest_0_Mh1B5A/credential'
I1104 11:11:23.415001  6155 slave.cpp:283] Agent using credential for: test-principal
I1104 11:11:23.415261  6155 credentials.hpp:37] Loading credentials for authentication from
'/tmp/Endpoint_SlaveEndpointTest_UnauthorizedRequest_0_Mh1B5A/http_credentials'
I1104 11:11:23.415973  6155 http.cpp:1045] Creating default 'basic' HTTP authenticator for
realm 'mesos-agent-readonly'
I1104 11:11:23.416604  6155 http.cpp:1045] Creating default 'basic' HTTP authenticator for
realm 'mesos-agent-readwrite'
I1104 11:11:23.419355  6155 slave.cpp:565] Agent resources: [{"name":"cpus","scalar":{"value":2.0},"type":"SCALAR"},{"name":"mem","scalar":{"value":1024.0},"type":"SCALAR"},{"name":"disk","scalar":{"value":1024.0},"type":"SCALAR"},{"name":"ports","ranges":{"range":[{"begin":31000,"end":32000}]},"type":"RANGES"}]
I1104 11:11:23.420209  6155 slave.cpp:573] Agent attributes: [  ]
I1104 11:11:23.420392  6155 slave.cpp:582] Agent hostname: 83a518e9c198
I1104 11:11:23.421007  6154 status_update_manager.cpp:177] Pausing sending status updates
I1104 11:11:23.423367  6153 state.cpp:64] Recovering state from '/tmp/Endpoint_SlaveEndpointTest_UnauthorizedRequest_0_zNzXQJ/meta'
I1104 11:11:23.423954  6156 status_update_manager.cpp:203] Recovering status update manager
I1104 11:11:23.424494  6152 containerizer.cpp:609] Recovering containerizer
I1104 11:11:23.426425  6153 provisioner.cpp:416] Provisioner recovery complete
I1104 11:11:23.427132  6152 slave.cpp:6288] Finished recovery
I1104 11:11:23.427783  6152 slave.cpp:6470] Querying resource estimator for oversubscribable
resources
I1104 11:11:23.428198  6157 slave.cpp:6484] Received oversubscribable resources {} from the
resource estimator
I1104 11:11:23.432286  6154 process.cpp:3938] Handling HTTP event for process 'slave(797)'
with path: '/slave(797)/monitor/statistics'
I1104 11:11:23.435005  6152 http.cpp:1185] HTTP GET for /slave(797)/monitor/statistics from
172.17.0.2:56300
I1104 11:11:23.435129  6152 http.cpp:976] Authorizing principal 'test-principal' to GET the
'/monitor/statistics' endpoint
I1104 11:11:23.439553  6158 slave.cpp:843] Agent terminating
[       OK ] Endpoint/SlaveEndpointTest.UnauthorizedRequest/0 (51 ms)
[ RUN      ] Endpoint/SlaveEndpointTest.UnauthorizedRequest/1
I1104 11:11:23.457798  6133 containerizer.cpp:246] Using isolation: posix/cpu,posix/mem,filesystem/posix,network/cni,environment_secret
W1104 11:11:23.458586  6133 backend.cpp:76] Failed to create 'overlay' backend: OverlayBackend
requires root privileges
W1104 11:11:23.458798  6133 backend.cpp:76] Failed to create 'bind' backend: BindBackend requires
root privileges
I1104 11:11:23.458848  6133 provisioner.cpp:255] Using default backend 'copy'
I1104 11:11:23.464483  6154 slave.cpp:250] Mesos agent started on (798)@172.17.0.2:33337
I1104 11:11:23.464524  6154 slave.cpp:251] Flags at startup: --acls="" --appc_simple_discovery_uri_prefix="http://"
--appc_store_dir="/tmp/Endpoint_SlaveEndpointTest_UnauthorizedRequest_1_GMX0u2/store/appc"
--authenticate_http_readonly="true" --authenticate_http_readwrite="true" --authenticatee="crammd5"
--authentication_backoff_factor="1secs" --authorizer="local" --cgroups_cpu_enable_pids_and_tids_count="false"
--cgroups_enable_cfs="false" --cgroups_hierarchy="/sys/fs/cgroup" --cgroups_limit_swap="false"
--cgroups_root="mesos" --container_disk_watch_interval="15secs" --containerizers="mesos" --credential="/tmp/Endpoint_SlaveEndpointTest_UnauthorizedRequest_1_GMX0u2/credential"
--default_role="*" --disallow_sharing_agent_pid_namespace="false" --disk_watch_interval="1mins"
--docker="docker" --docker_kill_orphans="true" --docker_registry="https://registry-1.docker.io"
--docker_remove_delay="6hrs" --docker_socket="/var/run/docker.sock" --docker_stop_timeout="0ns"
--docker_store_dir="/tmp/Endpoint_SlaveEndpointTest_UnauthorizedRequest_1_GMX0u2/store/docker"
--docker_volume_checkpoint_dir="/var/run/mesos/isolators/docker/volume" --enforce_container_disk_quota="false"
--executor_registration_timeout="1mins" --executor_reregistration_timeout="2secs" --executor_shutdown_grace_period="5secs"
--fetcher_cache_dir="/tmp/Endpoint_SlaveEndpointTest_UnauthorizedRequest_1_GMX0u2/fetch" --fetcher_cache_size="2GB"
--frameworks_home="" --gc_delay="1weeks" --gc_disk_headroom="0.1" --hadoop_home="" --help="false"
--hostname_lookup="true" --http_command_executor="false" --http_credentials="/tmp/Endpoint_SlaveEndpointTest_UnauthorizedRequest_1_GMX0u2/http_credentials"
--http_heartbeat_interval="30secs" --initialize_driver_logging="true" --isolation="posix/cpu,posix/mem"
--launcher="posix" --launcher_dir="/mesos/mesos-1.4.1/_build/src" --logbufsecs="0" --logging_level="INFO"
--max_completed_executors_per_framework="150" --oversubscribed_resources_interval="15secs"
--perf_duration="10secs" --perf_interval="1mins" --port="5051" --qos_correction_interval_min="0ns"
--quiet="false" --recover="reconnect" --recovery_timeout="15mins" --registration_backoff_factor="10ms"
--resources="cpus:2;gpus:0;mem:1024;disk:1024;ports:[31000-32000]" --revocable_cpu_low_priority="true"
--runtime_dir="/tmp/Endpoint_SlaveEndpointTest_UnauthorizedRequest_1_GMX0u2" --sandbox_directory="/mnt/mesos/sandbox"
--strict="true" --switch_user="true" --systemd_enable_support="true" --systemd_runtime_directory="/run/systemd/system"
--version="false" --work_dir="/tmp/Endpoint_SlaveEndpointTest_UnauthorizedRequest_1_5fxZ7a"
I1104 11:11:23.465360  6154 credentials.hpp:86] Loading credential for authentication from
'/tmp/Endpoint_SlaveEndpointTest_UnauthorizedRequest_1_GMX0u2/credential'
I1104 11:11:23.465754  6154 slave.cpp:283] Agent using credential for: test-principal
I1104 11:11:23.465780  6154 credentials.hpp:37] Loading credentials for authentication from
'/tmp/Endpoint_SlaveEndpointTest_UnauthorizedRequest_1_GMX0u2/http_credentials'
I1104 11:11:23.466240  6154 http.cpp:1045] Creating default 'basic' HTTP authenticator for
realm 'mesos-agent-readonly'
I1104 11:11:23.466745  6154 http.cpp:1045] Creating default 'basic' HTTP authenticator for
realm 'mesos-agent-readwrite'
I1104 11:11:23.469233  6154 slave.cpp:565] Agent resources: [{"name":"cpus","scalar":{"value":2.0},"type":"SCALAR"},{"name":"mem","scalar":{"value":1024.0},"type":"SCALAR"},{"name":"disk","scalar":{"value":1024.0},"type":"SCALAR"},{"name":"ports","ranges":{"range":[{"begin":31000,"end":32000}]},"type":"RANGES"}]
I1104 11:11:23.469681  6154 slave.cpp:573] Agent attributes: [  ]
I1104 11:11:23.469700  6154 slave.cpp:582] Agent hostname: 83a518e9c198
I1104 11:11:23.469943  6153 status_update_manager.cpp:177] Pausing sending status updates
I1104 11:11:23.472599  6155 state.cpp:64] Recovering state from '/tmp/Endpoint_SlaveEndpointTest_UnauthorizedRequest_1_5fxZ7a/meta'
I1104 11:11:23.473075  6152 status_update_manager.cpp:203] Recovering status update manager
I1104 11:11:23.473392  6156 containerizer.cpp:609] Recovering containerizer
I1104 11:11:23.475484  6152 provisioner.cpp:416] Provisioner recovery complete
I1104 11:11:23.475994  6155 slave.cpp:6288] Finished recovery
I1104 11:11:23.476685  6155 slave.cpp:6470] Querying resource estimator for oversubscribable
resources
I1104 11:11:23.477174  6156 slave.cpp:6484] Received oversubscribable resources {} from the
resource estimator
I1104 11:11:23.481079  6155 process.cpp:3938] Handling HTTP event for process 'slave(798)'
with path: '/slave(798)/monitor/statistics.json'
I1104 11:11:23.483167  6159 http.cpp:1185] HTTP GET for /slave(798)/monitor/statistics.json
from 172.17.0.2:56302
I1104 11:11:23.483290  6159 http.cpp:976] Authorizing principal 'test-principal' to GET the
'/monitor/statistics.json' endpoint
I1104 11:11:23.486807  6133 slave.cpp:843] Agent terminating
[       OK ] Endpoint/SlaveEndpointTest.UnauthorizedRequest/1 (47 ms)
[ RUN      ] Endpoint/SlaveEndpointTest.UnauthorizedRequest/2
I1104 11:11:23.505983  6133 containerizer.cpp:246] Using isolation: posix/cpu,posix/mem,filesystem/posix,network/cni,environment_secret
W1104 11:11:23.506757  6133 backend.cpp:76] Failed to create 'overlay' backend: OverlayBackend
requires root privileges
W1104 11:11:23.506953  6133 backend.cpp:76] Failed to create 'bind' backend: BindBackend requires
root privileges
I1104 11:11:23.506994  6133 provisioner.cpp:255] Using default backend 'copy'
I1104 11:11:23.512740  6158 slave.cpp:250] Mesos agent started on (799)@172.17.0.2:33337
I1104 11:11:23.512783  6158 slave.cpp:251] Flags at startup: --acls="" --appc_simple_discovery_uri_prefix="http://"
--appc_store_dir="/tmp/Endpoint_SlaveEndpointTest_UnauthorizedRequest_2_mElBpu/store/appc"
--authenticate_http_readonly="true" --authenticate_http_readwrite="true" --authenticatee="crammd5"
--authentication_backoff_factor="1secs" --authorizer="local" --cgroups_cpu_enable_pids_and_tids_count="false"
--cgroups_enable_cfs="false" --cgroups_hierarchy="/sys/fs/cgroup" --cgroups_limit_swap="false"
--cgroups_root="mesos" --container_disk_watch_interval="15secs" --containerizers="mesos" --credential="/tmp/Endpoint_SlaveEndpointTest_UnauthorizedRequest_2_mElBpu/credential"
--default_role="*" --disallow_sharing_agent_pid_namespace="false" --disk_watch_interval="1mins"
--docker="docker" --docker_kill_orphans="true" --docker_registry="https://registry-1.docker.io"
--docker_remove_delay="6hrs" --docker_socket="/var/run/docker.sock" --docker_stop_timeout="0ns"
--docker_store_dir="/tmp/Endpoint_SlaveEndpointTest_UnauthorizedRequest_2_mElBpu/store/docker"
--docker_volume_checkpoint_dir="/var/run/mesos/isolators/docker/volume" --enforce_container_disk_quota="false"
--executor_registration_timeout="1mins" --executor_reregistration_timeout="2secs" --executor_shutdown_grace_period="5secs"
--fetcher_cache_dir="/tmp/Endpoint_SlaveEndpointTest_UnauthorizedRequest_2_mElBpu/fetch" --fetcher_cache_size="2GB"
--frameworks_home="" --gc_delay="1weeks" --gc_disk_headroom="0.1" --hadoop_home="" --help="false"
--hostname_lookup="true" --http_command_executor="false" --http_credentials="/tmp/Endpoint_SlaveEndpointTest_UnauthorizedRequest_2_mElBpu/http_credentials"
--http_heartbeat_interval="30secs" --initialize_driver_logging="true" --isolation="posix/cpu,posix/mem"
--launcher="posix" --launcher_dir="/mesos/mesos-1.4.1/_build/src" --logbufsecs="0" --logging_level="INFO"
--max_completed_executors_per_framework="150" --oversubscribed_resources_interval="15secs"
--perf_duration="10secs" --perf_interval="1mins" --port="5051" --qos_correction_interval_min="0ns"
--quiet="false" --recover="reconnect" --recovery_timeout="15mins" --registration_backoff_factor="10ms"
--resources="cpus:2;gpus:0;mem:1024;disk:1024;ports:[31000-32000]" --revocable_cpu_low_priority="true"
--runtime_dir="/tmp/Endpoint_SlaveEndpointTest_UnauthorizedRequest_2_mElBpu" --sandbox_directory="/mnt/mesos/sandbox"
--strict="true" --switch_user="true" --systemd_enable_support="true" --systemd_runtime_directory="/run/systemd/system"
--version="false" --work_dir="/tmp/Endpoint_SlaveEndpointTest_UnauthorizedRequest_2_PZdOUC"
I1104 11:11:23.513528  6158 credentials.hpp:86] Loading credential for authentication from
'/tmp/Endpoint_SlaveEndpointTest_UnauthorizedRequest_2_mElBpu/credential'
I1104 11:11:23.513804  6158 slave.cpp:283] Agent using credential for: test-principal
I1104 11:11:23.513831  6158 credentials.hpp:37] Loading credentials for authentication from
'/tmp/Endpoint_SlaveEndpointTest_UnauthorizedRequest_2_mElBpu/http_credentials'
I1104 11:11:23.514214  6158 http.cpp:1045] Creating default 'basic' HTTP authenticator for
realm 'mesos-agent-readonly'
I1104 11:11:23.514498  6158 http.cpp:1045] Creating default 'basic' HTTP authenticator for
realm 'mesos-agent-readwrite'
I1104 11:11:23.516752  6158 slave.cpp:565] Agent resources: [{"name":"cpus","scalar":{"value":2.0},"type":"SCALAR"},{"name":"mem","scalar":{"value":1024.0},"type":"SCALAR"},{"name":"disk","scalar":{"value":1024.0},"type":"SCALAR"},{"name":"ports","ranges":{"range":[{"begin":31000,"end":32000}]},"type":"RANGES"}]
I1104 11:11:23.517194  6158 slave.cpp:573] Agent attributes: [  ]
I1104 11:11:23.517220  6158 slave.cpp:582] Agent hostname: 83a518e9c198
I1104 11:11:23.518751  6156 status_update_manager.cpp:177] Pausing sending status updates
I1104 11:11:23.519572  6155 state.cpp:64] Recovering state from '/tmp/Endpoint_SlaveEndpointTest_UnauthorizedRequest_2_PZdOUC/meta'
I1104 11:11:23.520009  6157 status_update_manager.cpp:203] Recovering status update manager
I1104 11:11:23.520483  6158 containerizer.cpp:609] Recovering containerizer
I1104 11:11:23.522783  6154 provisioner.cpp:416] Provisioner recovery complete
I1104 11:11:23.523351  6152 slave.cpp:6288] Finished recovery
I1104 11:11:23.524060  6152 slave.cpp:6470] Querying resource estimator for oversubscribable
resources
I1104 11:11:23.524430  6158 slave.cpp:6484] Received oversubscribable resources {} from the
resource estimator
I1104 11:11:23.528522  6152 process.cpp:3938] Handling HTTP event for process 'slave(799)'
with path: '/slave(799)/containers'
I1104 11:11:23.530850  6157 http.cpp:1185] HTTP GET for /slave(799)/containers from 172.17.0.2:56304
I1104 11:11:23.530978  6157 http.cpp:976] Authorizing principal 'test-principal' to GET the
'/containers' endpoint
I1104 11:11:23.534850  6152 slave.cpp:843] Agent terminating
[       OK ] Endpoint/SlaveEndpointTest.UnauthorizedRequest/2 (46 ms)
[ RUN      ] Endpoint/SlaveEndpointTest.NoAuthorizer/0
I1104 11:11:23.553683  6133 containerizer.cpp:246] Using isolation: posix/cpu,posix/mem,filesystem/posix,network/cni,environment_secret
W1104 11:11:23.554453  6133 backend.cpp:76] Failed to create 'overlay' backend: OverlayBackend
requires root privileges
W1104 11:11:23.554653  6133 backend.cpp:76] Failed to create 'bind' backend: BindBackend requires
root privileges
I1104 11:11:23.554695  6133 provisioner.cpp:255] Using default backend 'copy'
I1104 11:11:23.557332  6133 cluster.cpp:448] Creating default 'local' authorizer
I1104 11:11:23.560647  6154 slave.cpp:250] Mesos agent started on (800)@172.17.0.2:33337
I1104 11:11:23.560693  6154 slave.cpp:251] Flags at startup: --acls="" --appc_simple_discovery_uri_prefix="http://"
--appc_store_dir="/tmp/Endpoint_SlaveEndpointTest_NoAuthorizer_0_qiyQOW/store/appc" --authenticate_http_readonly="true"
--authenticate_http_readwrite="true" --authenticatee="crammd5" --authentication_backoff_factor="1secs"
--authorizer="local" --cgroups_cpu_enable_pids_and_tids_count="false" --cgroups_enable_cfs="false"
--cgroups_hierarchy="/sys/fs/cgroup" --cgroups_limit_swap="false" --cgroups_root="mesos" --container_disk_watch_interval="15secs"
--containerizers="mesos" --credential="/tmp/Endpoint_SlaveEndpointTest_NoAuthorizer_0_qiyQOW/credential"
--default_role="*" --disallow_sharing_agent_pid_namespace="false" --disk_watch_interval="1mins"
--docker="docker" --docker_kill_orphans="true" --docker_registry="https://registry-1.docker.io"
--docker_remove_delay="6hrs" --docker_socket="/var/run/docker.sock" --docker_stop_timeout="0ns"
--docker_store_dir="/tmp/Endpoint_SlaveEndpointTest_NoAuthorizer_0_qiyQOW/store/docker" --docker_volume_checkpoint_dir="/var/run/mesos/isolators/docker/volume"
--enforce_container_disk_quota="false" --executor_registration_timeout="1mins" --executor_reregistration_timeout="2secs"
--executor_shutdown_grace_period="5secs" --fetcher_cache_dir="/tmp/Endpoint_SlaveEndpointTest_NoAuthorizer_0_qiyQOW/fetch"
--fetcher_cache_size="2GB" --frameworks_home="" --gc_delay="1weeks" --gc_disk_headroom="0.1"
--hadoop_home="" --help="false" --hostname_lookup="true" --http_command_executor="false" --http_credentials="/tmp/Endpoint_SlaveEndpointTest_NoAuthorizer_0_qiyQOW/http_credentials"
--http_heartbeat_interval="30secs" --initialize_driver_logging="true" --isolation="posix/cpu,posix/mem"
--launcher="posix" --launcher_dir="/mesos/mesos-1.4.1/_build/src" --logbufsecs="0" --logging_level="INFO"
--max_completed_executors_per_framework="150" --oversubscribed_resources_interval="15secs"
--perf_duration="10secs" --perf_interval="1mins" --port="5051" --qos_correction_interval_min="0ns"
--quiet="false" --recover="reconnect" --recovery_timeout="15mins" --registration_backoff_factor="10ms"
--resources="cpus:2;gpus:0;mem:1024;disk:1024;ports:[31000-32000]" --revocable_cpu_low_priority="true"
--runtime_dir="/tmp/Endpoint_SlaveEndpointTest_NoAuthorizer_0_qiyQOW" --sandbox_directory="/mnt/mesos/sandbox"
--strict="true" --switch_user="true" --systemd_enable_support="true" --systemd_runtime_directory="/run/systemd/system"
--version="false" --work_dir="/tmp/Endpoint_SlaveEndpointTest_NoAuthorizer_0_9zGoc5"
I1104 11:11:23.561640  6154 credentials.hpp:86] Loading credential for authentication from
'/tmp/Endpoint_SlaveEndpointTest_NoAuthorizer_0_qiyQOW/credential'
I1104 11:11:23.561897  6154 slave.cpp:283] Agent using credential for: test-principal
I1104 11:11:23.561920  6154 credentials.hpp:37] Loading credentials for authentication from
'/tmp/Endpoint_SlaveEndpointTest_NoAuthorizer_0_qiyQOW/http_credentials'
I1104 11:11:23.562275  6154 http.cpp:1045] Creating default 'basic' HTTP authenticator for
realm 'mesos-agent-readonly'
I1104 11:11:23.562538  6154 http.cpp:1045] Creating default 'basic' HTTP authenticator for
realm 'mesos-agent-readwrite'
I1104 11:11:23.564819  6154 slave.cpp:565] Agent resources: [{"name":"cpus","scalar":{"value":2.0},"type":"SCALAR"},{"name":"mem","scalar":{"value":1024.0},"type":"SCALAR"},{"name":"disk","scalar":{"value":1024.0},"type":"SCALAR"},{"name":"ports","ranges":{"range":[{"begin":31000,"end":32000}]},"type":"RANGES"}]
I1104 11:11:23.565264  6154 slave.cpp:573] Agent attributes: [  ]
I1104 11:11:23.565286  6154 slave.cpp:582] Agent hostname: 83a518e9c198
I1104 11:11:23.565510  6152 status_update_manager.cpp:177] Pausing sending status updates
I1104 11:11:23.567529  6155 state.cpp:64] Recovering state from '/tmp/Endpoint_SlaveEndpointTest_NoAuthorizer_0_9zGoc5/meta'
I1104 11:11:23.568255  6153 status_update_manager.cpp:203] Recovering status update manager
I1104 11:11:23.568686  6156 containerizer.cpp:609] Recovering containerizer
I1104 11:11:23.570811  6153 provisioner.cpp:416] Provisioner recovery complete
I1104 11:11:23.571324  6156 slave.cpp:6288] Finished recovery
I1104 11:11:23.571933  6156 slave.cpp:6470] Querying resource estimator for oversubscribable
resources
I1104 11:11:23.572307  6157 slave.cpp:6484] Received oversubscribable resources {} from the
resource estimator
I1104 11:11:23.576149  6156 process.cpp:3938] Handling HTTP event for process 'slave(800)'
with path: '/slave(800)/monitor/statistics'
I1104 11:11:23.578487  6158 http.cpp:1185] HTTP GET for /slave(800)/monitor/statistics from
172.17.0.2:56306
I1104 11:11:23.578613  6158 http.cpp:976] Authorizing principal 'test-principal' to GET the
'/monitor/statistics' endpoint
I1104 11:11:23.583353  6133 slave.cpp:843] Agent terminating
[       OK ] Endpoint/SlaveEndpointTest.NoAuthorizer/0 (48 ms)
[ RUN      ] Endpoint/SlaveEndpointTest.NoAuthorizer/1
I1104 11:11:23.601639  6133 containerizer.cpp:246] Using isolation: posix/cpu,posix/mem,filesystem/posix,network/cni,environment_secret
W1104 11:11:23.602412  6133 backend.cpp:76] Failed to create 'overlay' backend: OverlayBackend
requires root privileges
W1104 11:11:23.602604  6133 backend.cpp:76] Failed to create 'bind' backend: BindBackend requires
root privileges
I1104 11:11:23.602648  6133 provisioner.cpp:255] Using default backend 'copy'
I1104 11:11:23.605235  6133 cluster.cpp:448] Creating default 'local' authorizer
I1104 11:11:23.608332  6159 slave.cpp:250] Mesos agent started on (801)@172.17.0.2:33337
I1104 11:11:23.608373  6159 slave.cpp:251] Flags at startup: --acls="" --appc_simple_discovery_uri_prefix="http://"
--appc_store_dir="/tmp/Endpoint_SlaveEndpointTest_NoAuthorizer_1_E3pjJp/store/appc" --authenticate_http_readonly="true"
--authenticate_http_readwrite="true" --authenticatee="crammd5" --authentication_backoff_factor="1secs"
--authorizer="local" --cgroups_cpu_enable_pids_and_tids_count="false" --cgroups_enable_cfs="false"
--cgroups_hierarchy="/sys/fs/cgroup" --cgroups_limit_swap="false" --cgroups_root="mesos" --container_disk_watch_interval="15secs"
--containerizers="mesos" --credential="/tmp/Endpoint_SlaveEndpointTest_NoAuthorizer_1_E3pjJp/credential"
--default_role="*" --disallow_sharing_agent_pid_namespace="false" --disk_watch_interval="1mins"
--docker="docker" --docker_kill_orphans="true" --docker_registry="https://registry-1.docker.io"
--docker_remove_delay="6hrs" --docker_socket="/var/run/docker.sock" --docker_stop_timeout="0ns"
--docker_store_dir="/tmp/Endpoint_SlaveEndpointTest_NoAuthorizer_1_E3pjJp/store/docker" --docker_volume_checkpoint_dir="/var/run/mesos/isolators/docker/volume"
--enforce_container_disk_quota="false" --executor_registration_timeout="1mins" --executor_reregistration_timeout="2secs"
--executor_shutdown_grace_period="5secs" --fetcher_cache_dir="/tmp/Endpoint_SlaveEndpointTest_NoAuthorizer_1_E3pjJp/fetch"
--fetcher_cache_size="2GB" --frameworks_home="" --gc_delay="1weeks" --gc_disk_headroom="0.1"
--hadoop_home="" --help="false" --hostname_lookup="true" --http_command_executor="false" --http_credentials="/tmp/Endpoint_SlaveEndpointTest_NoAuthorizer_1_E3pjJp/http_credentials"
--http_heartbeat_interval="30secs" --initialize_driver_logging="true" --isolation="posix/cpu,posix/mem"
--launcher="posix" --launcher_dir="/mesos/mesos-1.4.1/_build/src" --logbufsecs="0" --logging_level="INFO"
--max_completed_executors_per_framework="150" --oversubscribed_resources_interval="15secs"
--perf_duration="10secs" --perf_interval="1mins" --port="5051" --qos_correction_interval_min="0ns"
--quiet="false" --recover="reconnect" --recovery_timeout="15mins" --registration_backoff_factor="10ms"
--resources="cpus:2;gpus:0;mem:1024;disk:1024;ports:[31000-32000]" --revocable_cpu_low_priority="true"
--runtime_dir="/tmp/Endpoint_SlaveEndpointTest_NoAuthorizer_1_E3pjJp" --sandbox_directory="/mnt/mesos/sandbox"
--strict="true" --switch_user="true" --systemd_enable_support="true" --systemd_runtime_directory="/run/systemd/system"
--version="false" --work_dir="/tmp/Endpoint_SlaveEndpointTest_NoAuthorizer_1_5DA3Yx"
I1104 11:11:23.609238  6159 credentials.hpp:86] Loading credential for authentication from
'/tmp/Endpoint_SlaveEndpointTest_NoAuthorizer_1_E3pjJp/credential'
I1104 11:11:23.609726  6159 slave.cpp:283] Agent using credential for: test-principal
I1104 11:11:23.609763  6159 credentials.hpp:37] Loading credentials for authentication from
'/tmp/Endpoint_SlaveEndpointTest_NoAuthorizer_1_E3pjJp/http_credentials'
I1104 11:11:23.610286  6159 http.cpp:1045] Creating default 'basic' HTTP authenticator for
realm 'mesos-agent-readonly'
I1104 11:11:23.610699  6159 http.cpp:1045] Creating default 'basic' HTTP authenticator for
realm 'mesos-agent-readwrite'
I1104 11:11:23.613132  6159 slave.cpp:565] Agent resources: [{"name":"cpus","scalar":{"value":2.0},"type":"SCALAR"},{"name":"mem","scalar":{"value":1024.0},"type":"SCALAR"},{"name":"disk","scalar":{"value":1024.0},"type":"SCALAR"},{"name":"ports","ranges":{"range":[{"begin":31000,"end":32000}]},"type":"RANGES"}]
I1104 11:11:23.613579  6159 slave.cpp:573] Agent attributes: [  ]
I1104 11:11:23.613600  6159 slave.cpp:582] Agent hostname: 83a518e9c198
I1104 11:11:23.613837  6158 status_update_manager.cpp:177] Pausing sending status updates
I1104 11:11:23.616137  6156 state.cpp:64] Recovering state from '/tmp/Endpoint_SlaveEndpointTest_NoAuthorizer_1_5DA3Yx/meta'
I1104 11:11:23.616572  6156 status_update_manager.cpp:203] Recovering status update manager
I1104 11:11:23.616900  6155 containerizer.cpp:609] Recovering containerizer
I1104 11:11:23.619194  6157 provisioner.cpp:416] Provisioner recovery complete
I1104 11:11:23.619783  6155 slave.cpp:6288] Finished recovery
I1104 11:11:23.620597  6155 slave.cpp:6470] Querying resource estimator for oversubscribable
resources
I1104 11:11:23.621229  6153 slave.cpp:6484] Received oversubscribable resources {} from the
resource estimator
I1104 11:11:23.625155  6159 process.cpp:3938] Handling HTTP event for process 'slave(801)'
with path: '/slave(801)/monitor/statistics.json'
I1104 11:11:23.627540  6157 http.cpp:1185] HTTP GET for /slave(801)/monitor/statistics.json
from 172.17.0.2:56308
I1104 11:11:23.627663  6157 http.cpp:976] Authorizing principal 'test-principal' to GET the
'/monitor/statistics.json' endpoint
I1104 11:11:23.632565  6156 slave.cpp:843] Agent terminating
[       OK ] Endpoint/SlaveEndpointTest.NoAuthorizer/1 (49 ms)
[ RUN      ] Endpoint/SlaveEndpointTest.NoAuthorizer/2
I1104 11:11:23.650574  6133 containerizer.cpp:246] Using isolation: posix/cpu,posix/mem,filesystem/posix,network/cni,environment_secret
W1104 11:11:23.651352  6133 backend.cpp:76] Failed to create 'overlay' backend: OverlayBackend
requires root privileges
W1104 11:11:23.651556  6133 backend.cpp:76] Failed to create 'bind' backend: BindBackend requires
root privileges
I1104 11:11:23.651603  6133 provisioner.cpp:255] Using default backend 'copy'
I1104 11:11:23.654208  6133 cluster.cpp:448] Creating default 'local' authorizer
I1104 11:11:23.657289  6155 slave.cpp:250] Mesos agent started on (802)@172.17.0.2:33337
I1104 11:11:23.657330  6155 slave.cpp:251] Flags at startup: --acls="" --appc_simple_discovery_uri_prefix="http://"
--appc_store_dir="/tmp/Endpoint_SlaveEndpointTest_NoAuthorizer_2_8Qes9S/store/appc" --authenticate_http_readonly="true"
--authenticate_http_readwrite="true" --authenticatee="crammd5" --authentication_backoff_factor="1secs"
--authorizer="local" --cgroups_cpu_enable_pids_and_tids_count="false" --cgroups_enable_cfs="false"
--cgroups_hierarchy="/sys/fs/cgroup" --cgroups_limit_swap="false" --cgroups_root="mesos" --container_disk_watch_interval="15secs"
--containerizers="mesos" --credential="/tmp/Endpoint_SlaveEndpointTest_NoAuthorizer_2_8Qes9S/credential"
--default_role="*" --disallow_sharing_agent_pid_namespace="false" --disk_watch_interval="1mins"
--docker="docker" --docker_kill_orphans="true" --docker_registry="https://registry-1.docker.io"
--docker_remove_delay="6hrs" --docker_socket="/var/run/docker.sock" --docker_stop_timeout="0ns"
--docker_store_dir="/tmp/Endpoint_SlaveEndpointTest_NoAuthorizer_2_8Qes9S/store/docker" --docker_volume_checkpoint_dir="/var/run/mesos/isolators/docker/volume"
--enforce_container_disk_quota="false" --executor_registration_timeout="1mins" --executor_reregistration_timeout="2secs"
--executor_shutdown_grace_period="5secs" --fetcher_cache_dir="/tmp/Endpoint_SlaveEndpointTest_NoAuthorizer_2_8Qes9S/fetch"
--fetcher_cache_size="2GB" --frameworks_home="" --gc_delay="1weeks" --gc_disk_headroom="0.1"
--hadoop_home="" --help="false" --hostname_lookup="true" --http_command_executor="false" --http_credentials="/tmp/Endpoint_SlaveEndpointTest_NoAuthorizer_2_8Qes9S/http_credentials"
--http_heartbeat_interval="30secs" --initialize_driver_logging="true" --isolation="posix/cpu,posix/mem"
--launcher="posix" --launcher_dir="/mesos/mesos-1.4.1/_build/src" --logbufsecs="0" --logging_level="INFO"
--max_completed_executors_per_framework="150" --oversubscribed_resources_interval="15secs"
--perf_duration="10secs" --perf_interval="1mins" --port="5051" --qos_correction_interval_min="0ns"
--quiet="false" --recover="reconnect" --recovery_timeout="15mins" --registration_backoff_factor="10ms"
--resources="cpus:2;gpus:0;mem:1024;disk:1024;ports:[31000-32000]" --revocable_cpu_low_priority="true"
--runtime_dir="/tmp/Endpoint_SlaveEndpointTest_NoAuthorizer_2_8Qes9S" --sandbox_directory="/mnt/mesos/sandbox"
--strict="true" --switch_user="true" --systemd_enable_support="true" --systemd_runtime_directory="/run/systemd/system"
--version="false" --work_dir="/tmp/Endpoint_SlaveEndpointTest_NoAuthorizer_2_xcOgh1"
I1104 11:11:23.658100  6155 credentials.hpp:86] Loading credential for authentication from
'/tmp/Endpoint_SlaveEndpointTest_NoAuthorizer_2_8Qes9S/credential'
I1104 11:11:23.658375  6155 slave.cpp:283] Agent using credential for: test-principal
I1104 11:11:23.658401  6155 credentials.hpp:37] Loading credentials for authentication from
'/tmp/Endpoint_SlaveEndpointTest_NoAuthorizer_2_8Qes9S/http_credentials'
I1104 11:11:23.658780  6155 http.cpp:1045] Creating default 'basic' HTTP authenticator for
realm 'mesos-agent-readonly'
I1104 11:11:23.659070  6155 http.cpp:1045] Creating default 'basic' HTTP authenticator for
realm 'mesos-agent-readwrite'
I1104 11:11:23.661332  6155 slave.cpp:565] Agent resources: [{"name":"cpus","scalar":{"value":2.0},"type":"SCALAR"},{"name":"mem","scalar":{"value":1024.0},"type":"SCALAR"},{"name":"disk","scalar":{"value":1024.0},"type":"SCALAR"},{"name":"ports","ranges":{"range":[{"begin":31000,"end":32000}]},"type":"RANGES"}]
I1104 11:11:23.661785  6155 slave.cpp:573] Agent attributes: [  ]
I1104 11:11:23.661809  6155 slave.cpp:582] Agent hostname: 83a518e9c198
I1104 11:11:23.662029  6154 status_update_manager.cpp:177] Pausing sending status updates
I1104 11:11:23.664135  6153 state.cpp:64] Recovering state from '/tmp/Endpoint_SlaveEndpointTest_NoAuthorizer_2_xcOgh1/meta'
I1104 11:11:23.664659  6157 status_update_manager.cpp:203] Recovering status update manager
I1104 11:11:23.665112  6158 containerizer.cpp:609] Recovering containerizer
I1104 11:11:23.667140  6155 provisioner.cpp:416] Provisioner recovery complete
I1104 11:11:23.667729  6154 slave.cpp:6288] Finished recovery
I1104 11:11:23.668426  6154 slave.cpp:6470] Querying resource estimator for oversubscribable
resources
I1104 11:11:23.668871  6155 slave.cpp:6484] Received oversubscribable resources {} from the
resource estimator
I1104 11:11:23.672716  6154 process.cpp:3938] Handling HTTP event for process 'slave(802)'
with path: '/slave(802)/containers'
I1104 11:11:23.675067  6158 http.cpp:1185] HTTP GET for /slave(802)/containers from 172.17.0.2:56310
I1104 11:11:23.675187  6158 http.cpp:976] Authorizing principal 'test-principal' to GET the
'/containers' endpoint
I1104 11:11:23.681032  6155 slave.cpp:843] Agent terminating
[       OK ] Endpoint/SlaveEndpointTest.NoAuthorizer/2 (49 ms)
[----------] 9 tests from Endpoint/SlaveEndpointTest (435 ms total)

[----------] 2 tests from ContainerizerType/DefaultContainerDNSFlagTest
[ RUN      ] ContainerizerType/DefaultContainerDNSFlagTest.ValidateFlag/0
[       OK ] ContainerizerType/DefaultContainerDNSFlagTest.ValidateFlag/0 (18 ms)
[ RUN      ] ContainerizerType/DefaultContainerDNSFlagTest.ValidateFlag/1
[       OK ] ContainerizerType/DefaultContainerDNSFlagTest.ValidateFlag/1 (20 ms)
[----------] 2 tests from ContainerizerType/DefaultContainerDNSFlagTest (38 ms total)

[----------] Global test environment tear-down
[==========] 1652 tests from 182 test cases ran. (776281 ms total)
[  PASSED  ] 1647 tests.
[  FAILED  ] 5 tests, listed below:
[  FAILED  ] CommandExecutorCheckTest.CommandCheckDeliveredAndReconciled
[  FAILED  ] DefaultExecutorCheckTest.CommandCheckDeliveredAndReconciled
[  FAILED  ] DefaultExecutorCheckTest.CommandCheckStatusChange
[  FAILED  ] DefaultExecutorCheckTest.CommandCheckSeesParentsEnv
[  FAILED  ] DefaultExecutorCheckTest.CommandCheckSharesWorkDirWithTask

 5 FAILED TESTS
  YOU HAVE 20 DISABLED TESTS

I1104 11:11:23.874821  6160 process.cpp:1068] Failed to accept socket: future discarded
make[4]: *** [check-local] Error 1
make[4]: Leaving directory `/mesos/mesos-1.4.1/_build/src'
make[3]: *** [check-am] Error 2
make[3]: Leaving directory `/mesos/mesos-1.4.1/_build/src'
make[2]: *** [check] Error 2
make[2]: Leaving directory `/mesos/mesos-1.4.1/_build/src'
make[1]: *** [check-recursive] Error 1
make[1]: Leaving directory `/mesos/mesos-1.4.1/_build'
make: *** [distcheck] Error 1
+ docker rmi mesos-1509788910-18487
Untagged: mesos-1509788910-18487:latest
Deleted: sha256:f708eaa645567469f936516ac27336cb81279267957a63c01bb7becde6ffeec2
Deleted: sha256:4a6890dbecad4b68d0dcf750c4f40dbf4cf87332858d3c40942a7a19a69b8a0f
Deleted: sha256:0cc1a550736393b4413317d084f23d97ae5340d99efd925ddd54528b4fa2d90d
Deleted: sha256:09c629a9e93ebce8f7a1dea6824f697b5a2decd0594e7f696f12f6cfbb47ebe9
Deleted: sha256:fcf580fd849564ff9cd44e2d634e8b960101b693efb7075adaef0128bcf21365
Deleted: sha256:9f3e2e62cc563d46abebe6d1cb47a6f03259edcc26c3dc941662b022a6f31e39
Deleted: sha256:4552b18a1be173763146176f9796b3f6b83b7882e269098be1e87b3f7ed57ccd
Deleted: sha256:c2a5e74d74734129a7cbfbde0a08bf32418e0b56a6456231e095b552e93c3788
Deleted: sha256:9137d439fd043203f6a1d6195807a2f99952482cad792456525db4a6f695357d
Deleted: sha256:c081d1012a2f26ee6c9215587b8b98d2fef7078c705e7a5df7d9db8195817924
Deleted: sha256:7e8378daed05f4d0f7ac871dcff5b580946a471d50e09c2f4373f641fa5eb047
Deleted: sha256:81499ab44b8ddfde57153ca199ab4734b9736ed6ab7d36d98d434aa274ac96a5
Deleted: sha256:5f9eed4bacd2c4cb9f79eebce43d47c740d9ff13521f0dc6045c20cc353876fd
Deleted: sha256:7c16c8b66c974987caa9b750f8f996f5b60584b14a54c1944e86a75fa086cda3
Deleted: sha256:930d8e3914106daff607adbc100749b8fcbc0eb5d7a0d4aaba004dd16260495c
Deleted: sha256:7f9f3ea6c29fa349f1413dca3d9ea9287e3e0e127abe02d9c4823c82d669ac0e
Deleted: sha256:f49d7d43086934ca5b65ca841653100f44c98347fda92326ea9ed9587ca9a726
Deleted: sha256:80562049b6ff460701bc66d7a75edeff46562eb636d961e9674d1f2bcbd75edc
Deleted: sha256:d7ab0501495bc19e1bfe9f7002f3cf017b67fd832b04e17c53af3baeaecf4f7d
Deleted: sha256:cd3a5ab74b797ccb804816b3b134d96ebfb6b59eee50b4c12ed6e5e6057be678
Deleted: sha256:7c7357213f54a1bc141cdf4bbf1fc55a21d98c1bddc0117f1e5f6ae1edc78c06
Deleted: sha256:736f1791d93966164a3afbae9c38ef8970b21c0760510c151409dafb799a8859
Deleted: sha256:ae6ac8db99522b6232e18538dfe1a748c78b8be669bb3d146ff72e394bbc65c7
Deleted: sha256:78ae47b6f1880cb9cba6917957f0badb44eefe1e395d3ef8591f9c1490f300e5
Deleted: sha256:96a28197690881876f256611828057e315b32f5094f68e4df2d6547ade8cb5f8
Build step 'Execute shell' marked build as failure
Not sending mail to unregistered user xujyan@apple.com


Mime
View raw message