mesos-builds mailing list archives

Site index · List index
Message view « Date » · « Thread »
Top « Date » · « Thread »
From Apache Jenkins Server <jenk...@builds.apache.org>
Subject Build failed in Jenkins: Mesos-Buildbot » cmake,clang,--verbose --disable-libtool-wrappers --enable-libevent --enable-ssl,GLOG_v=1 MESOS_VERBOSE=1,ubuntu:14.04,(ubuntu)&&(!ubuntu-us1)&&(!ubuntu-eu2)&&(!qnode3)&&(!H23) #4474
Date Mon, 20 Nov 2017 02:16:08 GMT
See <https://builds.apache.org/job/Mesos-Buildbot/BUILDTOOL=cmake,COMPILER=clang,CONFIGURATION=--verbose%20--disable-libtool-wrappers%20--enable-libevent%20--enable-ssl,ENVIRONMENT=GLOG_v=1%20MESOS_VERBOSE=1,OS=ubuntu%3A14.04,label_exp=(ubuntu)&&(!ubuntu-us1)&&(!ubuntu-eu2)&&(!qnode3)&&(!H23)/4474/display/redirect?page=changes>

Changes:

[benjamin.hindman] Fixed bug where we fail to hold onto PollSocketImpl reference.

[benjamin.hindman] Used loop in SocketImpl.

[benjamin.hindman] Used loop in PollSocketImpl.

[benjamin.hindman] Added a TODO for loop.

[benjamin.hindman] Used inet::Address and inet::Socket explicitly.

[benjamin.hindman] Cleanups inside of synchronized blocks.

[benjamin.hindman] Removed test dependency on internal process::internal::discarded.

[benjamin.hindman] Added Future::onAbandoned and Future::isAbandoned.

[benjamin.hindman] Added Future::recover.

[benjamin.hindman] Added stringification support for Future.

[benjamin.hindman] Added Future::onAbandoned semantics to process::collect/await.

[benjamin.hindman] Used Future::recover in Mesos.

[benjamin.hindman] Added overload of process::await that takes and returns single future.

[benjamin.hindman] Added discard happens-before relationship in process::await/collect.

[benjamin.hindman] Added safe downcasts for Socket.

------------------------------------------
[...truncated 452.72 KB...]
                                                         ^
/mesos/3rdparty/libprocess/src/../include/process/socket.hpp:422:3: note: previous declaration is here
  operator Try<Socket<T>>() const;
  ^
2 errors generated.
make[3]: *** [3rdparty/libprocess/src/CMakeFiles/process.dir/clock.cpp.o] Error 1
make[3]: *** Waiting for unfinished jobs....
[ 21%] Building CXX object src/CMakeFiles/mesos-protobufs.dir/__/include/mesos/allocator/allocator.pb.cc.o
cd /mesos/build/src && /usr/bin/clang++-3.5  -DLIBDIR=\"/usr/local/libmesos\" -DPKGDATADIR=\"/usr/local/share/mesos\" -DPKGLIBEXECDIR=\"/usr/local/libexec/mesos\" -DUSE_SSL_SOCKET=1 -DVERSION=\"1.5.0\" -Dmesos_protobufs_EXPORTS -I/mesos/build/include -I/mesos/build/include/mesos -I/mesos/build/src -I/mesos/src -isystem /mesos/build/3rdparty/protobuf-3.5.0/src/protobuf-3.5.0/src  -std=c++11 -Wformat-security -fstack-protector-strong -fPIC   -o CMakeFiles/mesos-protobufs.dir/__/include/mesos/allocator/allocator.pb.cc.o -c /mesos/build/include/mesos/allocator/allocator.pb.cc
[ 21%] Building CXX object 3rdparty/stout/tests/CMakeFiles/stout-tests.dir/cache_tests.cpp.o
cd /mesos/build/3rdparty/stout/tests && /usr/bin/clang++-3.5  -DHAVE_LIBZ -DLIBDIR=\"/usr/local/libmesos\" -DPICOJSON_USE_INT64 -DPKGDATADIR=\"/usr/local/share/mesos\" -DPKGLIBEXECDIR=\"/usr/local/libexec/mesos\" -DUSE_SSL_SOCKET=1 -DVERSION=\"1.5.0\" -D__STDC_FORMAT_MACROS -I/mesos/build/3rdparty/stout/tests -I/mesos/3rdparty/stout/include -isystem /usr/include/apr-1.0 -isystem /mesos/build/3rdparty/boost-1.53.0/src/boost-1.53.0 -isystem /mesos/build/3rdparty/elfio-3.2/src/elfio-3.2 -isystem /mesos/build/3rdparty/glog-0.3.3/src/glog-0.3.3-build/include -isystem /mesos/build/3rdparty/picojson-1.3.0/src/picojson-1.3.0 -isystem /mesos/build/3rdparty/protobuf-3.5.0/src/protobuf-3.5.0/src -isystem /usr/include/subversion-1 -isystem /mesos/build/3rdparty/googletest-1.8.0/src/googletest-1.8.0/googlemock/include -isystem /mesos/build/3rdparty/googletest-1.8.0/src/googletest-1.8.0/googletest/include  -std=c++11 -Wformat-security -fstack-protector-strong -fPIE   -o CMakeFiles/stout-tests.dir/cache_tests.cpp.o -c /mesos/3rdparty/stout/tests/cache_tests.cpp
2 errors generated.
make[3]: *** [3rdparty/libprocess/src/CMakeFiles/process.dir/authenticator.cpp.o] Error 1
[ 22%] Building CXX object 3rdparty/stout/tests/CMakeFiles/stout-tests.dir/duration_tests.cpp.o
cd /mesos/build/3rdparty/stout/tests && /usr/bin/clang++-3.5  -DHAVE_LIBZ -DLIBDIR=\"/usr/local/libmesos\" -DPICOJSON_USE_INT64 -DPKGDATADIR=\"/usr/local/share/mesos\" -DPKGLIBEXECDIR=\"/usr/local/libexec/mesos\" -DUSE_SSL_SOCKET=1 -DVERSION=\"1.5.0\" -D__STDC_FORMAT_MACROS -I/mesos/build/3rdparty/stout/tests -I/mesos/3rdparty/stout/include -isystem /usr/include/apr-1.0 -isystem /mesos/build/3rdparty/boost-1.53.0/src/boost-1.53.0 -isystem /mesos/build/3rdparty/elfio-3.2/src/elfio-3.2 -isystem /mesos/build/3rdparty/glog-0.3.3/src/glog-0.3.3-build/include -isystem /mesos/build/3rdparty/picojson-1.3.0/src/picojson-1.3.0 -isystem /mesos/build/3rdparty/protobuf-3.5.0/src/protobuf-3.5.0/src -isystem /usr/include/subversion-1 -isystem /mesos/build/3rdparty/googletest-1.8.0/src/googletest-1.8.0/googlemock/include -isystem /mesos/build/3rdparty/googletest-1.8.0/src/googletest-1.8.0/googletest/include  -std=c++11 -Wformat-security -fstack-protector-strong -fPIE   -o CMakeFiles/stout-tests.dir/duration_tests.cpp.o -c /mesos/3rdparty/stout/tests/duration_tests.cpp
In file included from /mesos/3rdparty/libprocess/src/firewall.cpp:15:
In file included from /mesos/3rdparty/libprocess/src/../include/process/firewall.hpp:18:
In file included from /mesos/3rdparty/libprocess/src/../include/process/http.hpp:33:
/mesos/3rdparty/libprocess/src/../include/process/socket.hpp:512:58: error: deleted definition must be first declaration
Socket<inet::Address>::operator Try<Socket<T>>() const = delete;
                                                         ^
/mesos/3rdparty/libprocess/src/../include/process/socket.hpp:422:3: note: previous declaration is here
  operator Try<Socket<T>>() const;
  ^
/mesos/3rdparty/libprocess/src/../include/process/socket.hpp:537:58: error: deleted definition must be first declaration
Socket<unix::Address>::operator Try<Socket<T>>() const = delete;
                                                         ^
/mesos/3rdparty/libprocess/src/../include/process/socket.hpp:422:3: note: previous declaration is here
  operator Try<Socket<T>>() const;
  ^
2 errors generated.
make[3]: *** [3rdparty/libprocess/src/CMakeFiles/process.dir/authenticator_manager.cpp.o] Error 1
[ 22%] Building CXX object 3rdparty/stout/tests/CMakeFiles/stout-tests.dir/dynamiclibrary_tests.cpp.o
cd /mesos/build/3rdparty/stout/tests && /usr/bin/clang++-3.5  -DHAVE_LIBZ -DLIBDIR=\"/usr/local/libmesos\" -DPICOJSON_USE_INT64 -DPKGDATADIR=\"/usr/local/share/mesos\" -DPKGLIBEXECDIR=\"/usr/local/libexec/mesos\" -DUSE_SSL_SOCKET=1 -DVERSION=\"1.5.0\" -D__STDC_FORMAT_MACROS -I/mesos/build/3rdparty/stout/tests -I/mesos/3rdparty/stout/include -isystem /usr/include/apr-1.0 -isystem /mesos/build/3rdparty/boost-1.53.0/src/boost-1.53.0 -isystem /mesos/build/3rdparty/elfio-3.2/src/elfio-3.2 -isystem /mesos/build/3rdparty/glog-0.3.3/src/glog-0.3.3-build/include -isystem /mesos/build/3rdparty/picojson-1.3.0/src/picojson-1.3.0 -isystem /mesos/build/3rdparty/protobuf-3.5.0/src/protobuf-3.5.0/src -isystem /usr/include/subversion-1 -isystem /mesos/build/3rdparty/googletest-1.8.0/src/googletest-1.8.0/googlemock/include -isystem /mesos/build/3rdparty/googletest-1.8.0/src/googletest-1.8.0/googletest/include  -std=c++11 -Wformat-security -fstack-protector-strong -fPIE   -o CMakeFiles/stout-tests.dir/dynamiclibrary_tests.cpp.o -c /mesos/3rdparty/stout/tests/dynamiclibrary_tests.cpp
[ 23%] Building CXX object src/CMakeFiles/mesos-protobufs.dir/__/include/mesos/appc/spec.pb.cc.o
cd /mesos/build/src && /usr/bin/clang++-3.5  -DLIBDIR=\"/usr/local/libmesos\" -DPKGDATADIR=\"/usr/local/share/mesos\" -DPKGLIBEXECDIR=\"/usr/local/libexec/mesos\" -DUSE_SSL_SOCKET=1 -DVERSION=\"1.5.0\" -Dmesos_protobufs_EXPORTS -I/mesos/build/include -I/mesos/build/include/mesos -I/mesos/build/src -I/mesos/src -isystem /mesos/build/3rdparty/protobuf-3.5.0/src/protobuf-3.5.0/src  -std=c++11 -Wformat-security -fstack-protector-strong -fPIC   -o CMakeFiles/mesos-protobufs.dir/__/include/mesos/appc/spec.pb.cc.o -c /mesos/build/include/mesos/appc/spec.pb.cc
2 errors generated.
make[3]: *** [3rdparty/libprocess/src/CMakeFiles/process.dir/firewall.cpp.o] Error 1
make[3]: Leaving directory `/mesos/build'
make[2]: *** [3rdparty/libprocess/src/CMakeFiles/process.dir/all] Error 2
make[2]: *** Waiting for unfinished jobs....
[ 23%] Building CXX object 3rdparty/stout/tests/CMakeFiles/stout-tests.dir/error_tests.cpp.o
cd /mesos/build/3rdparty/stout/tests && /usr/bin/clang++-3.5  -DHAVE_LIBZ -DLIBDIR=\"/usr/local/libmesos\" -DPICOJSON_USE_INT64 -DPKGDATADIR=\"/usr/local/share/mesos\" -DPKGLIBEXECDIR=\"/usr/local/libexec/mesos\" -DUSE_SSL_SOCKET=1 -DVERSION=\"1.5.0\" -D__STDC_FORMAT_MACROS -I/mesos/build/3rdparty/stout/tests -I/mesos/3rdparty/stout/include -isystem /usr/include/apr-1.0 -isystem /mesos/build/3rdparty/boost-1.53.0/src/boost-1.53.0 -isystem /mesos/build/3rdparty/elfio-3.2/src/elfio-3.2 -isystem /mesos/build/3rdparty/glog-0.3.3/src/glog-0.3.3-build/include -isystem /mesos/build/3rdparty/picojson-1.3.0/src/picojson-1.3.0 -isystem /mesos/build/3rdparty/protobuf-3.5.0/src/protobuf-3.5.0/src -isystem /usr/include/subversion-1 -isystem /mesos/build/3rdparty/googletest-1.8.0/src/googletest-1.8.0/googlemock/include -isystem /mesos/build/3rdparty/googletest-1.8.0/src/googletest-1.8.0/googletest/include  -std=c++11 -Wformat-security -fstack-protector-strong -fPIE   -o CMakeFiles/stout-tests.dir/error_tests.cpp.o -c /mesos/3rdparty/stout/tests/error_tests.cpp
[ 23%] Building CXX object src/CMakeFiles/mesos-protobufs.dir/__/include/mesos/authentication/authentication.pb.cc.o
cd /mesos/build/src && /usr/bin/clang++-3.5  -DLIBDIR=\"/usr/local/libmesos\" -DPKGDATADIR=\"/usr/local/share/mesos\" -DPKGLIBEXECDIR=\"/usr/local/libexec/mesos\" -DUSE_SSL_SOCKET=1 -DVERSION=\"1.5.0\" -Dmesos_protobufs_EXPORTS -I/mesos/build/include -I/mesos/build/include/mesos -I/mesos/build/src -I/mesos/src -isystem /mesos/build/3rdparty/protobuf-3.5.0/src/protobuf-3.5.0/src  -std=c++11 -Wformat-security -fstack-protector-strong -fPIC   -o CMakeFiles/mesos-protobufs.dir/__/include/mesos/authentication/authentication.pb.cc.o -c /mesos/build/include/mesos/authentication/authentication.pb.cc
[ 23%] Building CXX object src/CMakeFiles/mesos-protobufs.dir/__/include/mesos/authorizer/acls.pb.cc.o
cd /mesos/build/src && /usr/bin/clang++-3.5  -DLIBDIR=\"/usr/local/libmesos\" -DPKGDATADIR=\"/usr/local/share/mesos\" -DPKGLIBEXECDIR=\"/usr/local/libexec/mesos\" -DUSE_SSL_SOCKET=1 -DVERSION=\"1.5.0\" -Dmesos_protobufs_EXPORTS -I/mesos/build/include -I/mesos/build/include/mesos -I/mesos/build/src -I/mesos/src -isystem /mesos/build/3rdparty/protobuf-3.5.0/src/protobuf-3.5.0/src  -std=c++11 -Wformat-security -fstack-protector-strong -fPIC   -o CMakeFiles/mesos-protobufs.dir/__/include/mesos/authorizer/acls.pb.cc.o -c /mesos/build/include/mesos/authorizer/acls.pb.cc
[ 23%] Building CXX object 3rdparty/stout/tests/CMakeFiles/stout-tests.dir/flags_tests.cpp.o
cd /mesos/build/3rdparty/stout/tests && /usr/bin/clang++-3.5  -DHAVE_LIBZ -DLIBDIR=\"/usr/local/libmesos\" -DPICOJSON_USE_INT64 -DPKGDATADIR=\"/usr/local/share/mesos\" -DPKGLIBEXECDIR=\"/usr/local/libexec/mesos\" -DUSE_SSL_SOCKET=1 -DVERSION=\"1.5.0\" -D__STDC_FORMAT_MACROS -I/mesos/build/3rdparty/stout/tests -I/mesos/3rdparty/stout/include -isystem /usr/include/apr-1.0 -isystem /mesos/build/3rdparty/boost-1.53.0/src/boost-1.53.0 -isystem /mesos/build/3rdparty/elfio-3.2/src/elfio-3.2 -isystem /mesos/build/3rdparty/glog-0.3.3/src/glog-0.3.3-build/include -isystem /mesos/build/3rdparty/picojson-1.3.0/src/picojson-1.3.0 -isystem /mesos/build/3rdparty/protobuf-3.5.0/src/protobuf-3.5.0/src -isystem /usr/include/subversion-1 -isystem /mesos/build/3rdparty/googletest-1.8.0/src/googletest-1.8.0/googlemock/include -isystem /mesos/build/3rdparty/googletest-1.8.0/src/googletest-1.8.0/googletest/include  -std=c++11 -Wformat-security -fstack-protector-strong -fPIE   -o CMakeFiles/stout-tests.dir/flags_tests.cpp.o -c /mesos/3rdparty/stout/tests/flags_tests.cpp
[ 23%] Building CXX object src/CMakeFiles/mesos-protobufs.dir/__/include/mesos/authorizer/authorizer.pb.cc.o
cd /mesos/build/src && /usr/bin/clang++-3.5  -DLIBDIR=\"/usr/local/libmesos\" -DPKGDATADIR=\"/usr/local/share/mesos\" -DPKGLIBEXECDIR=\"/usr/local/libexec/mesos\" -DUSE_SSL_SOCKET=1 -DVERSION=\"1.5.0\" -Dmesos_protobufs_EXPORTS -I/mesos/build/include -I/mesos/build/include/mesos -I/mesos/build/src -I/mesos/src -isystem /mesos/build/3rdparty/protobuf-3.5.0/src/protobuf-3.5.0/src  -std=c++11 -Wformat-security -fstack-protector-strong -fPIC   -o CMakeFiles/mesos-protobufs.dir/__/include/mesos/authorizer/authorizer.pb.cc.o -c /mesos/build/include/mesos/authorizer/authorizer.pb.cc
[ 23%] Building CXX object src/CMakeFiles/mesos-protobufs.dir/__/include/mesos/docker/spec.pb.cc.o
cd /mesos/build/src && /usr/bin/clang++-3.5  -DLIBDIR=\"/usr/local/libmesos\" -DPKGDATADIR=\"/usr/local/share/mesos\" -DPKGLIBEXECDIR=\"/usr/local/libexec/mesos\" -DUSE_SSL_SOCKET=1 -DVERSION=\"1.5.0\" -Dmesos_protobufs_EXPORTS -I/mesos/build/include -I/mesos/build/include/mesos -I/mesos/build/src -I/mesos/src -isystem /mesos/build/3rdparty/protobuf-3.5.0/src/protobuf-3.5.0/src  -std=c++11 -Wformat-security -fstack-protector-strong -fPIC   -o CMakeFiles/mesos-protobufs.dir/__/include/mesos/docker/spec.pb.cc.o -c /mesos/build/include/mesos/docker/spec.pb.cc
[ 23%] Building CXX object 3rdparty/stout/tests/CMakeFiles/stout-tests.dir/gzip_tests.cpp.o
cd /mesos/build/3rdparty/stout/tests && /usr/bin/clang++-3.5  -DHAVE_LIBZ -DLIBDIR=\"/usr/local/libmesos\" -DPICOJSON_USE_INT64 -DPKGDATADIR=\"/usr/local/share/mesos\" -DPKGLIBEXECDIR=\"/usr/local/libexec/mesos\" -DUSE_SSL_SOCKET=1 -DVERSION=\"1.5.0\" -D__STDC_FORMAT_MACROS -I/mesos/build/3rdparty/stout/tests -I/mesos/3rdparty/stout/include -isystem /usr/include/apr-1.0 -isystem /mesos/build/3rdparty/boost-1.53.0/src/boost-1.53.0 -isystem /mesos/build/3rdparty/elfio-3.2/src/elfio-3.2 -isystem /mesos/build/3rdparty/glog-0.3.3/src/glog-0.3.3-build/include -isystem /mesos/build/3rdparty/picojson-1.3.0/src/picojson-1.3.0 -isystem /mesos/build/3rdparty/protobuf-3.5.0/src/protobuf-3.5.0/src -isystem /usr/include/subversion-1 -isystem /mesos/build/3rdparty/googletest-1.8.0/src/googletest-1.8.0/googlemock/include -isystem /mesos/build/3rdparty/googletest-1.8.0/src/googletest-1.8.0/googletest/include  -std=c++11 -Wformat-security -fstack-protector-strong -fPIE   -o CMakeFiles/stout-tests.dir/gzip_tests.cpp.o -c /mesos/3rdparty/stout/tests/gzip_tests.cpp
[ 23%] Building CXX object src/CMakeFiles/mesos-protobufs.dir/__/include/mesos/docker/v1.pb.cc.o
cd /mesos/build/src && /usr/bin/clang++-3.5  -DLIBDIR=\"/usr/local/libmesos\" -DPKGDATADIR=\"/usr/local/share/mesos\" -DPKGLIBEXECDIR=\"/usr/local/libexec/mesos\" -DUSE_SSL_SOCKET=1 -DVERSION=\"1.5.0\" -Dmesos_protobufs_EXPORTS -I/mesos/build/include -I/mesos/build/include/mesos -I/mesos/build/src -I/mesos/src -isystem /mesos/build/3rdparty/protobuf-3.5.0/src/protobuf-3.5.0/src  -std=c++11 -Wformat-security -fstack-protector-strong -fPIC   -o CMakeFiles/mesos-protobufs.dir/__/include/mesos/docker/v1.pb.cc.o -c /mesos/build/include/mesos/docker/v1.pb.cc
[ 23%] Building CXX object src/CMakeFiles/mesos-protobufs.dir/__/include/mesos/docker/v2.pb.cc.o
cd /mesos/build/src && /usr/bin/clang++-3.5  -DLIBDIR=\"/usr/local/libmesos\" -DPKGDATADIR=\"/usr/local/share/mesos\" -DPKGLIBEXECDIR=\"/usr/local/libexec/mesos\" -DUSE_SSL_SOCKET=1 -DVERSION=\"1.5.0\" -Dmesos_protobufs_EXPORTS -I/mesos/build/include -I/mesos/build/include/mesos -I/mesos/build/src -I/mesos/src -isystem /mesos/build/3rdparty/protobuf-3.5.0/src/protobuf-3.5.0/src  -std=c++11 -Wformat-security -fstack-protector-strong -fPIC   -o CMakeFiles/mesos-protobufs.dir/__/include/mesos/docker/v2.pb.cc.o -c /mesos/build/include/mesos/docker/v2.pb.cc
[ 23%] Building CXX object src/CMakeFiles/mesos-protobufs.dir/__/include/mesos/maintenance/maintenance.pb.cc.o
cd /mesos/build/src && /usr/bin/clang++-3.5  -DLIBDIR=\"/usr/local/libmesos\" -DPKGDATADIR=\"/usr/local/share/mesos\" -DPKGLIBEXECDIR=\"/usr/local/libexec/mesos\" -DUSE_SSL_SOCKET=1 -DVERSION=\"1.5.0\" -Dmesos_protobufs_EXPORTS -I/mesos/build/include -I/mesos/build/include/mesos -I/mesos/build/src -I/mesos/src -isystem /mesos/build/3rdparty/protobuf-3.5.0/src/protobuf-3.5.0/src  -std=c++11 -Wformat-security -fstack-protector-strong -fPIC   -o CMakeFiles/mesos-protobufs.dir/__/include/mesos/maintenance/maintenance.pb.cc.o -c /mesos/build/include/mesos/maintenance/maintenance.pb.cc
[ 24%] Building CXX object src/CMakeFiles/mesos-protobufs.dir/__/include/mesos/master/master.pb.cc.o
cd /mesos/build/src && /usr/bin/clang++-3.5  -DLIBDIR=\"/usr/local/libmesos\" -DPKGDATADIR=\"/usr/local/share/mesos\" -DPKGLIBEXECDIR=\"/usr/local/libexec/mesos\" -DUSE_SSL_SOCKET=1 -DVERSION=\"1.5.0\" -Dmesos_protobufs_EXPORTS -I/mesos/build/include -I/mesos/build/include/mesos -I/mesos/build/src -I/mesos/src -isystem /mesos/build/3rdparty/protobuf-3.5.0/src/protobuf-3.5.0/src  -std=c++11 -Wformat-security -fstack-protector-strong -fPIC   -o CMakeFiles/mesos-protobufs.dir/__/include/mesos/master/master.pb.cc.o -c /mesos/build/include/mesos/master/master.pb.cc
[ 24%] Building CXX object src/CMakeFiles/mesos-protobufs.dir/__/include/mesos/module/hook.pb.cc.o
cd /mesos/build/src && /usr/bin/clang++-3.5  -DLIBDIR=\"/usr/local/libmesos\" -DPKGDATADIR=\"/usr/local/share/mesos\" -DPKGLIBEXECDIR=\"/usr/local/libexec/mesos\" -DUSE_SSL_SOCKET=1 -DVERSION=\"1.5.0\" -Dmesos_protobufs_EXPORTS -I/mesos/build/include -I/mesos/build/include/mesos -I/mesos/build/src -I/mesos/src -isystem /mesos/build/3rdparty/protobuf-3.5.0/src/protobuf-3.5.0/src  -std=c++11 -Wformat-security -fstack-protector-strong -fPIC   -o CMakeFiles/mesos-protobufs.dir/__/include/mesos/module/hook.pb.cc.o -c /mesos/build/include/mesos/module/hook.pb.cc
[ 24%] Building CXX object 3rdparty/stout/tests/CMakeFiles/stout-tests.dir/hashmap_tests.cpp.o
cd /mesos/build/3rdparty/stout/tests && /usr/bin/clang++-3.5  -DHAVE_LIBZ -DLIBDIR=\"/usr/local/libmesos\" -DPICOJSON_USE_INT64 -DPKGDATADIR=\"/usr/local/share/mesos\" -DPKGLIBEXECDIR=\"/usr/local/libexec/mesos\" -DUSE_SSL_SOCKET=1 -DVERSION=\"1.5.0\" -D__STDC_FORMAT_MACROS -I/mesos/build/3rdparty/stout/tests -I/mesos/3rdparty/stout/include -isystem /usr/include/apr-1.0 -isystem /mesos/build/3rdparty/boost-1.53.0/src/boost-1.53.0 -isystem /mesos/build/3rdparty/elfio-3.2/src/elfio-3.2 -isystem /mesos/build/3rdparty/glog-0.3.3/src/glog-0.3.3-build/include -isystem /mesos/build/3rdparty/picojson-1.3.0/src/picojson-1.3.0 -isystem /mesos/build/3rdparty/protobuf-3.5.0/src/protobuf-3.5.0/src -isystem /usr/include/subversion-1 -isystem /mesos/build/3rdparty/googletest-1.8.0/src/googletest-1.8.0/googlemock/include -isystem /mesos/build/3rdparty/googletest-1.8.0/src/googletest-1.8.0/googletest/include  -std=c++11 -Wformat-security -fstack-protector-strong -fPIE   -o CMakeFiles/stout-tests.dir/hashmap_tests.cpp.o -c /mesos/3rdparty/stout/tests/hashmap_tests.cpp
[ 24%] Building CXX object src/CMakeFiles/mesos-protobufs.dir/__/include/mesos/module/module.pb.cc.o
cd /mesos/build/src && /usr/bin/clang++-3.5  -DLIBDIR=\"/usr/local/libmesos\" -DPKGDATADIR=\"/usr/local/share/mesos\" -DPKGLIBEXECDIR=\"/usr/local/libexec/mesos\" -DUSE_SSL_SOCKET=1 -DVERSION=\"1.5.0\" -Dmesos_protobufs_EXPORTS -I/mesos/build/include -I/mesos/build/include/mesos -I/mesos/build/src -I/mesos/src -isystem /mesos/build/3rdparty/protobuf-3.5.0/src/protobuf-3.5.0/src  -std=c++11 -Wformat-security -fstack-protector-strong -fPIC   -o CMakeFiles/mesos-protobufs.dir/__/include/mesos/module/module.pb.cc.o -c /mesos/build/include/mesos/module/module.pb.cc
[ 24%] Building CXX object 3rdparty/stout/tests/CMakeFiles/stout-tests.dir/hashset_tests.cpp.o
cd /mesos/build/3rdparty/stout/tests && /usr/bin/clang++-3.5  -DHAVE_LIBZ -DLIBDIR=\"/usr/local/libmesos\" -DPICOJSON_USE_INT64 -DPKGDATADIR=\"/usr/local/share/mesos\" -DPKGLIBEXECDIR=\"/usr/local/libexec/mesos\" -DUSE_SSL_SOCKET=1 -DVERSION=\"1.5.0\" -D__STDC_FORMAT_MACROS -I/mesos/build/3rdparty/stout/tests -I/mesos/3rdparty/stout/include -isystem /usr/include/apr-1.0 -isystem /mesos/build/3rdparty/boost-1.53.0/src/boost-1.53.0 -isystem /mesos/build/3rdparty/elfio-3.2/src/elfio-3.2 -isystem /mesos/build/3rdparty/glog-0.3.3/src/glog-0.3.3-build/include -isystem /mesos/build/3rdparty/picojson-1.3.0/src/picojson-1.3.0 -isystem /mesos/build/3rdparty/protobuf-3.5.0/src/protobuf-3.5.0/src -isystem /usr/include/subversion-1 -isystem /mesos/build/3rdparty/googletest-1.8.0/src/googletest-1.8.0/googlemock/include -isystem /mesos/build/3rdparty/googletest-1.8.0/src/googletest-1.8.0/googletest/include  -std=c++11 -Wformat-security -fstack-protector-strong -fPIE   -o CMakeFiles/stout-tests.dir/hashset_tests.cpp.o -c /mesos/3rdparty/stout/tests/hashset_tests.cpp
[ 24%] Building CXX object src/CMakeFiles/mesos-protobufs.dir/__/include/mesos/oci/spec.pb.cc.o
cd /mesos/build/src && /usr/bin/clang++-3.5  -DLIBDIR=\"/usr/local/libmesos\" -DPKGDATADIR=\"/usr/local/share/mesos\" -DPKGLIBEXECDIR=\"/usr/local/libexec/mesos\" -DUSE_SSL_SOCKET=1 -DVERSION=\"1.5.0\" -Dmesos_protobufs_EXPORTS -I/mesos/build/include -I/mesos/build/include/mesos -I/mesos/build/src -I/mesos/src -isystem /mesos/build/3rdparty/protobuf-3.5.0/src/protobuf-3.5.0/src  -std=c++11 -Wformat-security -fstack-protector-strong -fPIC   -o CMakeFiles/mesos-protobufs.dir/__/include/mesos/oci/spec.pb.cc.o -c /mesos/build/include/mesos/oci/spec.pb.cc
[ 25%] Building CXX object 3rdparty/stout/tests/CMakeFiles/stout-tests.dir/interval_tests.cpp.o
cd /mesos/build/3rdparty/stout/tests && /usr/bin/clang++-3.5  -DHAVE_LIBZ -DLIBDIR=\"/usr/local/libmesos\" -DPICOJSON_USE_INT64 -DPKGDATADIR=\"/usr/local/share/mesos\" -DPKGLIBEXECDIR=\"/usr/local/libexec/mesos\" -DUSE_SSL_SOCKET=1 -DVERSION=\"1.5.0\" -D__STDC_FORMAT_MACROS -I/mesos/build/3rdparty/stout/tests -I/mesos/3rdparty/stout/include -isystem /usr/include/apr-1.0 -isystem /mesos/build/3rdparty/boost-1.53.0/src/boost-1.53.0 -isystem /mesos/build/3rdparty/elfio-3.2/src/elfio-3.2 -isystem /mesos/build/3rdparty/glog-0.3.3/src/glog-0.3.3-build/include -isystem /mesos/build/3rdparty/picojson-1.3.0/src/picojson-1.3.0 -isystem /mesos/build/3rdparty/protobuf-3.5.0/src/protobuf-3.5.0/src -isystem /usr/include/subversion-1 -isystem /mesos/build/3rdparty/googletest-1.8.0/src/googletest-1.8.0/googlemock/include -isystem /mesos/build/3rdparty/googletest-1.8.0/src/googletest-1.8.0/googletest/include  -std=c++11 -Wformat-security -fstack-protector-strong -fPIE   -o CMakeFiles/stout-tests.dir/interval_tests.cpp.o -c /mesos/3rdparty/stout/tests/interval_tests.cpp
[ 25%] Building CXX object 3rdparty/stout/tests/CMakeFiles/stout-tests.dir/ip_tests.cpp.o
cd /mesos/build/3rdparty/stout/tests && /usr/bin/clang++-3.5  -DHAVE_LIBZ -DLIBDIR=\"/usr/local/libmesos\" -DPICOJSON_USE_INT64 -DPKGDATADIR=\"/usr/local/share/mesos\" -DPKGLIBEXECDIR=\"/usr/local/libexec/mesos\" -DUSE_SSL_SOCKET=1 -DVERSION=\"1.5.0\" -D__STDC_FORMAT_MACROS -I/mesos/build/3rdparty/stout/tests -I/mesos/3rdparty/stout/include -isystem /usr/include/apr-1.0 -isystem /mesos/build/3rdparty/boost-1.53.0/src/boost-1.53.0 -isystem /mesos/build/3rdparty/elfio-3.2/src/elfio-3.2 -isystem /mesos/build/3rdparty/glog-0.3.3/src/glog-0.3.3-build/include -isystem /mesos/build/3rdparty/picojson-1.3.0/src/picojson-1.3.0 -isystem /mesos/build/3rdparty/protobuf-3.5.0/src/protobuf-3.5.0/src -isystem /usr/include/subversion-1 -isystem /mesos/build/3rdparty/googletest-1.8.0/src/googletest-1.8.0/googlemock/include -isystem /mesos/build/3rdparty/googletest-1.8.0/src/googletest-1.8.0/googletest/include  -std=c++11 -Wformat-security -fstack-protector-strong -fPIE   -o CMakeFiles/stout-tests.dir/ip_tests.cpp.o -c /mesos/3rdparty/stout/tests/ip_tests.cpp
[ 25%] Building CXX object src/CMakeFiles/mesos-protobufs.dir/__/include/mesos/quota/quota.pb.cc.o
cd /mesos/build/src && /usr/bin/clang++-3.5  -DLIBDIR=\"/usr/local/libmesos\" -DPKGDATADIR=\"/usr/local/share/mesos\" -DPKGLIBEXECDIR=\"/usr/local/libexec/mesos\" -DUSE_SSL_SOCKET=1 -DVERSION=\"1.5.0\" -Dmesos_protobufs_EXPORTS -I/mesos/build/include -I/mesos/build/include/mesos -I/mesos/build/src -I/mesos/src -isystem /mesos/build/3rdparty/protobuf-3.5.0/src/protobuf-3.5.0/src  -std=c++11 -Wformat-security -fstack-protector-strong -fPIC   -o CMakeFiles/mesos-protobufs.dir/__/include/mesos/quota/quota.pb.cc.o -c /mesos/build/include/mesos/quota/quota.pb.cc
[ 25%] Building CXX object 3rdparty/stout/tests/CMakeFiles/stout-tests.dir/json_tests.cpp.o
cd /mesos/build/3rdparty/stout/tests && /usr/bin/clang++-3.5  -DHAVE_LIBZ -DLIBDIR=\"/usr/local/libmesos\" -DPICOJSON_USE_INT64 -DPKGDATADIR=\"/usr/local/share/mesos\" -DPKGLIBEXECDIR=\"/usr/local/libexec/mesos\" -DUSE_SSL_SOCKET=1 -DVERSION=\"1.5.0\" -D__STDC_FORMAT_MACROS -I/mesos/build/3rdparty/stout/tests -I/mesos/3rdparty/stout/include -isystem /usr/include/apr-1.0 -isystem /mesos/build/3rdparty/boost-1.53.0/src/boost-1.53.0 -isystem /mesos/build/3rdparty/elfio-3.2/src/elfio-3.2 -isystem /mesos/build/3rdparty/glog-0.3.3/src/glog-0.3.3-build/include -isystem /mesos/build/3rdparty/picojson-1.3.0/src/picojson-1.3.0 -isystem /mesos/build/3rdparty/protobuf-3.5.0/src/protobuf-3.5.0/src -isystem /usr/include/subversion-1 -isystem /mesos/build/3rdparty/googletest-1.8.0/src/googletest-1.8.0/googlemock/include -isystem /mesos/build/3rdparty/googletest-1.8.0/src/googletest-1.8.0/googletest/include  -std=c++11 -Wformat-security -fstack-protector-strong -fPIE   -o CMakeFiles/stout-tests.dir/json_tests.cpp.o -c /mesos/3rdparty/stout/tests/json_tests.cpp
[ 25%] Building CXX object src/CMakeFiles/mesos-protobufs.dir/__/include/mesos/resource_provider/resource_provider.pb.cc.o
cd /mesos/build/src && /usr/bin/clang++-3.5  -DLIBDIR=\"/usr/local/libmesos\" -DPKGDATADIR=\"/usr/local/share/mesos\" -DPKGLIBEXECDIR=\"/usr/local/libexec/mesos\" -DUSE_SSL_SOCKET=1 -DVERSION=\"1.5.0\" -Dmesos_protobufs_EXPORTS -I/mesos/build/include -I/mesos/build/include/mesos -I/mesos/build/src -I/mesos/src -isystem /mesos/build/3rdparty/protobuf-3.5.0/src/protobuf-3.5.0/src  -std=c++11 -Wformat-security -fstack-protector-strong -fPIC   -o CMakeFiles/mesos-protobufs.dir/__/include/mesos/resource_provider/resource_provider.pb.cc.o -c /mesos/build/include/mesos/resource_provider/resource_provider.pb.cc
[ 25%] Building CXX object src/CMakeFiles/mesos-protobufs.dir/__/include/mesos/slave/containerizer.pb.cc.o
cd /mesos/build/src && /usr/bin/clang++-3.5  -DLIBDIR=\"/usr/local/libmesos\" -DPKGDATADIR=\"/usr/local/share/mesos\" -DPKGLIBEXECDIR=\"/usr/local/libexec/mesos\" -DUSE_SSL_SOCKET=1 -DVERSION=\"1.5.0\" -Dmesos_protobufs_EXPORTS -I/mesos/build/include -I/mesos/build/include/mesos -I/mesos/build/src -I/mesos/src -isystem /mesos/build/3rdparty/protobuf-3.5.0/src/protobuf-3.5.0/src  -std=c++11 -Wformat-security -fstack-protector-strong -fPIC   -o CMakeFiles/mesos-protobufs.dir/__/include/mesos/slave/containerizer.pb.cc.o -c /mesos/build/include/mesos/slave/containerizer.pb.cc
[ 26%] Building CXX object src/CMakeFiles/mesos-protobufs.dir/__/include/mesos/slave/oversubscription.pb.cc.o
cd /mesos/build/src && /usr/bin/clang++-3.5  -DLIBDIR=\"/usr/local/libmesos\" -DPKGDATADIR=\"/usr/local/share/mesos\" -DPKGLIBEXECDIR=\"/usr/local/libexec/mesos\" -DUSE_SSL_SOCKET=1 -DVERSION=\"1.5.0\" -Dmesos_protobufs_EXPORTS -I/mesos/build/include -I/mesos/build/include/mesos -I/mesos/build/src -I/mesos/src -isystem /mesos/build/3rdparty/protobuf-3.5.0/src/protobuf-3.5.0/src  -std=c++11 -Wformat-security -fstack-protector-strong -fPIC   -o CMakeFiles/mesos-protobufs.dir/__/include/mesos/slave/oversubscription.pb.cc.o -c /mesos/build/include/mesos/slave/oversubscription.pb.cc
[ 26%] Building CXX object src/CMakeFiles/mesos-protobufs.dir/__/include/mesos/state/state.pb.cc.o
cd /mesos/build/src && /usr/bin/clang++-3.5  -DLIBDIR=\"/usr/local/libmesos\" -DPKGDATADIR=\"/usr/local/share/mesos\" -DPKGLIBEXECDIR=\"/usr/local/libexec/mesos\" -DUSE_SSL_SOCKET=1 -DVERSION=\"1.5.0\" -Dmesos_protobufs_EXPORTS -I/mesos/build/include -I/mesos/build/include/mesos -I/mesos/build/src -I/mesos/src -isystem /mesos/build/3rdparty/protobuf-3.5.0/src/protobuf-3.5.0/src  -std=c++11 -Wformat-security -fstack-protector-strong -fPIC   -o CMakeFiles/mesos-protobufs.dir/__/include/mesos/state/state.pb.cc.o -c /mesos/build/include/mesos/state/state.pb.cc
[ 26%] Building CXX object 3rdparty/stout/tests/CMakeFiles/stout-tests.dir/jsonify_tests.cpp.o
cd /mesos/build/3rdparty/stout/tests && /usr/bin/clang++-3.5  -DHAVE_LIBZ -DLIBDIR=\"/usr/local/libmesos\" -DPICOJSON_USE_INT64 -DPKGDATADIR=\"/usr/local/share/mesos\" -DPKGLIBEXECDIR=\"/usr/local/libexec/mesos\" -DUSE_SSL_SOCKET=1 -DVERSION=\"1.5.0\" -D__STDC_FORMAT_MACROS -I/mesos/build/3rdparty/stout/tests -I/mesos/3rdparty/stout/include -isystem /usr/include/apr-1.0 -isystem /mesos/build/3rdparty/boost-1.53.0/src/boost-1.53.0 -isystem /mesos/build/3rdparty/elfio-3.2/src/elfio-3.2 -isystem /mesos/build/3rdparty/glog-0.3.3/src/glog-0.3.3-build/include -isystem /mesos/build/3rdparty/picojson-1.3.0/src/picojson-1.3.0 -isystem /mesos/build/3rdparty/protobuf-3.5.0/src/protobuf-3.5.0/src -isystem /usr/include/subversion-1 -isystem /mesos/build/3rdparty/googletest-1.8.0/src/googletest-1.8.0/googlemock/include -isystem /mesos/build/3rdparty/googletest-1.8.0/src/googletest-1.8.0/googletest/include  -std=c++11 -Wformat-security -fstack-protector-strong -fPIE   -o CMakeFiles/stout-tests.dir/jsonify_tests.cpp.o -c /mesos/3rdparty/stout/tests/jsonify_tests.cpp
[ 26%] Building CXX object 3rdparty/stout/tests/CMakeFiles/stout-tests.dir/lambda_tests.cpp.o
cd /mesos/build/3rdparty/stout/tests && /usr/bin/clang++-3.5  -DHAVE_LIBZ -DLIBDIR=\"/usr/local/libmesos\" -DPICOJSON_USE_INT64 -DPKGDATADIR=\"/usr/local/share/mesos\" -DPKGLIBEXECDIR=\"/usr/local/libexec/mesos\" -DUSE_SSL_SOCKET=1 -DVERSION=\"1.5.0\" -D__STDC_FORMAT_MACROS -I/mesos/build/3rdparty/stout/tests -I/mesos/3rdparty/stout/include -isystem /usr/include/apr-1.0 -isystem /mesos/build/3rdparty/boost-1.53.0/src/boost-1.53.0 -isystem /mesos/build/3rdparty/elfio-3.2/src/elfio-3.2 -isystem /mesos/build/3rdparty/glog-0.3.3/src/glog-0.3.3-build/include -isystem /mesos/build/3rdparty/picojson-1.3.0/src/picojson-1.3.0 -isystem /mesos/build/3rdparty/protobuf-3.5.0/src/protobuf-3.5.0/src -isystem /usr/include/subversion-1 -isystem /mesos/build/3rdparty/googletest-1.8.0/src/googletest-1.8.0/googlemock/include -isystem /mesos/build/3rdparty/googletest-1.8.0/src/googletest-1.8.0/googletest/include  -std=c++11 -Wformat-security -fstack-protector-strong -fPIE   -o CMakeFiles/stout-tests.dir/lambda_tests.cpp.o -c /mesos/3rdparty/stout/tests/lambda_tests.cpp
[ 26%] Building CXX object 3rdparty/stout/tests/CMakeFiles/stout-tests.dir/linkedhashmap_tests.cpp.o
cd /mesos/build/3rdparty/stout/tests && /usr/bin/clang++-3.5  -DHAVE_LIBZ -DLIBDIR=\"/usr/local/libmesos\" -DPICOJSON_USE_INT64 -DPKGDATADIR=\"/usr/local/share/mesos\" -DPKGLIBEXECDIR=\"/usr/local/libexec/mesos\" -DUSE_SSL_SOCKET=1 -DVERSION=\"1.5.0\" -D__STDC_FORMAT_MACROS -I/mesos/build/3rdparty/stout/tests -I/mesos/3rdparty/stout/include -isystem /usr/include/apr-1.0 -isystem /mesos/build/3rdparty/boost-1.53.0/src/boost-1.53.0 -isystem /mesos/build/3rdparty/elfio-3.2/src/elfio-3.2 -isystem /mesos/build/3rdparty/glog-0.3.3/src/glog-0.3.3-build/include -isystem /mesos/build/3rdparty/picojson-1.3.0/src/picojson-1.3.0 -isystem /mesos/build/3rdparty/protobuf-3.5.0/src/protobuf-3.5.0/src -isystem /usr/include/subversion-1 -isystem /mesos/build/3rdparty/googletest-1.8.0/src/googletest-1.8.0/googlemock/include -isystem /mesos/build/3rdparty/googletest-1.8.0/src/googletest-1.8.0/googletest/include  -std=c++11 -Wformat-security -fstack-protector-strong -fPIE   -o CMakeFiles/stout-tests.dir/linkedhashmap_tests.cpp.o -c /mesos/3rdparty/stout/tests/linkedhashmap_tests.cpp
[ 26%] Building CXX object 3rdparty/stout/tests/CMakeFiles/stout-tests.dir/mac_tests.cpp.o
cd /mesos/build/3rdparty/stout/tests && /usr/bin/clang++-3.5  -DHAVE_LIBZ -DLIBDIR=\"/usr/local/libmesos\" -DPICOJSON_USE_INT64 -DPKGDATADIR=\"/usr/local/share/mesos\" -DPKGLIBEXECDIR=\"/usr/local/libexec/mesos\" -DUSE_SSL_SOCKET=1 -DVERSION=\"1.5.0\" -D__STDC_FORMAT_MACROS -I/mesos/build/3rdparty/stout/tests -I/mesos/3rdparty/stout/include -isystem /usr/include/apr-1.0 -isystem /mesos/build/3rdparty/boost-1.53.0/src/boost-1.53.0 -isystem /mesos/build/3rdparty/elfio-3.2/src/elfio-3.2 -isystem /mesos/build/3rdparty/glog-0.3.3/src/glog-0.3.3-build/include -isystem /mesos/build/3rdparty/picojson-1.3.0/src/picojson-1.3.0 -isystem /mesos/build/3rdparty/protobuf-3.5.0/src/protobuf-3.5.0/src -isystem /usr/include/subversion-1 -isystem /mesos/build/3rdparty/googletest-1.8.0/src/googletest-1.8.0/googlemock/include -isystem /mesos/build/3rdparty/googletest-1.8.0/src/googletest-1.8.0/googletest/include  -std=c++11 -Wformat-security -fstack-protector-strong -fPIE   -o CMakeFiles/stout-tests.dir/mac_tests.cpp.o -c /mesos/3rdparty/stout/tests/mac_tests.cpp
[ 26%] Building CXX object src/CMakeFiles/mesos-protobufs.dir/__/include/mesos/uri/uri.pb.cc.o
cd /mesos/build/src && /usr/bin/clang++-3.5  -DLIBDIR=\"/usr/local/libmesos\" -DPKGDATADIR=\"/usr/local/share/mesos\" -DPKGLIBEXECDIR=\"/usr/local/libexec/mesos\" -DUSE_SSL_SOCKET=1 -DVERSION=\"1.5.0\" -Dmesos_protobufs_EXPORTS -I/mesos/build/include -I/mesos/build/include/mesos -I/mesos/build/src -I/mesos/src -isystem /mesos/build/3rdparty/protobuf-3.5.0/src/protobuf-3.5.0/src  -std=c++11 -Wformat-security -fstack-protector-strong -fPIC   -o CMakeFiles/mesos-protobufs.dir/__/include/mesos/uri/uri.pb.cc.o -c /mesos/build/include/mesos/uri/uri.pb.cc
[ 26%] Building CXX object 3rdparty/stout/tests/CMakeFiles/stout-tests.dir/main.cpp.o
cd /mesos/build/3rdparty/stout/tests && /usr/bin/clang++-3.5  -DHAVE_LIBZ -DLIBDIR=\"/usr/local/libmesos\" -DPICOJSON_USE_INT64 -DPKGDATADIR=\"/usr/local/share/mesos\" -DPKGLIBEXECDIR=\"/usr/local/libexec/mesos\" -DUSE_SSL_SOCKET=1 -DVERSION=\"1.5.0\" -D__STDC_FORMAT_MACROS -I/mesos/build/3rdparty/stout/tests -I/mesos/3rdparty/stout/include -isystem /usr/include/apr-1.0 -isystem /mesos/build/3rdparty/boost-1.53.0/src/boost-1.53.0 -isystem /mesos/build/3rdparty/elfio-3.2/src/elfio-3.2 -isystem /mesos/build/3rdparty/glog-0.3.3/src/glog-0.3.3-build/include -isystem /mesos/build/3rdparty/picojson-1.3.0/src/picojson-1.3.0 -isystem /mesos/build/3rdparty/protobuf-3.5.0/src/protobuf-3.5.0/src -isystem /usr/include/subversion-1 -isystem /mesos/build/3rdparty/googletest-1.8.0/src/googletest-1.8.0/googlemock/include -isystem /mesos/build/3rdparty/googletest-1.8.0/src/googletest-1.8.0/googletest/include  -std=c++11 -Wformat-security -fstack-protector-strong -fPIE   -o CMakeFiles/stout-tests.dir/main.cpp.o -c /mesos/3rdparty/stout/tests/main.cpp
[ 26%] Building CXX object src/CMakeFiles/mesos-protobufs.dir/__/include/mesos/executor/executor.pb.cc.o
cd /mesos/build/src && /usr/bin/clang++-3.5  -DLIBDIR=\"/usr/local/libmesos\" -DPKGDATADIR=\"/usr/local/share/mesos\" -DPKGLIBEXECDIR=\"/usr/local/libexec/mesos\" -DUSE_SSL_SOCKET=1 -DVERSION=\"1.5.0\" -Dmesos_protobufs_EXPORTS -I/mesos/build/include -I/mesos/build/include/mesos -I/mesos/build/src -I/mesos/src -isystem /mesos/build/3rdparty/protobuf-3.5.0/src/protobuf-3.5.0/src  -std=c++11 -Wformat-security -fstack-protector-strong -fPIC   -o CMakeFiles/mesos-protobufs.dir/__/include/mesos/executor/executor.pb.cc.o -c /mesos/build/include/mesos/executor/executor.pb.cc
[ 27%] Building CXX object 3rdparty/stout/tests/CMakeFiles/stout-tests.dir/multimap_tests.cpp.o
cd /mesos/build/3rdparty/stout/tests && /usr/bin/clang++-3.5  -DHAVE_LIBZ -DLIBDIR=\"/usr/local/libmesos\" -DPICOJSON_USE_INT64 -DPKGDATADIR=\"/usr/local/share/mesos\" -DPKGLIBEXECDIR=\"/usr/local/libexec/mesos\" -DUSE_SSL_SOCKET=1 -DVERSION=\"1.5.0\" -D__STDC_FORMAT_MACROS -I/mesos/build/3rdparty/stout/tests -I/mesos/3rdparty/stout/include -isystem /usr/include/apr-1.0 -isystem /mesos/build/3rdparty/boost-1.53.0/src/boost-1.53.0 -isystem /mesos/build/3rdparty/elfio-3.2/src/elfio-3.2 -isystem /mesos/build/3rdparty/glog-0.3.3/src/glog-0.3.3-build/include -isystem /mesos/build/3rdparty/picojson-1.3.0/src/picojson-1.3.0 -isystem /mesos/build/3rdparty/protobuf-3.5.0/src/protobuf-3.5.0/src -isystem /usr/include/subversion-1 -isystem /mesos/build/3rdparty/googletest-1.8.0/src/googletest-1.8.0/googlemock/include -isystem /mesos/build/3rdparty/googletest-1.8.0/src/googletest-1.8.0/googletest/include  -std=c++11 -Wformat-security -fstack-protector-strong -fPIE   -o CMakeFiles/stout-tests.dir/multimap_tests.cpp.o -c /mesos/3rdparty/stout/tests/multimap_tests.cpp
[ 27%] Building CXX object 3rdparty/stout/tests/CMakeFiles/stout-tests.dir/none_tests.cpp.o
cd /mesos/build/3rdparty/stout/tests && /usr/bin/clang++-3.5  -DHAVE_LIBZ -DLIBDIR=\"/usr/local/libmesos\" -DPICOJSON_USE_INT64 -DPKGDATADIR=\"/usr/local/share/mesos\" -DPKGLIBEXECDIR=\"/usr/local/libexec/mesos\" -DUSE_SSL_SOCKET=1 -DVERSION=\"1.5.0\" -D__STDC_FORMAT_MACROS -I/mesos/build/3rdparty/stout/tests -I/mesos/3rdparty/stout/include -isystem /usr/include/apr-1.0 -isystem /mesos/build/3rdparty/boost-1.53.0/src/boost-1.53.0 -isystem /mesos/build/3rdparty/elfio-3.2/src/elfio-3.2 -isystem /mesos/build/3rdparty/glog-0.3.3/src/glog-0.3.3-build/include -isystem /mesos/build/3rdparty/picojson-1.3.0/src/picojson-1.3.0 -isystem /mesos/build/3rdparty/protobuf-3.5.0/src/protobuf-3.5.0/src -isystem /usr/include/subversion-1 -isystem /mesos/build/3rdparty/googletest-1.8.0/src/googletest-1.8.0/googlemock/include -isystem /mesos/build/3rdparty/googletest-1.8.0/src/googletest-1.8.0/googletest/include  -std=c++11 -Wformat-security -fstack-protector-strong -fPIE   -o CMakeFiles/stout-tests.dir/none_tests.cpp.o -c /mesos/3rdparty/stout/tests/none_tests.cpp
[ 27%] Building CXX object 3rdparty/stout/tests/CMakeFiles/stout-tests.dir/numify_tests.cpp.o
cd /mesos/build/3rdparty/stout/tests && /usr/bin/clang++-3.5  -DHAVE_LIBZ -DLIBDIR=\"/usr/local/libmesos\" -DPICOJSON_USE_INT64 -DPKGDATADIR=\"/usr/local/share/mesos\" -DPKGLIBEXECDIR=\"/usr/local/libexec/mesos\" -DUSE_SSL_SOCKET=1 -DVERSION=\"1.5.0\" -D__STDC_FORMAT_MACROS -I/mesos/build/3rdparty/stout/tests -I/mesos/3rdparty/stout/include -isystem /usr/include/apr-1.0 -isystem /mesos/build/3rdparty/boost-1.53.0/src/boost-1.53.0 -isystem /mesos/build/3rdparty/elfio-3.2/src/elfio-3.2 -isystem /mesos/build/3rdparty/glog-0.3.3/src/glog-0.3.3-build/include -isystem /mesos/build/3rdparty/picojson-1.3.0/src/picojson-1.3.0 -isystem /mesos/build/3rdparty/protobuf-3.5.0/src/protobuf-3.5.0/src -isystem /usr/include/subversion-1 -isystem /mesos/build/3rdparty/googletest-1.8.0/src/googletest-1.8.0/googlemock/include -isystem /mesos/build/3rdparty/googletest-1.8.0/src/googletest-1.8.0/googletest/include  -std=c++11 -Wformat-security -fstack-protector-strong -fPIE   -o CMakeFiles/stout-tests.dir/numify_tests.cpp.o -c /mesos/3rdparty/stout/tests/numify_tests.cpp
[ 27%] Building CXX object 3rdparty/stout/tests/CMakeFiles/stout-tests.dir/option_tests.cpp.o
cd /mesos/build/3rdparty/stout/tests && /usr/bin/clang++-3.5  -DHAVE_LIBZ -DLIBDIR=\"/usr/local/libmesos\" -DPICOJSON_USE_INT64 -DPKGDATADIR=\"/usr/local/share/mesos\" -DPKGLIBEXECDIR=\"/usr/local/libexec/mesos\" -DUSE_SSL_SOCKET=1 -DVERSION=\"1.5.0\" -D__STDC_FORMAT_MACROS -I/mesos/build/3rdparty/stout/tests -I/mesos/3rdparty/stout/include -isystem /usr/include/apr-1.0 -isystem /mesos/build/3rdparty/boost-1.53.0/src/boost-1.53.0 -isystem /mesos/build/3rdparty/elfio-3.2/src/elfio-3.2 -isystem /mesos/build/3rdparty/glog-0.3.3/src/glog-0.3.3-build/include -isystem /mesos/build/3rdparty/picojson-1.3.0/src/picojson-1.3.0 -isystem /mesos/build/3rdparty/protobuf-3.5.0/src/protobuf-3.5.0/src -isystem /usr/include/subversion-1 -isystem /mesos/build/3rdparty/googletest-1.8.0/src/googletest-1.8.0/googlemock/include -isystem /mesos/build/3rdparty/googletest-1.8.0/src/googletest-1.8.0/googletest/include  -std=c++11 -Wformat-security -fstack-protector-strong -fPIE   -o CMakeFiles/stout-tests.dir/option_tests.cpp.o -c /mesos/3rdparty/stout/tests/option_tests.cpp
[ 27%] Building CXX object 3rdparty/stout/tests/CMakeFiles/stout-tests.dir/os_tests.cpp.o
cd /mesos/build/3rdparty/stout/tests && /usr/bin/clang++-3.5  -DHAVE_LIBZ -DLIBDIR=\"/usr/local/libmesos\" -DPICOJSON_USE_INT64 -DPKGDATADIR=\"/usr/local/share/mesos\" -DPKGLIBEXECDIR=\"/usr/local/libexec/mesos\" -DUSE_SSL_SOCKET=1 -DVERSION=\"1.5.0\" -D__STDC_FORMAT_MACROS -I/mesos/build/3rdparty/stout/tests -I/mesos/3rdparty/stout/include -isystem /usr/include/apr-1.0 -isystem /mesos/build/3rdparty/boost-1.53.0/src/boost-1.53.0 -isystem /mesos/build/3rdparty/elfio-3.2/src/elfio-3.2 -isystem /mesos/build/3rdparty/glog-0.3.3/src/glog-0.3.3-build/include -isystem /mesos/build/3rdparty/picojson-1.3.0/src/picojson-1.3.0 -isystem /mesos/build/3rdparty/protobuf-3.5.0/src/protobuf-3.5.0/src -isystem /usr/include/subversion-1 -isystem /mesos/build/3rdparty/googletest-1.8.0/src/googletest-1.8.0/googlemock/include -isystem /mesos/build/3rdparty/googletest-1.8.0/src/googletest-1.8.0/googletest/include  -std=c++11 -Wformat-security -fstack-protector-strong -fPIE   -o CMakeFiles/stout-tests.dir/os_tests.cpp.o -c /mesos/3rdparty/stout/tests/os_tests.cpp
[ 27%] Building CXX object src/CMakeFiles/mesos-protobufs.dir/__/include/mesos/fetcher/fetcher.pb.cc.o
cd /mesos/build/src && /usr/bin/clang++-3.5  -DLIBDIR=\"/usr/local/libmesos\" -DPKGDATADIR=\"/usr/local/share/mesos\" -DPKGLIBEXECDIR=\"/usr/local/libexec/mesos\" -DUSE_SSL_SOCKET=1 -DVERSION=\"1.5.0\" -Dmesos_protobufs_EXPORTS -I/mesos/build/include -I/mesos/build/include/mesos -I/mesos/build/src -I/mesos/src -isystem /mesos/build/3rdparty/protobuf-3.5.0/src/protobuf-3.5.0/src  -std=c++11 -Wformat-security -fstack-protector-strong -fPIC   -o CMakeFiles/mesos-protobufs.dir/__/include/mesos/fetcher/fetcher.pb.cc.o -c /mesos/build/include/mesos/fetcher/fetcher.pb.cc
[ 27%] Building CXX object 3rdparty/stout/tests/CMakeFiles/stout-tests.dir/path_tests.cpp.o
cd /mesos/build/3rdparty/stout/tests && /usr/bin/clang++-3.5  -DHAVE_LIBZ -DLIBDIR=\"/usr/local/libmesos\" -DPICOJSON_USE_INT64 -DPKGDATADIR=\"/usr/local/share/mesos\" -DPKGLIBEXECDIR=\"/usr/local/libexec/mesos\" -DUSE_SSL_SOCKET=1 -DVERSION=\"1.5.0\" -D__STDC_FORMAT_MACROS -I/mesos/build/3rdparty/stout/tests -I/mesos/3rdparty/stout/include -isystem /usr/include/apr-1.0 -isystem /mesos/build/3rdparty/boost-1.53.0/src/boost-1.53.0 -isystem /mesos/build/3rdparty/elfio-3.2/src/elfio-3.2 -isystem /mesos/build/3rdparty/glog-0.3.3/src/glog-0.3.3-build/include -isystem /mesos/build/3rdparty/picojson-1.3.0/src/picojson-1.3.0 -isystem /mesos/build/3rdparty/protobuf-3.5.0/src/protobuf-3.5.0/src -isystem /usr/include/subversion-1 -isystem /mesos/build/3rdparty/googletest-1.8.0/src/googletest-1.8.0/googlemock/include -isystem /mesos/build/3rdparty/googletest-1.8.0/src/googletest-1.8.0/googletest/include  -std=c++11 -Wformat-security -fstack-protector-strong -fPIE   -o CMakeFiles/stout-tests.dir/path_tests.cpp.o -c /mesos/3rdparty/stout/tests/path_tests.cpp
[ 27%] Building CXX object src/CMakeFiles/mesos-protobufs.dir/__/include/mesos/mesos.pb.cc.o
cd /mesos/build/src && /usr/bin/clang++-3.5  -DLIBDIR=\"/usr/local/libmesos\" -DPKGDATADIR=\"/usr/local/share/mesos\" -DPKGLIBEXECDIR=\"/usr/local/libexec/mesos\" -DUSE_SSL_SOCKET=1 -DVERSION=\"1.5.0\" -Dmesos_protobufs_EXPORTS -I/mesos/build/include -I/mesos/build/include/mesos -I/mesos/build/src -I/mesos/src -isystem /mesos/build/3rdparty/protobuf-3.5.0/src/protobuf-3.5.0/src  -std=c++11 -Wformat-security -fstack-protector-strong -fPIC   -o CMakeFiles/mesos-protobufs.dir/__/include/mesos/mesos.pb.cc.o -c /mesos/build/include/mesos/mesos.pb.cc
[ 27%] Building CXX object 3rdparty/stout/tests/CMakeFiles/stout-tests.dir/recordio_tests.cpp.o
cd /mesos/build/3rdparty/stout/tests && /usr/bin/clang++-3.5  -DHAVE_LIBZ -DLIBDIR=\"/usr/local/libmesos\" -DPICOJSON_USE_INT64 -DPKGDATADIR=\"/usr/local/share/mesos\" -DPKGLIBEXECDIR=\"/usr/local/libexec/mesos\" -DUSE_SSL_SOCKET=1 -DVERSION=\"1.5.0\" -D__STDC_FORMAT_MACROS -I/mesos/build/3rdparty/stout/tests -I/mesos/3rdparty/stout/include -isystem /usr/include/apr-1.0 -isystem /mesos/build/3rdparty/boost-1.53.0/src/boost-1.53.0 -isystem /mesos/build/3rdparty/elfio-3.2/src/elfio-3.2 -isystem /mesos/build/3rdparty/glog-0.3.3/src/glog-0.3.3-build/include -isystem /mesos/build/3rdparty/picojson-1.3.0/src/picojson-1.3.0 -isystem /mesos/build/3rdparty/protobuf-3.5.0/src/protobuf-3.5.0/src -isystem /usr/include/subversion-1 -isystem /mesos/build/3rdparty/googletest-1.8.0/src/googletest-1.8.0/googlemock/include -isystem /mesos/build/3rdparty/googletest-1.8.0/src/googletest-1.8.0/googletest/include  -std=c++11 -Wformat-security -fstack-protector-strong -fPIE   -o CMakeFiles/stout-tests.dir/recordio_tests.cpp.o -c /mesos/3rdparty/stout/tests/recordio_tests.cpp
[ 27%] Building CXX object src/CMakeFiles/mesos-protobufs.dir/__/include/mesos/scheduler/scheduler.pb.cc.o
cd /mesos/build/src && /usr/bin/clang++-3.5  -DLIBDIR=\"/usr/local/libmesos\" -DPKGDATADIR=\"/usr/local/share/mesos\" -DPKGLIBEXECDIR=\"/usr/local/libexec/mesos\" -DUSE_SSL_SOCKET=1 -DVERSION=\"1.5.0\" -Dmesos_protobufs_EXPORTS -I/mesos/build/include -I/mesos/build/include/mesos -I/mesos/build/src -I/mesos/src -isystem /mesos/build/3rdparty/protobuf-3.5.0/src/protobuf-3.5.0/src  -std=c++11 -Wformat-security -fstack-protector-strong -fPIC   -o CMakeFiles/mesos-protobufs.dir/__/include/mesos/scheduler/scheduler.pb.cc.o -c /mesos/build/include/mesos/scheduler/scheduler.pb.cc
[ 27%] Building CXX object src/CMakeFiles/mesos-protobufs.dir/__/include/mesos/v1/agent/agent.pb.cc.o
cd /mesos/build/src && /usr/bin/clang++-3.5  -DLIBDIR=\"/usr/local/libmesos\" -DPKGDATADIR=\"/usr/local/share/mesos\" -DPKGLIBEXECDIR=\"/usr/local/libexec/mesos\" -DUSE_SSL_SOCKET=1 -DVERSION=\"1.5.0\" -Dmesos_protobufs_EXPORTS -I/mesos/build/include -I/mesos/build/include/mesos -I/mesos/build/src -I/mesos/src -isystem /mesos/build/3rdparty/protobuf-3.5.0/src/protobuf-3.5.0/src  -std=c++11 -Wformat-security -fstack-protector-strong -fPIC   -o CMakeFiles/mesos-protobufs.dir/__/include/mesos/v1/agent/agent.pb.cc.o -c /mesos/build/include/mesos/v1/agent/agent.pb.cc
[ 28%] Building CXX object 3rdparty/stout/tests/CMakeFiles/stout-tests.dir/result_tests.cpp.o
cd /mesos/build/3rdparty/stout/tests && /usr/bin/clang++-3.5  -DHAVE_LIBZ -DLIBDIR=\"/usr/local/libmesos\" -DPICOJSON_USE_INT64 -DPKGDATADIR=\"/usr/local/share/mesos\" -DPKGLIBEXECDIR=\"/usr/local/libexec/mesos\" -DUSE_SSL_SOCKET=1 -DVERSION=\"1.5.0\" -D__STDC_FORMAT_MACROS -I/mesos/build/3rdparty/stout/tests -I/mesos/3rdparty/stout/include -isystem /usr/include/apr-1.0 -isystem /mesos/build/3rdparty/boost-1.53.0/src/boost-1.53.0 -isystem /mesos/build/3rdparty/elfio-3.2/src/elfio-3.2 -isystem /mesos/build/3rdparty/glog-0.3.3/src/glog-0.3.3-build/include -isystem /mesos/build/3rdparty/picojson-1.3.0/src/picojson-1.3.0 -isystem /mesos/build/3rdparty/protobuf-3.5.0/src/protobuf-3.5.0/src -isystem /usr/include/subversion-1 -isystem /mesos/build/3rdparty/googletest-1.8.0/src/googletest-1.8.0/googlemock/include -isystem /mesos/build/3rdparty/googletest-1.8.0/src/googletest-1.8.0/googletest/include  -std=c++11 -Wformat-security -fstack-protector-strong -fPIE   -o CMakeFiles/stout-tests.dir/result_tests.cpp.o -c /mesos/3rdparty/stout/tests/result_tests.cpp
[ 29%] Building CXX object src/CMakeFiles/mesos-protobufs.dir/__/include/mesos/v1/allocator/allocator.pb.cc.o
cd /mesos/build/src && /usr/bin/clang++-3.5  -DLIBDIR=\"/usr/local/libmesos\" -DPKGDATADIR=\"/usr/local/share/mesos\" -DPKGLIBEXECDIR=\"/usr/local/libexec/mesos\" -DUSE_SSL_SOCKET=1 -DVERSION=\"1.5.0\" -Dmesos_protobufs_EXPORTS -I/mesos/build/include -I/mesos/build/include/mesos -I/mesos/build/src -I/mesos/src -isystem /mesos/build/3rdparty/protobuf-3.5.0/src/protobuf-3.5.0/src  -std=c++11 -Wformat-security -fstack-protector-strong -fPIC   -o CMakeFiles/mesos-protobufs.dir/__/include/mesos/v1/allocator/allocator.pb.cc.o -c /mesos/build/include/mesos/v1/allocator/allocator.pb.cc
[ 29%] Building CXX object 3rdparty/stout/tests/CMakeFiles/stout-tests.dir/some_tests.cpp.o
cd /mesos/build/3rdparty/stout/tests && /usr/bin/clang++-3.5  -DHAVE_LIBZ -DLIBDIR=\"/usr/local/libmesos\" -DPICOJSON_USE_INT64 -DPKGDATADIR=\"/usr/local/share/mesos\" -DPKGLIBEXECDIR=\"/usr/local/libexec/mesos\" -DUSE_SSL_SOCKET=1 -DVERSION=\"1.5.0\" -D__STDC_FORMAT_MACROS -I/mesos/build/3rdparty/stout/tests -I/mesos/3rdparty/stout/include -isystem /usr/include/apr-1.0 -isystem /mesos/build/3rdparty/boost-1.53.0/src/boost-1.53.0 -isystem /mesos/build/3rdparty/elfio-3.2/src/elfio-3.2 -isystem /mesos/build/3rdparty/glog-0.3.3/src/glog-0.3.3-build/include -isystem /mesos/build/3rdparty/picojson-1.3.0/src/picojson-1.3.0 -isystem /mesos/build/3rdparty/protobuf-3.5.0/src/protobuf-3.5.0/src -isystem /usr/include/subversion-1 -isystem /mesos/build/3rdparty/googletest-1.8.0/src/googletest-1.8.0/googlemock/include -isystem /mesos/build/3rdparty/googletest-1.8.0/src/googletest-1.8.0/googletest/include  -std=c++11 -Wformat-security -fstack-protector-strong -fPIE   -o CMakeFiles/stout-tests.dir/some_tests.cpp.o -c /mesos/3rdparty/stout/tests/some_tests.cpp
[ 29%] Building CXX object 3rdparty/stout/tests/CMakeFiles/stout-tests.dir/strings_tests.cpp.o
cd /mesos/build/3rdparty/stout/tests && /usr/bin/clang++-3.5  -DHAVE_LIBZ -DLIBDIR=\"/usr/local/libmesos\" -DPICOJSON_USE_INT64 -DPKGDATADIR=\"/usr/local/share/mesos\" -DPKGLIBEXECDIR=\"/usr/local/libexec/mesos\" -DUSE_SSL_SOCKET=1 -DVERSION=\"1.5.0\" -D__STDC_FORMAT_MACROS -I/mesos/build/3rdparty/stout/tests -I/mesos/3rdparty/stout/include -isystem /usr/include/apr-1.0 -isystem /mesos/build/3rdparty/boost-1.53.0/src/boost-1.53.0 -isystem /mesos/build/3rdparty/elfio-3.2/src/elfio-3.2 -isystem /mesos/build/3rdparty/glog-0.3.3/src/glog-0.3.3-build/include -isystem /mesos/build/3rdparty/picojson-1.3.0/src/picojson-1.3.0 -isystem /mesos/build/3rdparty/protobuf-3.5.0/src/protobuf-3.5.0/src -isystem /usr/include/subversion-1 -isystem /mesos/build/3rdparty/googletest-1.8.0/src/googletest-1.8.0/googlemock/include -isystem /mesos/build/3rdparty/googletest-1.8.0/src/googletest-1.8.0/googletest/include  -std=c++11 -Wformat-security -fstack-protector-strong -fPIE   -o CMakeFiles/stout-tests.dir/strings_tests.cpp.o -c /mesos/3rdparty/stout/tests/strings_tests.cpp
[ 29%] Building CXX object 3rdparty/stout/tests/CMakeFiles/stout-tests.dir/subcommand_tests.cpp.o
cd /mesos/build/3rdparty/stout/tests && /usr/bin/clang++-3.5  -DHAVE_LIBZ -DLIBDIR=\"/usr/local/libmesos\" -DPICOJSON_USE_INT64 -DPKGDATADIR=\"/usr/local/share/mesos\" -DPKGLIBEXECDIR=\"/usr/local/libexec/mesos\" -DUSE_SSL_SOCKET=1 -DVERSION=\"1.5.0\" -D__STDC_FORMAT_MACROS -I/mesos/build/3rdparty/stout/tests -I/mesos/3rdparty/stout/include -isystem /usr/include/apr-1.0 -isystem /mesos/build/3rdparty/boost-1.53.0/src/boost-1.53.0 -isystem /mesos/build/3rdparty/elfio-3.2/src/elfio-3.2 -isystem /mesos/build/3rdparty/glog-0.3.3/src/glog-0.3.3-build/include -isystem /mesos/build/3rdparty/picojson-1.3.0/src/picojson-1.3.0 -isystem /mesos/build/3rdparty/protobuf-3.5.0/src/protobuf-3.5.0/src -isystem /usr/include/subversion-1 -isystem /mesos/build/3rdparty/googletest-1.8.0/src/googletest-1.8.0/googlemock/include -isystem /mesos/build/3rdparty/googletest-1.8.0/src/googletest-1.8.0/googletest/include  -std=c++11 -Wformat-security -fstack-protector-strong -fPIE   -o CMakeFiles/stout-tests.dir/subcommand_tests.cpp.o -c /mesos/3rdparty/stout/tests/subcommand_tests.cpp
[ 29%] Building CXX object src/CMakeFiles/mesos-protobufs.dir/__/include/mesos/v1/executor/executor.pb.cc.o
cd /mesos/build/src && /usr/bin/clang++-3.5  -DLIBDIR=\"/usr/local/libmesos\" -DPKGDATADIR=\"/usr/local/share/mesos\" -DPKGLIBEXECDIR=\"/usr/local/libexec/mesos\" -DUSE_SSL_SOCKET=1 -DVERSION=\"1.5.0\" -Dmesos_protobufs_EXPORTS -I/mesos/build/include -I/mesos/build/include/mesos -I/mesos/build/src -I/mesos/src -isystem /mesos/build/3rdparty/protobuf-3.5.0/src/protobuf-3.5.0/src  -std=c++11 -Wformat-security -fstack-protector-strong -fPIC   -o CMakeFiles/mesos-protobufs.dir/__/include/mesos/v1/executor/executor.pb.cc.o -c /mesos/build/include/mesos/v1/executor/executor.pb.cc
[ 29%] Building CXX object 3rdparty/stout/tests/CMakeFiles/stout-tests.dir/try_tests.cpp.o
cd /mesos/build/3rdparty/stout/tests && /usr/bin/clang++-3.5  -DHAVE_LIBZ -DLIBDIR=\"/usr/local/libmesos\" -DPICOJSON_USE_INT64 -DPKGDATADIR=\"/usr/local/share/mesos\" -DPKGLIBEXECDIR=\"/usr/local/libexec/mesos\" -DUSE_SSL_SOCKET=1 -DVERSION=\"1.5.0\" -D__STDC_FORMAT_MACROS -I/mesos/build/3rdparty/stout/tests -I/mesos/3rdparty/stout/include -isystem /usr/include/apr-1.0 -isystem /mesos/build/3rdparty/boost-1.53.0/src/boost-1.53.0 -isystem /mesos/build/3rdparty/elfio-3.2/src/elfio-3.2 -isystem /mesos/build/3rdparty/glog-0.3.3/src/glog-0.3.3-build/include -isystem /mesos/build/3rdparty/picojson-1.3.0/src/picojson-1.3.0 -isystem /mesos/build/3rdparty/protobuf-3.5.0/src/protobuf-3.5.0/src -isystem /usr/include/subversion-1 -isystem /mesos/build/3rdparty/googletest-1.8.0/src/googletest-1.8.0/googlemock/include -isystem /mesos/build/3rdparty/googletest-1.8.0/src/googletest-1.8.0/googletest/include  -std=c++11 -Wformat-security -fstack-protector-strong -fPIE   -o CMakeFiles/stout-tests.dir/try_tests.cpp.o -c /mesos/3rdparty/stout/tests/try_tests.cpp
[ 29%] Building CXX object 3rdparty/stout/tests/CMakeFiles/stout-tests.dir/uuid_tests.cpp.o
cd /mesos/build/3rdparty/stout/tests && /usr/bin/clang++-3.5  -DHAVE_LIBZ -DLIBDIR=\"/usr/local/libmesos\" -DPICOJSON_USE_INT64 -DPKGDATADIR=\"/usr/local/share/mesos\" -DPKGLIBEXECDIR=\"/usr/local/libexec/mesos\" -DUSE_SSL_SOCKET=1 -DVERSION=\"1.5.0\" -D__STDC_FORMAT_MACROS -I/mesos/build/3rdparty/stout/tests -I/mesos/3rdparty/stout/include -isystem /usr/include/apr-1.0 -isystem /mesos/build/3rdparty/boost-1.53.0/src/boost-1.53.0 -isystem /mesos/build/3rdparty/elfio-3.2/src/elfio-3.2 -isystem /mesos/build/3rdparty/glog-0.3.3/src/glog-0.3.3-build/include -isystem /mesos/build/3rdparty/picojson-1.3.0/src/picojson-1.3.0 -isystem /mesos/build/3rdparty/protobuf-3.5.0/src/protobuf-3.5.0/src -isystem /usr/include/subversion-1 -isystem /mesos/build/3rdparty/googletest-1.8.0/src/googletest-1.8.0/googlemock/include -isystem /mesos/build/3rdparty/googletest-1.8.0/src/googletest-1.8.0/googletest/include  -std=c++11 -Wformat-security -fstack-protector-strong -fPIE   -o CMakeFiles/stout-tests.dir/uuid_tests.cpp.o -c /mesos/3rdparty/stout/tests/uuid_tests.cpp
[ 29%] Building CXX object 3rdparty/stout/tests/CMakeFiles/stout-tests.dir/variant_tests.cpp.o
cd /mesos/build/3rdparty/stout/tests && /usr/bin/clang++-3.5  -DHAVE_LIBZ -DLIBDIR=\"/usr/local/libmesos\" -DPICOJSON_USE_INT64 -DPKGDATADIR=\"/usr/local/share/mesos\" -DPKGLIBEXECDIR=\"/usr/local/libexec/mesos\" -DUSE_SSL_SOCKET=1 -DVERSION=\"1.5.0\" -D__STDC_FORMAT_MACROS -I/mesos/build/3rdparty/stout/tests -I/mesos/3rdparty/stout/include -isystem /usr/include/apr-1.0 -isystem /mesos/build/3rdparty/boost-1.53.0/src/boost-1.53.0 -isystem /mesos/build/3rdparty/elfio-3.2/src/elfio-3.2 -isystem /mesos/build/3rdparty/glog-0.3.3/src/glog-0.3.3-build/include -isystem /mesos/build/3rdparty/picojson-1.3.0/src/picojson-1.3.0 -isystem /mesos/build/3rdparty/protobuf-3.5.0/src/protobuf-3.5.0/src -isystem /usr/include/subversion-1 -isystem /mesos/build/3rdparty/googletest-1.8.0/src/googletest-1.8.0/googlemock/include -isystem /mesos/build/3rdparty/googletest-1.8.0/src/googletest-1.8.0/googletest/include  -std=c++11 -Wformat-security -fstack-protector-strong -fPIE   -o CMakeFiles/stout-tests.dir/variant_tests.cpp.o -c /mesos/3rdparty/stout/tests/variant_tests.cpp
[ 29%] Building CXX object src/CMakeFiles/mesos-protobufs.dir/__/include/mesos/v1/maintenance/maintenance.pb.cc.o
cd /mesos/build/src && /usr/bin/clang++-3.5  -DLIBDIR=\"/usr/local/libmesos\" -DPKGDATADIR=\"/usr/local/share/mesos\" -DPKGLIBEXECDIR=\"/usr/local/libexec/mesos\" -DUSE_SSL_SOCKET=1 -DVERSION=\"1.5.0\" -Dmesos_protobufs_EXPORTS -I/mesos/build/include -I/mesos/build/include/mesos -I/mesos/build/src -I/mesos/src -isystem /mesos/build/3rdparty/protobuf-3.5.0/src/protobuf-3.5.0/src  -std=c++11 -Wformat-security -fstack-protector-strong -fPIC   -o CMakeFiles/mesos-protobufs.dir/__/include/mesos/v1/maintenance/maintenance.pb.cc.o -c /mesos/build/include/mesos/v1/maintenance/maintenance.pb.cc
[ 29%] Building CXX object src/CMakeFiles/mesos-protobufs.dir/__/include/mesos/v1/master/master.pb.cc.o
cd /mesos/build/src && /usr/bin/clang++-3.5  -DLIBDIR=\"/usr/local/libmesos\" -DPKGDATADIR=\"/usr/local/share/mesos\" -DPKGLIBEXECDIR=\"/usr/local/libexec/mesos\" -DUSE_SSL_SOCKET=1 -DVERSION=\"1.5.0\" -Dmesos_protobufs_EXPORTS -I/mesos/build/include -I/mesos/build/include/mesos -I/mesos/build/src -I/mesos/src -isystem /mesos/build/3rdparty/protobuf-3.5.0/src/protobuf-3.5.0/src  -std=c++11 -Wformat-security -fstack-protector-strong -fPIC   -o CMakeFiles/mesos-protobufs.dir/__/include/mesos/v1/master/master.pb.cc.o -c /mesos/build/include/mesos/v1/master/master.pb.cc
[ 29%] Building CXX object 3rdparty/stout/tests/CMakeFiles/stout-tests.dir/version_tests.cpp.o
cd /mesos/build/3rdparty/stout/tests && /usr/bin/clang++-3.5  -DHAVE_LIBZ -DLIBDIR=\"/usr/local/libmesos\" -DPICOJSON_USE_INT64 -DPKGDATADIR=\"/usr/local/share/mesos\" -DPKGLIBEXECDIR=\"/usr/local/libexec/mesos\" -DUSE_SSL_SOCKET=1 -DVERSION=\"1.5.0\" -D__STDC_FORMAT_MACROS -I/mesos/build/3rdparty/stout/tests -I/mesos/3rdparty/stout/include -isystem /usr/include/apr-1.0 -isystem /mesos/build/3rdparty/boost-1.53.0/src/boost-1.53.0 -isystem /mesos/build/3rdparty/elfio-3.2/src/elfio-3.2 -isystem /mesos/build/3rdparty/glog-0.3.3/src/glog-0.3.3-build/include -isystem /mesos/build/3rdparty/picojson-1.3.0/src/picojson-1.3.0 -isystem /mesos/build/3rdparty/protobuf-3.5.0/src/protobuf-3.5.0/src -isystem /usr/include/subversion-1 -isystem /mesos/build/3rdparty/googletest-1.8.0/src/googletest-1.8.0/googlemock/include -isystem /mesos/build/3rdparty/googletest-1.8.0/src/googletest-1.8.0/googletest/include  -std=c++11 -Wformat-security -fstack-protector-strong -fPIE   -o CMakeFiles/stout-tests.dir/version_tests.cpp.o -c /mesos/3rdparty/stout/tests/version_tests.cpp
[ 30%] Building CXX object 3rdparty/stout/tests/CMakeFiles/stout-tests.dir/protobuf_tests.cpp.o
cd /mesos/build/3rdparty/stout/tests && /usr/bin/clang++-3.5  -DHAVE_LIBZ -DLIBDIR=\"/usr/local/libmesos\" -DPICOJSON_USE_INT64 -DPKGDATADIR=\"/usr/local/share/mesos\" -DPKGLIBEXECDIR=\"/usr/local/libexec/mesos\" -DUSE_SSL_SOCKET=1 -DVERSION=\"1.5.0\" -D__STDC_FORMAT_MACROS -I/mesos/build/3rdparty/stout/tests -I/mesos/3rdparty/stout/include -isystem /usr/include/apr-1.0 -isystem /mesos/build/3rdparty/boost-1.53.0/src/boost-1.53.0 -isystem /mesos/build/3rdparty/elfio-3.2/src/elfio-3.2 -isystem /mesos/build/3rdparty/glog-0.3.3/src/glog-0.3.3-build/include -isystem /mesos/build/3rdparty/picojson-1.3.0/src/picojson-1.3.0 -isystem /mesos/build/3rdparty/protobuf-3.5.0/src/protobuf-3.5.0/src -isystem /usr/include/subversion-1 -isystem /mesos/build/3rdparty/googletest-1.8.0/src/googletest-1.8.0/googlemock/include -isystem /mesos/build/3rdparty/googletest-1.8.0/src/googletest-1.8.0/googletest/include  -std=c++11 -Wformat-security -fstack-protector-strong -fPIE   -o CMakeFiles/stout-tests.dir/protobuf_tests.cpp.o -c /mesos/3rdparty/stout/tests/protobuf_tests.cpp
[ 30%] Building CXX object 3rdparty/stout/tests/CMakeFiles/stout-tests.dir/protobuf_tests.pb.cc.o
cd /mesos/build/3rdparty/stout/tests && /usr/bin/clang++-3.5  -DHAVE_LIBZ -DLIBDIR=\"/usr/local/libmesos\" -DPICOJSON_USE_INT64 -DPKGDATADIR=\"/usr/local/share/mesos\" -DPKGLIBEXECDIR=\"/usr/local/libexec/mesos\" -DUSE_SSL_SOCKET=1 -DVERSION=\"1.5.0\" -D__STDC_FORMAT_MACROS -I/mesos/build/3rdparty/stout/tests -I/mesos/3rdparty/stout/include -isystem /usr/include/apr-1.0 -isystem /mesos/build/3rdparty/boost-1.53.0/src/boost-1.53.0 -isystem /mesos/build/3rdparty/elfio-3.2/src/elfio-3.2 -isystem /mesos/build/3rdparty/glog-0.3.3/src/glog-0.3.3-build/include -isystem /mesos/build/3rdparty/picojson-1.3.0/src/picojson-1.3.0 -isystem /mesos/build/3rdparty/protobuf-3.5.0/src/protobuf-3.5.0/src -isystem /usr/include/subversion-1 -isystem /mesos/build/3rdparty/googletest-1.8.0/src/googletest-1.8.0/googlemock/include -isystem /mesos/build/3rdparty/googletest-1.8.0/src/googletest-1.8.0/googletest/include  -std=c++11 -Wformat-security -fstack-protector-strong -fPIE   -o CMakeFiles/stout-tests.dir/protobuf_tests.pb.cc.o -c /mesos/build/3rdparty/stout/tests/protobuf_tests.pb.cc
[ 30%] Building CXX object 3rdparty/stout/tests/CMakeFiles/stout-tests.dir/svn_tests.cpp.o
cd /mesos/build/3rdparty/stout/tests && /usr/bin/clang++-3.5  -DHAVE_LIBZ -DLIBDIR=\"/usr/local/libmesos\" -DPICOJSON_USE_INT64 -DPKGDATADIR=\"/usr/local/share/mesos\" -DPKGLIBEXECDIR=\"/usr/local/libexec/mesos\" -DUSE_SSL_SOCKET=1 -DVERSION=\"1.5.0\" -D__STDC_FORMAT_MACROS -I/mesos/build/3rdparty/stout/tests -I/mesos/3rdparty/stout/include -isystem /usr/include/apr-1.0 -isystem /mesos/build/3rdparty/boost-1.53.0/src/boost-1.53.0 -isystem /mesos/build/3rdparty/elfio-3.2/src/elfio-3.2 -isystem /mesos/build/3rdparty/glog-0.3.3/src/glog-0.3.3-build/include -isystem /mesos/build/3rdparty/picojson-1.3.0/src/picojson-1.3.0 -isystem /mesos/build/3rdparty/protobuf-3.5.0/src/protobuf-3.5.0/src -isystem /usr/include/subversion-1 -isystem /mesos/build/3rdparty/googletest-1.8.0/src/googletest-1.8.0/googlemock/include -isystem /mesos/build/3rdparty/googletest-1.8.0/src/googletest-1.8.0/googletest/include  -std=c++11 -Wformat-security -fstack-protector-strong -fPIE   -o CMakeFiles/stout-tests.dir/svn_tests.cpp.o -c /mesos/3rdparty/stout/tests/svn_tests.cpp
[ 30%] Building CXX object src/CMakeFiles/mesos-protobufs.dir/__/include/mesos/v1/mesos.pb.cc.o
cd /mesos/build/src && /usr/bin/clang++-3.5  -DLIBDIR=\"/usr/local/libmesos\" -DPKGDATADIR=\"/usr/local/share/mesos\" -DPKGLIBEXECDIR=\"/usr/local/libexec/mesos\" -DUSE_SSL_SOCKET=1 -DVERSION=\"1.5.0\" -Dmesos_protobufs_EXPORTS -I/mesos/build/include -I/mesos/build/include/mesos -I/mesos/build/src -I/mesos/src -isystem /mesos/build/3rdparty/protobuf-3.5.0/src/protobuf-3.5.0/src  -std=c++11 -Wformat-security -fstack-protector-strong -fPIC   -o CMakeFiles/mesos-protobufs.dir/__/include/mesos/v1/mesos.pb.cc.o -c /mesos/build/include/mesos/v1/mesos.pb.cc
[ 30%] Building CXX object src/CMakeFiles/mesos-protobufs.dir/__/include/mesos/v1/quota/quota.pb.cc.o
cd /mesos/build/src && /usr/bin/clang++-3.5  -DLIBDIR=\"/usr/local/libmesos\" -DPKGDATADIR=\"/usr/local/share/mesos\" -DPKGLIBEXECDIR=\"/usr/local/libexec/mesos\" -DUSE_SSL_SOCKET=1 -DVERSION=\"1.5.0\" -Dmesos_protobufs_EXPORTS -I/mesos/build/include -I/mesos/build/include/mesos -I/mesos/build/src -I/mesos/src -isystem /mesos/build/3rdparty/protobuf-3.5.0/src/protobuf-3.5.0/src  -std=c++11 -Wformat-security -fstack-protector-strong -fPIC   -o CMakeFiles/mesos-protobufs.dir/__/include/mesos/v1/quota/quota.pb.cc.o -c /mesos/build/include/mesos/v1/quota/quota.pb.cc
[ 30%] Building CXX object 3rdparty/stout/tests/CMakeFiles/stout-tests.dir/proc_tests.cpp.o
cd /mesos/build/3rdparty/stout/tests && /usr/bin/clang++-3.5  -DHAVE_LIBZ -DLIBDIR=\"/usr/local/libmesos\" -DPICOJSON_USE_INT64 -DPKGDATADIR=\"/usr/local/share/mesos\" -DPKGLIBEXECDIR=\"/usr/local/libexec/mesos\" -DUSE_SSL_SOCKET=1 -DVERSION=\"1.5.0\" -D__STDC_FORMAT_MACROS -I/mesos/build/3rdparty/stout/tests -I/mesos/3rdparty/stout/include -isystem /usr/include/apr-1.0 -isystem /mesos/build/3rdparty/boost-1.53.0/src/boost-1.53.0 -isystem /mesos/build/3rdparty/elfio-3.2/src/elfio-3.2 -isystem /mesos/build/3rdparty/glog-0.3.3/src/glog-0.3.3-build/include -isystem /mesos/build/3rdparty/picojson-1.3.0/src/picojson-1.3.0 -isystem /mesos/build/3rdparty/protobuf-3.5.0/src/protobuf-3.5.0/src -isystem /usr/include/subversion-1 -isystem /mesos/build/3rdparty/googletest-1.8.0/src/googletest-1.8.0/googlemock/include -isystem /mesos/build/3rdparty/googletest-1.8.0/src/googletest-1.8.0/googletest/include  -std=c++11 -Wformat-security -fstack-protector-strong -fPIE   -o CMakeFiles/stout-tests.dir/proc_tests.cpp.o -c /mesos/3rdparty/stout/tests/proc_tests.cpp
[ 30%] Building CXX object 3rdparty/stout/tests/CMakeFiles/stout-tests.dir/os/env_tests.cpp.o
cd /mesos/build/3rdparty/stout/tests && /usr/bin/clang++-3.5  -DHAVE_LIBZ -DLIBDIR=\"/usr/local/libmesos\" -DPICOJSON_USE_INT64 -DPKGDATADIR=\"/usr/local/share/mesos\" -DPKGLIBEXECDIR=\"/usr/local/libexec/mesos\" -DUSE_SSL_SOCKET=1 -DVERSION=\"1.5.0\" -D__STDC_FORMAT_MACROS -I/mesos/build/3rdparty/stout/tests -I/mesos/3rdparty/stout/include -isystem /usr/include/apr-1.0 -isystem /mesos/build/3rdparty/boost-1.53.0/src/boost-1.53.0 -isystem /mesos/build/3rdparty/elfio-3.2/src/elfio-3.2 -isystem /mesos/build/3rdparty/glog-0.3.3/src/glog-0.3.3-build/include -isystem /mesos/build/3rdparty/picojson-1.3.0/src/picojson-1.3.0 -isystem /mesos/build/3rdparty/protobuf-3.5.0/src/protobuf-3.5.0/src -isystem /usr/include/subversion-1 -isystem /mesos/build/3rdparty/googletest-1.8.0/src/googletest-1.8.0/googlemock/include -isystem /mesos/build/3rdparty/googletest-1.8.0/src/googletest-1.8.0/googletest/include  -std=c++11 -Wformat-security -fstack-protector-strong -fPIE   -o CMakeFiles/stout-tests.dir/os/env_tests.cpp.o -c /mesos/3rdparty/stout/tests/os/env_tests.cpp
[ 30%] Building CXX object src/CMakeFiles/mesos-protobufs.dir/__/include/mesos/v1/resource_provider/resource_provider.pb.cc.o
cd /mesos/build/src && /usr/bin/clang++-3.5  -DLIBDIR=\"/usr/local/libmesos\" -DPKGDATADIR=\"/usr/local/share/mesos\" -DPKGLIBEXECDIR=\"/usr/local/libexec/mesos\" -DUSE_SSL_SOCKET=1 -DVERSION=\"1.5.0\" -Dmesos_protobufs_EXPORTS -I/mesos/build/include -I/mesos/build/include/mesos -I/mesos/build/src -I/mesos/src -isystem /mesos/build/3rdparty/protobuf-3.5.0/src/protobuf-3.5.0/src  -std=c++11 -Wformat-security -fstack-protector-strong -fPIC   -o CMakeFiles/mesos-protobufs.dir/__/include/mesos/v1/resource_provider/resource_provider.pb.cc.o -c /mesos/build/include/mesos/v1/resource_provider/resource_provider.pb.cc
[ 31%] Building CXX object src/CMakeFiles/mesos-protobufs.dir/__/include/mesos/v1/scheduler/scheduler.pb.cc.o
cd /mesos/build/src && /usr/bin/clang++-3.5  -DLIBDIR=\"/usr/local/libmesos\" -DPKGDATADIR=\"/usr/local/share/mesos\" -DPKGLIBEXECDIR=\"/usr/local/libexec/mesos\" -DUSE_SSL_SOCKET=1 -DVERSION=\"1.5.0\" -Dmesos_protobufs_EXPORTS -I/mesos/build/include -I/mesos/build/include/mesos -I/mesos/build/src -I/mesos/src -isystem /mesos/build/3rdparty/protobuf-3.5.0/src/protobuf-3.5.0/src  -std=c++11 -Wformat-security -fstack-protector-strong -fPIC   -o CMakeFiles/mesos-protobufs.dir/__/include/mesos/v1/scheduler/scheduler.pb.cc.o -c /mesos/build/include/mesos/v1/scheduler/scheduler.pb.cc
[ 31%] Building CXX object 3rdparty/stout/tests/CMakeFiles/stout-tests.dir/os/filesystem_tests.cpp.o
cd /mesos/build/3rdparty/stout/tests && /usr/bin/clang++-3.5  -DHAVE_LIBZ -DLIBDIR=\"/usr/local/libmesos\" -DPICOJSON_USE_INT64 -DPKGDATADIR=\"/usr/local/share/mesos\" -DPKGLIBEXECDIR=\"/usr/local/libexec/mesos\" -DUSE_SSL_SOCKET=1 -DVERSION=\"1.5.0\" -D__STDC_FORMAT_MACROS -I/mesos/build/3rdparty/stout/tests -I/mesos/3rdparty/stout/include -isystem /usr/include/apr-1.0 -isystem /mesos/build/3rdparty/boost-1.53.0/src/boost-1.53.0 -isystem /mesos/build/3rdparty/elfio-3.2/src/elfio-3.2 -isystem /mesos/build/3rdparty/glog-0.3.3/src/glog-0.3.3-build/include -isystem /mesos/build/3rdparty/picojson-1.3.0/src/picojson-1.3.0 -isystem /mesos/build/3rdparty/protobuf-3.5.0/src/protobuf-3.5.0/src -isystem /usr/include/subversion-1 -isystem /mesos/build/3rdparty/googletest-1.8.0/src/googletest-1.8.0/googlemock/include -isystem /mesos/build/3rdparty/googletest-1.8.0/src/googletest-1.8.0/googletest/include  -std=c++11 -Wformat-security -fstack-protector-strong -fPIE   -o CMakeFiles/stout-tests.dir/os/filesystem_tests.cpp.o -c /mesos/3rdparty/stout/tests/os/filesystem_tests.cpp
[ 31%] Building CXX object 3rdparty/stout/tests/CMakeFiles/stout-tests.dir/os/process_tests.cpp.o
cd /mesos/build/3rdparty/stout/tests && /usr/bin/clang++-3.5  -DHAVE_LIBZ -DLIBDIR=\"/usr/local/libmesos\" -DPICOJSON_USE_INT64 -DPKGDATADIR=\"/usr/local/share/mesos\" -DPKGLIBEXECDIR=\"/usr/local/libexec/mesos\" -DUSE_SSL_SOCKET=1 -DVERSION=\"1.5.0\" -D__STDC_FORMAT_MACROS -I/mesos/build/3rdparty/stout/tests -I/mesos/3rdparty/stout/include -isystem /usr/include/apr-1.0 -isystem /mesos/build/3rdparty/boost-1.53.0/src/boost-1.53.0 -isystem /mesos/build/3rdparty/elfio-3.2/src/elfio-3.2 -isystem /mesos/build/3rdparty/glog-0.3.3/src/glog-0.3.3-build/include -isystem /mesos/build/3rdparty/picojson-1.3.0/src/picojson-1.3.0 -isystem /mesos/build/3rdparty/protobuf-3.5.0/src/protobuf-3.5.0/src -isystem /usr/include/subversion-1 -isystem /mesos/build/3rdparty/googletest-1.8.0/src/googletest-1.8.0/googlemock/include -isystem /mesos/build/3rdparty/googletest-1.8.0/src/googletest-1.8.0/googletest/include  -std=c++11 -Wformat-security -fstack-protector-strong -fPIE   -o CMakeFiles/stout-tests.dir/os/process_tests.cpp.o -c /mesos/3rdparty/stout/tests/os/process_tests.cpp
[ 32%] Building CXX object 3rdparty/stout/tests/CMakeFiles/stout-tests.dir/os/rmdir_tests.cpp.o
cd /mesos/build/3rdparty/stout/tests && /usr/bin/clang++-3.5  -DHAVE_LIBZ -DLIBDIR=\"/usr/local/libmesos\" -DPICOJSON_USE_INT64 -DPKGDATADIR=\"/usr/local/share/mesos\" -DPKGLIBEXECDIR=\"/usr/local/libexec/mesos\" -DUSE_SSL_SOCKET=1 -DVERSION=\"1.5.0\" -D__STDC_FORMAT_MACROS -I/mesos/build/3rdparty/stout/tests -I/mesos/3rdparty/stout/include -isystem /usr/include/apr-1.0 -isystem /mesos/build/3rdparty/boost-1.53.0/src/boost-1.53.0 -isystem /mesos/build/3rdparty/elfio-3.2/src/elfio-3.2 -isystem /mesos/build/3rdparty/glog-0.3.3/src/glog-0.3.3-build/include -isystem /mesos/build/3rdparty/picojson-1.3.0/src/picojson-1.3.0 -isystem /mesos/build/3rdparty/protobuf-3.5.0/src/protobuf-3.5.0/src -isystem /usr/include/subversion-1 -isystem /mesos/build/3rdparty/googletest-1.8.0/src/googletest-1.8.0/googlemock/include -isystem /mesos/build/3rdparty/googletest-1.8.0/src/googletest-1.8.0/googletest/include  -std=c++11 -Wformat-security -fstack-protector-strong -fPIE   -o CMakeFiles/stout-tests.dir/os/rmdir_tests.cpp.o -c /mesos/3rdparty/stout/tests/os/rmdir_tests.cpp
[ 32%] Building CXX object 3rdparty/stout/tests/CMakeFiles/stout-tests.dir/os/socket_tests.cpp.o
cd /mesos/build/3rdparty/stout/tests && /usr/bin/clang++-3.5  -DHAVE_LIBZ -DLIBDIR=\"/usr/local/libmesos\" -DPICOJSON_USE_INT64 -DPKGDATADIR=\"/usr/local/share/mesos\" -DPKGLIBEXECDIR=\"/usr/local/libexec/mesos\" -DUSE_SSL_SOCKET=1 -DVERSION=\"1.5.0\" -D__STDC_FORMAT_MACROS -I/mesos/build/3rdparty/stout/tests -I/mesos/3rdparty/stout/include -isystem /usr/include/apr-1.0 -isystem /mesos/build/3rdparty/boost-1.53.0/src/boost-1.53.0 -isystem /mesos/build/3rdparty/elfio-3.2/src/elfio-3.2 -isystem /mesos/build/3rdparty/glog-0.3.3/src/glog-0.3.3-build/include -isystem /mesos/build/3rdparty/picojson-1.3.0/src/picojson-1.3.0 -isystem /mesos/build/3rdparty/protobuf-3.5.0/src/protobuf-3.5.0/src -isystem /usr/include/subversion-1 -isystem /mesos/build/3rdparty/googletest-1.8.0/src/googletest-1.8.0/googlemock/include -isystem /mesos/build/3rdparty/googletest-1.8.0/src/googletest-1.8.0/googletest/include  -std=c++11 -Wformat-security -fstack-protector-strong -fPIE   -o CMakeFiles/stout-tests.dir/os/socket_tests.cpp.o -c /mesos/3rdparty/stout/tests/os/socket_tests.cpp
[ 32%] Building CXX object 3rdparty/stout/tests/CMakeFiles/stout-tests.dir/os/strerror_tests.cpp.o
cd /mesos/build/3rdparty/stout/tests && /usr/bin/clang++-3.5  -DHAVE_LIBZ -DLIBDIR=\"/usr/local/libmesos\" -DPICOJSON_USE_INT64 -DPKGDATADIR=\"/usr/local/share/mesos\" -DPKGLIBEXECDIR=\"/usr/local/libexec/mesos\" -DUSE_SSL_SOCKET=1 -DVERSION=\"1.5.0\" -D__STDC_FORMAT_MACROS -I/mesos/build/3rdparty/stout/tests -I/mesos/3rdparty/stout/include -isystem /usr/include/apr-1.0 -isystem /mesos/build/3rdparty/boost-1.53.0/src/boost-1.53.0 -isystem /mesos/build/3rdparty/elfio-3.2/src/elfio-3.2 -isystem /mesos/build/3rdparty/glog-0.3.3/src/glog-0.3.3-build/include -isystem /mesos/build/3rdparty/picojson-1.3.0/src/picojson-1.3.0 -isystem /mesos/build/3rdparty/protobuf-3.5.0/src/protobuf-3.5.0/src -isystem /usr/include/subversion-1 -isystem /mesos/build/3rdparty/googletest-1.8.0/src/googletest-1.8.0/googlemock/include -isystem /mesos/build/3rdparty/googletest-1.8.0/src/googletest-1.8.0/googletest/include  -std=c++11 -Wformat-security -fstack-protector-strong -fPIE   -o CMakeFiles/stout-tests.dir/os/strerror_tests.cpp.o -c /mesos/3rdparty/stout/tests/os/strerror_tests.cpp
[ 32%] Building CXX object 3rdparty/stout/tests/CMakeFiles/stout-tests.dir/os/systems_tests.cpp.o
cd /mesos/build/3rdparty/stout/tests && /usr/bin/clang++-3.5  -DHAVE_LIBZ -DLIBDIR=\"/usr/local/libmesos\" -DPICOJSON_USE_INT64 -DPKGDATADIR=\"/usr/local/share/mesos\" -DPKGLIBEXECDIR=\"/usr/local/libexec/mesos\" -DUSE_SSL_SOCKET=1 -DVERSION=\"1.5.0\" -D__STDC_FORMAT_MACROS -I/mesos/build/3rdparty/stout/tests -I/mesos/3rdparty/stout/include -isystem /usr/include/apr-1.0 -isystem /mesos/build/3rdparty/boost-1.53.0/src/boost-1.53.0 -isystem /mesos/build/3rdparty/elfio-3.2/src/elfio-3.2 -isystem /mesos/build/3rdparty/glog-0.3.3/src/glog-0.3.3-build/include -isystem /mesos/build/3rdparty/picojson-1.3.0/src/picojson-1.3.0 -isystem /mesos/build/3rdparty/protobuf-3.5.0/src/protobuf-3.5.0/src -isystem /usr/include/subversion-1 -isystem /mesos/build/3rdparty/googletest-1.8.0/src/googletest-1.8.0/googlemock/include -isystem /mesos/build/3rdparty/googletest-1.8.0/src/googletest-1.8.0/googletest/include  -std=c++11 -Wformat-security -fstack-protector-strong -fPIE   -o CMakeFiles/stout-tests.dir/os/systems_tests.cpp.o -c /mesos/3rdparty/stout/tests/os/systems_tests.cpp
[ 32%] Building CXX object 3rdparty/stout/tests/CMakeFiles/stout-tests.dir/os/sendfile_tests.cpp.o
cd /mesos/build/3rdparty/stout/tests && /usr/bin/clang++-3.5  -DHAVE_LIBZ -DLIBDIR=\"/usr/local/libmesos\" -DPICOJSON_USE_INT64 -DPKGDATADIR=\"/usr/local/share/mesos\" -DPKGLIBEXECDIR=\"/usr/local/libexec/mesos\" -DUSE_SSL_SOCKET=1 -DVERSION=\"1.5.0\" -D__STDC_FORMAT_MACROS -I/mesos/build/3rdparty/stout/tests -I/mesos/3rdparty/stout/include -isystem /usr/include/apr-1.0 -isystem /mesos/build/3rdparty/boost-1.53.0/src/boost-1.53.0 -isystem /mesos/build/3rdparty/elfio-3.2/src/elfio-3.2 -isystem /mesos/build/3rdparty/glog-0.3.3/src/glog-0.3.3-build/include -isystem /mesos/build/3rdparty/picojson-1.3.0/src/picojson-1.3.0 -isystem /mesos/build/3rdparty/protobuf-3.5.0/src/protobuf-3.5.0/src -isystem /usr/include/subversion-1 -isystem /mesos/build/3rdparty/googletest-1.8.0/src/googletest-1.8.0/googlemock/include -isystem /mesos/build/3rdparty/googletest-1.8.0/src/googletest-1.8.0/googletest/include  -std=c++11 -Wformat-security -fstack-protector-strong -fPIE   -o CMakeFiles/stout-tests.dir/os/sendfile_tests.cpp.o -c /mesos/3rdparty/stout/tests/os/sendfile_tests.cpp
[ 32%] Building CXX object src/CMakeFiles/mesos-protobufs.dir/messages/flags.pb.cc.o
cd /mesos/build/src && /usr/bin/clang++-3.5  -DLIBDIR=\"/usr/local/libmesos\" -DPKGDATADIR=\"/usr/local/share/mesos\" -DPKGLIBEXECDIR=\"/usr/local/libexec/mesos\" -DUSE_SSL_SOCKET=1 -DVERSION=\"1.5.0\" -Dmesos_protobufs_EXPORTS -I/mesos/build/include -I/mesos/build/include/mesos -I/mesos/build/src -I/mesos/src -isystem /mesos/build/3rdparty/protobuf-3.5.0/src/protobuf-3.5.0/src  -std=c++11 -Wformat-security -fstack-protector-strong -fPIC   -o CMakeFiles/mesos-protobufs.dir/messages/flags.pb.cc.o -c /mesos/build/src/messages/flags.pb.cc
[ 32%] Building CXX object src/CMakeFiles/mesos-protobufs.dir/messages/log.pb.cc.o
cd /mesos/build/src && /usr/bin/clang++-3.5  -DLIBDIR=\"/usr/local/libmesos\" -DPKGDATADIR=\"/usr/local/share/mesos\" -DPKGLIBEXECDIR=\"/usr/local/libexec/mesos\" -DUSE_SSL_SOCKET=1 -DVERSION=\"1.5.0\" -Dmesos_protobufs_EXPORTS -I/mesos/build/include -I/mesos/build/include/mesos -I/mesos/build/src -I/mesos/src -isystem /mesos/build/3rdparty/protobuf-3.5.0/src/protobuf-3.5.0/src  -std=c++11 -Wformat-security -fstack-protector-strong -fPIC   -o CMakeFiles/mesos-protobufs.dir/messages/log.pb.cc.o -c /mesos/build/src/messages/log.pb.cc
[ 32%] Building CXX object 3rdparty/stout/tests/CMakeFiles/stout-tests.dir/os/signals_tests.cpp.o
cd /mesos/build/3rdparty/stout/tests && /usr/bin/clang++-3.5  -DHAVE_LIBZ -DLIBDIR=\"/usr/local/libmesos\" -DPICOJSON_USE_INT64 -DPKGDATADIR=\"/usr/local/share/mesos\" -DPKGLIBEXECDIR=\"/usr/local/libexec/mesos\" -DUSE_SSL_SOCKET=1 -DVERSION=\"1.5.0\" -D__STDC_FORMAT_MACROS -I/mesos/build/3rdparty/stout/tests -I/mesos/3rdparty/stout/include -isystem /usr/include/apr-1.0 -isystem /mesos/build/3rdparty/boost-1.53.0/src/boost-1.53.0 -isystem /mesos/build/3rdparty/elfio-3.2/src/elfio-3.2 -isystem /mesos/build/3rdparty/glog-0.3.3/src/glog-0.3.3-build/include -isystem /mesos/build/3rdparty/picojson-1.3.0/src/picojson-1.3.0 -isystem /mesos/build/3rdparty/protobuf-3.5.0/src/protobuf-3.5.0/src -isystem /usr/include/subversion-1 -isystem /mesos/build/3rdparty/googletest-1.8.0/src/googletest-1.8.0/googlemock/include -isystem /mesos/build/3rdparty/googletest-1.8.0/src/googletest-1.8.0/googletest/include  -std=c++11 -Wformat-security -fstack-protector-strong -fPIE   -o CMakeFiles/stout-tests.dir/os/signals_tests.cpp.o -c /mesos/3rdparty/stout/tests/os/signals_tests.cpp
[ 32%] Building CXX object src/CMakeFiles/mesos-protobufs.dir/messages/messages.pb.cc.o
cd /mesos/build/src && /usr/bin/clang++-3.5  -DLIBDIR=\"/usr/local/libmesos\" -DPKGDATADIR=\"/usr/local/share/mesos\" -DPKGLIBEXECDIR=\"/usr/local/libexec/mesos\" -DUSE_SSL_SOCKET=1 -DVERSION=\"1.5.0\" -Dmesos_protobufs_EXPORTS -I/mesos/build/include -I/mesos/build/include/mesos -I/mesos/build/src -I/mesos/src -isystem /mesos/build/3rdparty/protobuf-3.5.0/src/protobuf-3.5.0/src  -std=c++11 -Wformat-security -fstack-protector-strong -fPIC   -o CMakeFiles/mesos-protobufs.dir/messages/messages.pb.cc.o -c /mesos/build/src/messages/messages.pb.cc
[ 32%] Building CXX object src/CMakeFiles/mesos-protobufs.dir/messages/state.pb.cc.o
cd /mesos/build/src && /usr/bin/clang++-3.5  -DLIBDIR=\"/usr/local/libmesos\" -DPKGDATADIR=\"/usr/local/share/mesos\" -DPKGLIBEXECDIR=\"/usr/local/libexec/mesos\" -DUSE_SSL_SOCKET=1 -DVERSION=\"1.5.0\" -Dmesos_protobufs_EXPORTS -I/mesos/build/include -I/mesos/build/include/mesos -I/mesos/build/src -I/mesos/src -isystem /mesos/build/3rdparty/protobuf-3.5.0/src/protobuf-3.5.0/src  -std=c++11 -Wformat-security -fstack-protector-strong -fPIC   -o CMakeFiles/mesos-protobufs.dir/messages/state.pb.cc.o -c /mesos/build/src/messages/state.pb.cc
[ 32%] Building CXX object src/CMakeFiles/mesos-protobufs.dir/slave/containerizer/mesos/isolators/network/cni/spec.pb.cc.o
cd /mesos/build/src && /usr/bin/clang++-3.5  -DLIBDIR=\"/usr/local/libmesos\" -DPKGDATADIR=\"/usr/local/share/mesos\" -DPKGLIBEXECDIR=\"/usr/local/libexec/mesos\" -DUSE_SSL_SOCKET=1 -DVERSION=\"1.5.0\" -Dmesos_protobufs_EXPORTS -I/mesos/build/include -I/mesos/build/include/mesos -I/mesos/build/src -I/mesos/src -isystem /mesos/build/3rdparty/protobuf-3.5.0/src/protobuf-3.5.0/src  -std=c++11 -Wformat-security -fstack-protector-strong -fPIC   -o CMakeFiles/mesos-protobufs.dir/slave/containerizer/mesos/isolators/network/cni/spec.pb.cc.o -c /mesos/build/src/slave/containerizer/mesos/isolators/network/cni/spec.pb.cc
[ 32%] Building CXX object src/CMakeFiles/mesos-protobufs.dir/slave/containerizer/mesos/isolators/docker/volume/state.pb.cc.o
cd /mesos/build/src && /usr/bin/clang++-3.5  -DLIBDIR=\"/usr/local/libmesos\" -DPKGDATADIR=\"/usr/local/share/mesos\" -DPKGLIBEXECDIR=\"/usr/local/libexec/mesos\" -DUSE_SSL_SOCKET=1 -DVERSION=\"1.5.0\" -Dmesos_protobufs_EXPORTS -I/mesos/build/include -I/mesos/build/include/mesos -I/mesos/build/src -I/mesos/src -isystem /mesos/build/3rdparty/protobuf-3.5.0/src/protobuf-3.5.0/src  -std=c++11 -Wformat-security -fstack-protector-strong -fPIC   -o CMakeFiles/mesos-protobufs.dir/slave/containerizer/mesos/isolators/docker/volume/state.pb.cc.o -c /mesos/build/src/slave/containerizer/mesos/isolators/docker/volume/state.pb.cc
[ 33%] Building CXX object src/CMakeFiles/mesos-protobufs.dir/slave/containerizer/mesos/provisioner/docker/message.pb.cc.o
cd /mesos/build/src && /usr/bin/clang++-3.5  -DLIBDIR=\"/usr/local/libmesos\" -DPKGDATADIR=\"/usr/local/share/mesos\" -DPKGLIBEXECDIR=\"/usr/local/libexec/mesos\" -DUSE_SSL_SOCKET=1 -DVERSION=\"1.5.0\" -Dmesos_protobufs_EXPORTS -I/mesos/build/include -I/mesos/build/include/mesos -I/mesos/build/src -I/mesos/src -isystem /mesos/build/3rdparty/protobuf-3.5.0/src/protobuf-3.5.0/src  -std=c++11 -Wformat-security -fstack-protector-strong -fPIC   -o CMakeFiles/mesos-protobufs.dir/slave/containerizer/mesos/provisioner/docker/message.pb.cc.o -c /mesos/build/src/slave/containerizer/mesos/provisioner/docker/message.pb.cc
[ 33%] Building CXX object src/CMakeFiles/mesos-protobufs.dir/master/registry.pb.cc.o
cd /mesos/build/src && /usr/bin/clang++-3.5  -DLIBDIR=\"/usr/local/libmesos\" -DPKGDATADIR=\"/usr/local/share/mesos\" -DPKGLIBEXECDIR=\"/usr/local/libexec/mesos\" -DUSE_SSL_SOCKET=1 -DVERSION=\"1.5.0\" -Dmesos_protobufs_EXPORTS -I/mesos/build/include -I/mesos/build/include/mesos -I/mesos/build/src -I/mesos/src -isystem /mesos/build/3rdparty/protobuf-3.5.0/src/protobuf-3.5.0/src  -std=c++11 -Wformat-security -fstack-protector-strong -fPIC   -o CMakeFiles/mesos-protobufs.dir/master/registry.pb.cc.o -c /mesos/build/src/master/registry.pb.cc
[ 33%] Building CXX object src/CMakeFiles/mesos-protobufs.dir/resource_provider/registry.pb.cc.o
cd /mesos/build/src && /usr/bin/clang++-3.5  -DLIBDIR=\"/usr/local/libmesos\" -DPKGDATADIR=\"/usr/local/share/mesos\" -DPKGLIBEXECDIR=\"/usr/local/libexec/mesos\" -DUSE_SSL_SOCKET=1 -DVERSION=\"1.5.0\" -Dmesos_protobufs_EXPORTS -I/mesos/build/include -I/mesos/build/include/mesos -I/mesos/build/src -I/mesos/src -isystem /mesos/build/3rdparty/protobuf-3.5.0/src/protobuf-3.5.0/src  -std=c++11 -Wformat-security -fstack-protector-strong -fPIC   -o CMakeFiles/mesos-protobufs.dir/resource_provider/registry.pb.cc.o -c /mesos/build/src/resource_provider/registry.pb.cc
[ 33%] Linking CXX executable stout-tests
cd /mesos/build/3rdparty/stout/tests && /usr/local/bin/cmake -E cmake_link_script CMakeFiles/stout-tests.dir/link.txt --verbose=1
/usr/bin/clang++-3.5   -std=c++11 -Wformat-security -fstack-protector-strong   CMakeFiles/stout-tests.dir/base64_tests.cpp.o CMakeFiles/stout-tests.dir/bits_tests.cpp.o CMakeFiles/stout-tests.dir/bytes_tests.cpp.o CMakeFiles/stout-tests.dir/cache_tests.cpp.o CMakeFiles/stout-tests.dir/duration_tests.cpp.o CMakeFiles/stout-tests.dir/dynamiclibrary_tests.cpp.o CMakeFiles/stout-tests.dir/error_tests.cpp.o CMakeFiles/stout-tests.dir/flags_tests.cpp.o CMakeFiles/stout-tests.dir/gzip_tests.cpp.o CMakeFiles/stout-tests.dir/hashmap_tests.cpp.o CMakeFiles/stout-tests.dir/hashset_tests.cpp.o CMakeFiles/stout-tests.dir/interval_tests.cpp.o CMakeFiles/stout-tests.dir/ip_tests.cpp.o CMakeFiles/stout-tests.dir/json_tests.cpp.o CMakeFiles/stout-tests.dir/jsonify_tests.cpp.o CMakeFiles/stout-tests.dir/lambda_tests.cpp.o CMakeFiles/stout-tests.dir/linkedhashmap_tests.cpp.o CMakeFiles/stout-tests.dir/mac_tests.cpp.o CMakeFiles/stout-tests.dir/main.cpp.o CMakeFiles/stout-tests.dir/multimap_tests.cpp.o CMakeFiles/stout-tests.dir/none_tests.cpp.o CMakeFiles/stout-tests.dir/numify_tests.cpp.o CMakeFiles/stout-tests.dir/option_tests.cpp.o CMakeFiles/stout-tests.dir/os_tests.cpp.o CMakeFiles/stout-tests.dir/path_tests.cpp.o CMakeFiles/stout-tests.dir/recordio_tests.cpp.o CMakeFiles/stout-tests.dir/result_tests.cpp.o CMakeFiles/stout-tests.dir/some_tests.cpp.o CMakeFiles/stout-tests.dir/strings_tests.cpp.o CMakeFiles/stout-tests.dir/subcommand_tests.cpp.o CMakeFiles/stout-tests.dir/try_tests.cpp.o CMakeFiles/stout-tests.dir/uuid_tests.cpp.o CMakeFiles/stout-tests.dir/variant_tests.cpp.o CMakeFiles/stout-tests.dir/version_tests.cpp.o CMakeFiles/stout-tests.dir/protobuf_tests.cpp.o CMakeFiles/stout-tests.dir/protobuf_tests.pb.cc.o CMakeFiles/stout-tests.dir/svn_tests.cpp.o CMakeFiles/stout-tests.dir/proc_tests.cpp.o CMakeFiles/stout-tests.dir/os/env_tests.cpp.o CMakeFiles/stout-tests.dir/os/filesystem_tests.cpp.o CMakeFiles/stout-tests.dir/os/process_tests.cpp.o CMakeFiles/stout-tests.dir/os/rmdir_tests.cpp.o CMakeFiles/stout-tests.dir/os/socket_tests.cpp.o CMakeFiles/stout-tests.dir/os/strerror_tests.cpp.o CMakeFiles/stout-tests.dir/os/systems_tests.cpp.o CMakeFiles/stout-tests.dir/os/sendfile_tests.cpp.o CMakeFiles/stout-tests.dir/os/signals_tests.cpp.o  -o stout-tests -Wl,-rpath,/mesos/build/3rdparty/glog-0.3.3/src/glog-0.3.3-build/lib:/mesos/build/3rdparty/protobuf-3.5.0/src/protobuf-3.5.0-build /usr/lib/x86_64-linux-gnu/libapr-1.so /usr/lib/x86_64-linux-gnu/libcurl.so ../../glog-0.3.3/src/glog-0.3.3-build/lib/libglog.so ../../protobuf-3.5.0/src/protobuf-3.5.0-build/libprotobuf.so -lpthread /usr/lib/x86_64-linux-gnu/libz.so -lrt -ldl /usr/lib/x86_64-linux-gnu/libsvn_delta-1.so /usr/lib/x86_64-linux-gnu/libsvn_diff-1.so /usr/lib/x86_64-linux-gnu/libsvn_subr-1.so ../../googletest-1.8.0/src/googletest-1.8.0-build/googlemock/libgmock.a ../../googletest-1.8.0/src/googletest-1.8.0-build/googlemock/gtest/libgtest.a 
make[3]: Leaving directory `/mesos/build'
[ 33%] Built target stout-tests
[ 33%] Linking CXX shared library libmesos-protobufs.so
cd /mesos/build/src && /usr/local/bin/cmake -E cmake_link_script CMakeFiles/mesos-protobufs.dir/link.txt --verbose=1
/usr/bin/clang++-3.5 -fPIC  -std=c++11 -Wformat-security -fstack-protector-strong  -shared -Wl,-soname,libmesos-protobufs.so -o libmesos-protobufs.so CMakeFiles/mesos-protobufs.dir/__/include/mesos/agent/agent.pb.cc.o CMakeFiles/mesos-protobufs.dir/__/include/mesos/allocator/allocator.pb.cc.o CMakeFiles/mesos-protobufs.dir/__/include/mesos/appc/spec.pb.cc.o CMakeFiles/mesos-protobufs.dir/__/include/mesos/authentication/authentication.pb.cc.o CMakeFiles/mesos-protobufs.dir/__/include/mesos/authorizer/acls.pb.cc.o CMakeFiles/mesos-protobufs.dir/__/include/mesos/authorizer/authorizer.pb.cc.o CMakeFiles/mesos-protobufs.dir/__/include/mesos/docker/spec.pb.cc.o CMakeFiles/mesos-protobufs.dir/__/include/mesos/docker/v1.pb.cc.o CMakeFiles/mesos-protobufs.dir/__/include/mesos/docker/v2.pb.cc.o CMakeFiles/mesos-protobufs.dir/__/include/mesos/maintenance/maintenance.pb.cc.o CMakeFiles/mesos-protobufs.dir/__/include/mesos/master/master.pb.cc.o CMakeFiles/mesos-protobufs.dir/__/include/mesos/module/hook.pb.cc.o CMakeFiles/mesos-protobufs.dir/__/include/mesos/module/module.pb.cc.o CMakeFiles/mesos-protobufs.dir/__/include/mesos/oci/spec.pb.cc.o CMakeFiles/mesos-protobufs.dir/__/include/mesos/quota/quota.pb.cc.o CMakeFiles/mesos-protobufs.dir/__/include/mesos/resource_provider/resource_provider.pb.cc.o CMakeFiles/mesos-protobufs.dir/__/include/mesos/slave/containerizer.pb.cc.o CMakeFiles/mesos-protobufs.dir/__/include/mesos/slave/oversubscription.pb.cc.o CMakeFiles/mesos-protobufs.dir/__/include/mesos/state/state.pb.cc.o CMakeFiles/mesos-protobufs.dir/__/include/mesos/uri/uri.pb.cc.o CMakeFiles/mesos-protobufs.dir/__/include/mesos/executor/executor.pb.cc.o CMakeFiles/mesos-protobufs.dir/__/include/mesos/fetcher/fetcher.pb.cc.o CMakeFiles/mesos-protobufs.dir/__/include/mesos/mesos.pb.cc.o CMakeFiles/mesos-protobufs.dir/__/include/mesos/scheduler/scheduler.pb.cc.o CMakeFiles/mesos-protobufs.dir/__/include/mesos/v1/agent/agent.pb.cc.o CMakeFiles/mesos-protobufs.dir/__/include/mesos/v1/allocator/allocator.pb.cc.o CMakeFiles/mesos-protobufs.dir/__/include/mesos/v1/executor/executor.pb.cc.o CMakeFiles/mesos-protobufs.dir/__/include/mesos/v1/maintenance/maintenance.pb.cc.o CMakeFiles/mesos-protobufs.dir/__/include/mesos/v1/master/master.pb.cc.o CMakeFiles/mesos-protobufs.dir/__/include/mesos/v1/mesos.pb.cc.o CMakeFiles/mesos-protobufs.dir/__/include/mesos/v1/quota/quota.pb.cc.o CMakeFiles/mesos-protobufs.dir/__/include/mesos/v1/resource_provider/resource_provider.pb.cc.o CMakeFiles/mesos-protobufs.dir/__/include/mesos/v1/scheduler/scheduler.pb.cc.o CMakeFiles/mesos-protobufs.dir/messages/flags.pb.cc.o CMakeFiles/mesos-protobufs.dir/messages/log.pb.cc.o CMakeFiles/mesos-protobufs.dir/messages/messages.pb.cc.o CMakeFiles/mesos-protobufs.dir/messages/state.pb.cc.o CMakeFiles/mesos-protobufs.dir/slave/containerizer/mesos/isolators/network/cni/spec.pb.cc.o CMakeFiles/mesos-protobufs.dir/slave/containerizer/mesos/isolators/docker/volume/state.pb.cc.o CMakeFiles/mesos-protobufs.dir/slave/containerizer/mesos/provisioner/docker/message.pb.cc.o CMakeFiles/mesos-protobufs.dir/master/registry.pb.cc.o CMakeFiles/mesos-protobufs.dir/resource_provider/registry.pb.cc.o -Wl,-rpath,/mesos/build/3rdparty/protobuf-3.5.0/src/protobuf-3.5.0-build ../3rdparty/protobuf-3.5.0/src/protobuf-3.5.0-build/libprotobuf.so 
make[3]: Leaving directory `/mesos/build'
[ 33%] Built target mesos-protobufs
make[2]: Leaving directory `/mesos/build'
make[1]: *** [CMakeFiles/check.dir/rule] Error 2
make[1]: Leaving directory `/mesos/build'
make: *** [check] Error 2
+ docker rmi mesos-1511143608-14899
Untagged: mesos-1511143608-14899:latest
Deleted: sha256:a492f80a3779eaf1641cf63093dfaf1ec7ffdb21a734ee4e55f0ca5b562166e8
Deleted: sha256:67f38fddca90fd649e6dc91fa63a41488c228a9ef58921a96ed428dae808dce6
Deleted: sha256:ef608af313b778f7060c74865690f9563ed33af173e004f8f599b7e6e8f1310f
Deleted: sha256:051887a495d0480e37f35e3ffff6f03a107c229e3c13b87918331c6077f7a3cd
Deleted: sha256:e30fc12604e483510391cbf08f276fa335383c15df6e93e4ce74e5ea90af6691
Deleted: sha256:97832e183c3bfbb65cd66497f2e9be3f3611d80d1fca5243fb5e0504bef0c3db
Deleted: sha256:6b7738cbc31b841e4d3a09e6f1a1a09abef52ca22dea35bf924bbfb5f3d2d43e
Deleted: sha256:45bee2dcfdbd5d8fb41f0f199738d5f516fa62aa4edcf3de9498c8a9552dea65
Deleted: sha256:caa0c699847dfbaa6068dbb1b9010ccc27e57ae8172deaa2ed145eaf1e66f9cc
Deleted: sha256:e1c19862d19ea330698b2959db969da9ff0120eaf9988936544c912b23ad0bae
Deleted: sha256:664a76514d4c8d29358bb678bbfe75fa14ab78da255e9fdf84dc43d5492ce026
Deleted: sha256:8c8e1374e9ce29c357d65080bbba75472f3058910705852e6ab64271580e8404
Deleted: sha256:73d3fa506c1c43f33ecfe5abe86f2923a5cb8f8f4e8e2c1a496b430d239d89ec
Deleted: sha256:5806c7274ee7a4e7aed1bee4da94222e35ac845de6d96f3019ac46c5169f27bf
Deleted: sha256:f451292feb7b6d935e44dd50ffa239fcdba08ee71f9d9b0f27c432a3026e1d5c
Deleted: sha256:e8f3cfb271c9665c085714d3e8c5a0a9481571e1625221116a052e78151dbec6
Deleted: sha256:19362f1031a1e66944709e5c7f9698d0325ce5b5882a1316b7973511e3919dd3
Deleted: sha256:0c0375943db46ccb53056bbfecf3ee6c02ae2e994ddb8485e8b68117d79a7de4
Deleted: sha256:cc9327df7b859325a8bd883caa347f5334db5aa75c7a5dcfffecfdd705cd06cd
Deleted: sha256:fbee95874ad0857adfa3f6948a9d2851a5b7c27f81f77d1ec38dfbf150305bf3
Deleted: sha256:8628e20bd3f1df221a3a27f7975fd69ffde7b8c0eaecb9f37174e10746c62088
Deleted: sha256:947666ef8e08223967bb2de298cdc87e60f74a86bec513ffc06123868a8567b3
Deleted: sha256:bd84fde5db8886f28c4be83831c5f083c566452b1f270d6c9f5ee7bf513833e4
Deleted: sha256:b93f886852228e869ff89c2148cab61aeb4c0c19a424f2f79947412a5ab20bf0
Deleted: sha256:b57f484c70f5de04e50b255d802583113ed045bce31a2d25c77d72e5e80b7679
Deleted: sha256:3d9bbff83e9e02cb73f5ef4ae0eaa241a4f8b043e2dc51238fac8928e06f6ddf
Deleted: sha256:e437446695da309c28fad27a416f776f8e01d352437700960e18d1f285de7c92
Deleted: sha256:f6291026128d37d7c15678226f182972c173b7f985b3707334ecafe5392c6d7d
Deleted: sha256:c23142402f3dc684cfc69fbc157d560df34eea010a8e7c990dd9e58843865113
Deleted: sha256:2c3f2d84274209a238fe4394284944345cb320cc04fc413b223314e17276d980
Build step 'Execute shell' marked build as failure
Not sending mail to unregistered user benjamin.hindman@gmail.com


Mime
View raw message