mesos-builds mailing list archives

Site index · List index
Message view « Date » · « Thread »
Top « Date » · « Thread »
From Apache Jenkins Server <jenk...@builds.apache.org>
Subject Build failed in Jenkins: Mesos-Buildbot » autotools,gcc,--verbose --disable-libtool-wrappers --enable-libevent --enable-ssl,GLOG_v=1 MESOS_VERBOSE=1,ubuntu:14.04,(ubuntu)&&(!ubuntu-us1)&&(!ubuntu-eu2)&&(!qnode3)&&(!H23) #4407
Date Sun, 05 Nov 2017 03:57:09 GMT
See <https://builds.apache.org/job/Mesos-Buildbot/BUILDTOOL=autotools,COMPILER=gcc,CONFIGURATION=--verbose%20--disable-libtool-wrappers%20--enable-libevent%20--enable-ssl,ENVIRONMENT=GLOG_v=1%20MESOS_VERBOSE=1,OS=ubuntu%3A14.04,label_exp=(ubuntu)&&(!ubuntu-us1)&&(!ubuntu-eu2)&&(!qnode3)&&(!H23)/4407/display/redirect?page=changes>

Changes:

[zhq527725] Ignored the tasks already being killed when killing the task group.

[zhq527725] Added MESOS-8051 to the 1.3.2 CHANGELOG.

------------------------------------------
[...truncated 28.26 MB...]
I1105 03:57:02.827874 20948 http.cpp:1115] HTTP GET for /slave(746)/containers from 172.17.0.3:54240
I1105 03:57:02.827939 20948 http.cpp:936] Authorizing principal 'test-principal' to GET the
'/containers' endpoint
I1105 03:57:02.831313 20935 slave.cpp:796] Agent terminating
[       OK ] Endpoint/SlaveEndpointTest.AuthorizedRequest/2 (28 ms)
[ RUN      ] Endpoint/SlaveEndpointTest.UnauthorizedRequest/0
I1105 03:57:02.840826  1305 containerizer.cpp:221] Using isolation: posix/cpu,posix/mem,filesystem/posix,network/cni
W1105 03:57:02.841336  1305 backend.cpp:76] Failed to create 'aufs' backend: AufsBackend requires
root privileges
W1105 03:57:02.841428  1305 backend.cpp:76] Failed to create 'bind' backend: BindBackend requires
root privileges
I1105 03:57:02.841457  1305 provisioner.cpp:249] Using default backend 'copy'
I1105 03:57:02.844398 20937 slave.cpp:231] Mesos agent started on (747)@172.17.0.3:36975
I1105 03:57:02.844421 20937 slave.cpp:232] Flags at startup: --acls="" --appc_simple_discovery_uri_prefix="http://"
--appc_store_dir="/tmp/mesos/store/appc" --authenticate_http_executors="true" --authenticate_http_readonly="true"
--authenticate_http_readwrite="true" --authenticatee="crammd5" --authentication_backoff_factor="1secs"
--authorizer="local" --cgroups_cpu_enable_pids_and_tids_count="false" --cgroups_enable_cfs="false"
--cgroups_hierarchy="/sys/fs/cgroup" --cgroups_limit_swap="false" --cgroups_root="mesos" --container_disk_watch_interval="15secs"
--containerizers="mesos" --credential="/tmp/Endpoint_SlaveEndpointTest_UnauthorizedRequest_0_tqVM7R/credential"
--default_role="*" --disk_watch_interval="1mins" --docker="docker" --docker_kill_orphans="true"
--docker_registry="https://registry-1.docker.io" --docker_remove_delay="6hrs" --docker_socket="/var/run/docker.sock"
--docker_stop_timeout="0ns" --docker_store_dir="/tmp/mesos/store/docker" --docker_volume_checkpoint_dir="/var/run/mesos/isolators/docker/volume"
--enforce_container_disk_quota="false" --executor_registration_timeout="1mins" --executor_reregistration_timeout="2secs"
--executor_secret_key="/tmp/Endpoint_SlaveEndpointTest_UnauthorizedRequest_0_tqVM7R/executor_secret_key"
--executor_shutdown_grace_period="5secs" --fetcher_cache_dir="/tmp/Endpoint_SlaveEndpointTest_UnauthorizedRequest_0_tqVM7R/fetch"
--fetcher_cache_size="2GB" --frameworks_home="" --gc_delay="1weeks" --gc_disk_headroom="0.1"
--hadoop_home="" --help="false" --hostname_lookup="true" --http_command_executor="false" --http_credentials="/tmp/Endpoint_SlaveEndpointTest_UnauthorizedRequest_0_tqVM7R/http_credentials"
--http_heartbeat_interval="30secs" --initialize_driver_logging="true" --isolation="posix/cpu,posix/mem"
--launcher="posix" --launcher_dir="/mesos/mesos-1.3.2/_build/src" --logbufsecs="0" --logging_level="INFO"
--max_completed_executors_per_framework="150" --oversubscribed_resources_interval="15secs"
--perf_duration="10secs" --perf_interval="1mins" --port="5051" --qos_correction_interval_min="0ns"
--quiet="false" --recover="reconnect" --recovery_timeout="15mins" --registration_backoff_factor="10ms"
--resources="cpus:2;gpus:0;mem:1024;disk:1024;ports:[31000-32000]" --revocable_cpu_low_priority="true"
--runtime_dir="/tmp/Endpoint_SlaveEndpointTest_UnauthorizedRequest_0_tqVM7R" --sandbox_directory="/mnt/mesos/sandbox"
--strict="true" --switch_user="true" --systemd_enable_support="true" --systemd_runtime_directory="/run/systemd/system"
--version="false" --work_dir="/tmp/Endpoint_SlaveEndpointTest_UnauthorizedRequest_0_Y0uwcL"
I1105 03:57:02.844789 20937 credentials.hpp:86] Loading credential for authentication from
'/tmp/Endpoint_SlaveEndpointTest_UnauthorizedRequest_0_tqVM7R/credential'
I1105 03:57:02.844923 20937 slave.cpp:264] Agent using credential for: test-principal
I1105 03:57:02.844943 20937 credentials.hpp:37] Loading credentials for authentication from
'/tmp/Endpoint_SlaveEndpointTest_UnauthorizedRequest_0_tqVM7R/http_credentials'
I1105 03:57:02.845203 20937 http.cpp:975] Creating default 'basic' HTTP authenticator for
realm 'mesos-agent-executor'
I1105 03:57:02.845302 20937 http.cpp:996] Creating default 'jwt' HTTP authenticator for realm
'mesos-agent-executor'
I1105 03:57:02.845607 20937 http.cpp:975] Creating default 'basic' HTTP authenticator for
realm 'mesos-agent-readonly'
I1105 03:57:02.845716 20937 http.cpp:996] Creating default 'jwt' HTTP authenticator for realm
'mesos-agent-readonly'
I1105 03:57:02.846035 20937 http.cpp:975] Creating default 'basic' HTTP authenticator for
realm 'mesos-agent-readwrite'
I1105 03:57:02.846134 20937 http.cpp:996] Creating default 'jwt' HTTP authenticator for realm
'mesos-agent-readwrite'
I1105 03:57:02.847627 20937 slave.cpp:531] Agent resources: cpus(*):2; mem(*):1024; disk(*):1024;
ports(*):[31000-32000]
I1105 03:57:02.847705 20937 slave.cpp:539] Agent attributes: [  ]
I1105 03:57:02.847715 20937 slave.cpp:544] Agent hostname: 84eba6339187
I1105 03:57:02.847843 20942 status_update_manager.cpp:177] Pausing sending status updates
I1105 03:57:02.849084 20938 state.cpp:62] Recovering state from '/tmp/Endpoint_SlaveEndpointTest_UnauthorizedRequest_0_Y0uwcL/meta'
I1105 03:57:02.849305 20935 status_update_manager.cpp:203] Recovering status update manager
I1105 03:57:02.849560 20951 containerizer.cpp:608] Recovering containerizer
I1105 03:57:02.850935 20951 provisioner.cpp:410] Provisioner recovery complete
I1105 03:57:02.851279 20953 slave.cpp:6100] Finished recovery
I1105 03:57:02.851722 20953 slave.cpp:6282] Querying resource estimator for oversubscribable
resources
I1105 03:57:02.852001 20942 slave.cpp:6296] Received oversubscribable resources {} from the
resource estimator
I1105 03:57:02.853862 20955 process.cpp:3741] Handling HTTP event for process 'slave(747)'
with path: '/slave(747)/monitor/statistics'
I1105 03:57:02.855481 20938 http.cpp:1115] HTTP GET for /slave(747)/monitor/statistics from
172.17.0.3:54242
I1105 03:57:02.855546 20938 http.cpp:936] Authorizing principal 'test-principal' to GET the
'/monitor/statistics' endpoint
I1105 03:57:02.857547 20943 slave.cpp:796] Agent terminating
[       OK ] Endpoint/SlaveEndpointTest.UnauthorizedRequest/0 (27 ms)
[ RUN      ] Endpoint/SlaveEndpointTest.UnauthorizedRequest/1
I1105 03:57:02.867991  1305 containerizer.cpp:221] Using isolation: posix/cpu,posix/mem,filesystem/posix,network/cni
W1105 03:57:02.868475  1305 backend.cpp:76] Failed to create 'aufs' backend: AufsBackend requires
root privileges
W1105 03:57:02.868571  1305 backend.cpp:76] Failed to create 'bind' backend: BindBackend requires
root privileges
I1105 03:57:02.868600  1305 provisioner.cpp:249] Using default backend 'copy'
I1105 03:57:02.871815 20952 slave.cpp:231] Mesos agent started on (748)@172.17.0.3:36975
I1105 03:57:02.871843 20952 slave.cpp:232] Flags at startup: --acls="" --appc_simple_discovery_uri_prefix="http://"
--appc_store_dir="/tmp/mesos/store/appc" --authenticate_http_executors="true" --authenticate_http_readonly="true"
--authenticate_http_readwrite="true" --authenticatee="crammd5" --authentication_backoff_factor="1secs"
--authorizer="local" --cgroups_cpu_enable_pids_and_tids_count="false" --cgroups_enable_cfs="false"
--cgroups_hierarchy="/sys/fs/cgroup" --cgroups_limit_swap="false" --cgroups_root="mesos" --container_disk_watch_interval="15secs"
--containerizers="mesos" --credential="/tmp/Endpoint_SlaveEndpointTest_UnauthorizedRequest_1_B7NB2j/credential"
--default_role="*" --disk_watch_interval="1mins" --docker="docker" --docker_kill_orphans="true"
--docker_registry="https://registry-1.docker.io" --docker_remove_delay="6hrs" --docker_socket="/var/run/docker.sock"
--docker_stop_timeout="0ns" --docker_store_dir="/tmp/mesos/store/docker" --docker_volume_checkpoint_dir="/var/run/mesos/isolators/docker/volume"
--enforce_container_disk_quota="false" --executor_registration_timeout="1mins" --executor_reregistration_timeout="2secs"
--executor_secret_key="/tmp/Endpoint_SlaveEndpointTest_UnauthorizedRequest_1_B7NB2j/executor_secret_key"
--executor_shutdown_grace_period="5secs" --fetcher_cache_dir="/tmp/Endpoint_SlaveEndpointTest_UnauthorizedRequest_1_B7NB2j/fetch"
--fetcher_cache_size="2GB" --frameworks_home="" --gc_delay="1weeks" --gc_disk_headroom="0.1"
--hadoop_home="" --help="false" --hostname_lookup="true" --http_command_executor="false" --http_credentials="/tmp/Endpoint_SlaveEndpointTest_UnauthorizedRequest_1_B7NB2j/http_credentials"
--http_heartbeat_interval="30secs" --initialize_driver_logging="true" --isolation="posix/cpu,posix/mem"
--launcher="posix" --launcher_dir="/mesos/mesos-1.3.2/_build/src" --logbufsecs="0" --logging_level="INFO"
--max_completed_executors_per_framework="150" --oversubscribed_resources_interval="15secs"
--perf_duration="10secs" --perf_interval="1mins" --port="5051" --qos_correction_interval_min="0ns"
--quiet="false" --recover="reconnect" --recovery_timeout="15mins" --registration_backoff_factor="10ms"
--resources="cpus:2;gpus:0;mem:1024;disk:1024;ports:[31000-32000]" --revocable_cpu_low_priority="true"
--runtime_dir="/tmp/Endpoint_SlaveEndpointTest_UnauthorizedRequest_1_B7NB2j" --sandbox_directory="/mnt/mesos/sandbox"
--strict="true" --switch_user="true" --systemd_enable_support="true" --systemd_runtime_directory="/run/systemd/system"
--version="false" --work_dir="/tmp/Endpoint_SlaveEndpointTest_UnauthorizedRequest_1_0dNi3c"
I1105 03:57:02.872252 20952 credentials.hpp:86] Loading credential for authentication from
'/tmp/Endpoint_SlaveEndpointTest_UnauthorizedRequest_1_B7NB2j/credential'
I1105 03:57:02.872412 20952 slave.cpp:264] Agent using credential for: test-principal
I1105 03:57:02.872434 20952 credentials.hpp:37] Loading credentials for authentication from
'/tmp/Endpoint_SlaveEndpointTest_UnauthorizedRequest_1_B7NB2j/http_credentials'
I1105 03:57:02.872720 20952 http.cpp:975] Creating default 'basic' HTTP authenticator for
realm 'mesos-agent-executor'
I1105 03:57:02.872835 20952 http.cpp:996] Creating default 'jwt' HTTP authenticator for realm
'mesos-agent-executor'
I1105 03:57:02.873045 20952 http.cpp:975] Creating default 'basic' HTTP authenticator for
realm 'mesos-agent-readonly'
I1105 03:57:02.873210 20952 http.cpp:996] Creating default 'jwt' HTTP authenticator for realm
'mesos-agent-readonly'
I1105 03:57:02.873420 20952 http.cpp:975] Creating default 'basic' HTTP authenticator for
realm 'mesos-agent-readwrite'
I1105 03:57:02.873626 20952 http.cpp:996] Creating default 'jwt' HTTP authenticator for realm
'mesos-agent-readwrite'
I1105 03:57:02.874908 20952 slave.cpp:531] Agent resources: cpus(*):2; mem(*):1024; disk(*):1024;
ports(*):[31000-32000]
I1105 03:57:02.874989 20952 slave.cpp:539] Agent attributes: [  ]
I1105 03:57:02.875010 20952 slave.cpp:544] Agent hostname: 84eba6339187
I1105 03:57:02.875151 20935 status_update_manager.cpp:177] Pausing sending status updates
I1105 03:57:02.876737 20941 state.cpp:62] Recovering state from '/tmp/Endpoint_SlaveEndpointTest_UnauthorizedRequest_1_0dNi3c/meta'
I1105 03:57:02.876989 20953 status_update_manager.cpp:203] Recovering status update manager
I1105 03:57:02.877226 20954 containerizer.cpp:608] Recovering containerizer
I1105 03:57:02.878540 20935 provisioner.cpp:410] Provisioner recovery complete
I1105 03:57:02.878975 20938 slave.cpp:6100] Finished recovery
I1105 03:57:02.879389 20938 slave.cpp:6282] Querying resource estimator for oversubscribable
resources
I1105 03:57:02.879784 20949 slave.cpp:6296] Received oversubscribable resources {} from the
resource estimator
I1105 03:57:02.881618 20950 process.cpp:3741] Handling HTTP event for process 'slave(748)'
with path: '/slave(748)/monitor/statistics.json'
I1105 03:57:02.883302 20954 http.cpp:1115] HTTP GET for /slave(748)/monitor/statistics.json
from 172.17.0.3:54244
I1105 03:57:02.883383 20954 http.cpp:936] Authorizing principal 'test-principal' to GET the
'/monitor/statistics.json' endpoint
I1105 03:57:02.885751 20955 slave.cpp:796] Agent terminating
[       OK ] Endpoint/SlaveEndpointTest.UnauthorizedRequest/1 (28 ms)
[ RUN      ] Endpoint/SlaveEndpointTest.UnauthorizedRequest/2
I1105 03:57:02.896242  1305 containerizer.cpp:221] Using isolation: posix/cpu,posix/mem,filesystem/posix,network/cni
W1105 03:57:02.896731  1305 backend.cpp:76] Failed to create 'aufs' backend: AufsBackend requires
root privileges
W1105 03:57:02.896824  1305 backend.cpp:76] Failed to create 'bind' backend: BindBackend requires
root privileges
I1105 03:57:02.896852  1305 provisioner.cpp:249] Using default backend 'copy'
I1105 03:57:02.900069 20952 slave.cpp:231] Mesos agent started on (749)@172.17.0.3:36975
I1105 03:57:02.900094 20952 slave.cpp:232] Flags at startup: --acls="" --appc_simple_discovery_uri_prefix="http://"
--appc_store_dir="/tmp/mesos/store/appc" --authenticate_http_executors="true" --authenticate_http_readonly="true"
--authenticate_http_readwrite="true" --authenticatee="crammd5" --authentication_backoff_factor="1secs"
--authorizer="local" --cgroups_cpu_enable_pids_and_tids_count="false" --cgroups_enable_cfs="false"
--cgroups_hierarchy="/sys/fs/cgroup" --cgroups_limit_swap="false" --cgroups_root="mesos" --container_disk_watch_interval="15secs"
--containerizers="mesos" --credential="/tmp/Endpoint_SlaveEndpointTest_UnauthorizedRequest_2_VpG8dM/credential"
--default_role="*" --disk_watch_interval="1mins" --docker="docker" --docker_kill_orphans="true"
--docker_registry="https://registry-1.docker.io" --docker_remove_delay="6hrs" --docker_socket="/var/run/docker.sock"
--docker_stop_timeout="0ns" --docker_store_dir="/tmp/mesos/store/docker" --docker_volume_checkpoint_dir="/var/run/mesos/isolators/docker/volume"
--enforce_container_disk_quota="false" --executor_registration_timeout="1mins" --executor_reregistration_timeout="2secs"
--executor_secret_key="/tmp/Endpoint_SlaveEndpointTest_UnauthorizedRequest_2_VpG8dM/executor_secret_key"
--executor_shutdown_grace_period="5secs" --fetcher_cache_dir="/tmp/Endpoint_SlaveEndpointTest_UnauthorizedRequest_2_VpG8dM/fetch"
--fetcher_cache_size="2GB" --frameworks_home="" --gc_delay="1weeks" --gc_disk_headroom="0.1"
--hadoop_home="" --help="false" --hostname_lookup="true" --http_command_executor="false" --http_credentials="/tmp/Endpoint_SlaveEndpointTest_UnauthorizedRequest_2_VpG8dM/http_credentials"
--http_heartbeat_interval="30secs" --initialize_driver_logging="true" --isolation="posix/cpu,posix/mem"
--launcher="posix" --launcher_dir="/mesos/mesos-1.3.2/_build/src" --logbufsecs="0" --logging_level="INFO"
--max_completed_executors_per_framework="150" --oversubscribed_resources_interval="15secs"
--perf_duration="10secs" --perf_interval="1mins" --port="5051" --qos_correction_interval_min="0ns"
--quiet="false" --recover="reconnect" --recovery_timeout="15mins" --registration_backoff_factor="10ms"
--resources="cpus:2;gpus:0;mem:1024;disk:1024;ports:[31000-32000]" --revocable_cpu_low_priority="true"
--runtime_dir="/tmp/Endpoint_SlaveEndpointTest_UnauthorizedRequest_2_VpG8dM" --sandbox_directory="/mnt/mesos/sandbox"
--strict="true" --switch_user="true" --systemd_enable_support="true" --systemd_runtime_directory="/run/systemd/system"
--version="false" --work_dir="/tmp/Endpoint_SlaveEndpointTest_UnauthorizedRequest_2_sOEDaF"
I1105 03:57:02.900477 20952 credentials.hpp:86] Loading credential for authentication from
'/tmp/Endpoint_SlaveEndpointTest_UnauthorizedRequest_2_VpG8dM/credential'
I1105 03:57:02.900634 20952 slave.cpp:264] Agent using credential for: test-principal
I1105 03:57:02.900653 20952 credentials.hpp:37] Loading credentials for authentication from
'/tmp/Endpoint_SlaveEndpointTest_UnauthorizedRequest_2_VpG8dM/http_credentials'
I1105 03:57:02.900933 20952 http.cpp:975] Creating default 'basic' HTTP authenticator for
realm 'mesos-agent-executor'
I1105 03:57:02.901041 20952 http.cpp:996] Creating default 'jwt' HTTP authenticator for realm
'mesos-agent-executor'
I1105 03:57:02.901310 20952 http.cpp:975] Creating default 'basic' HTTP authenticator for
realm 'mesos-agent-readonly'
I1105 03:57:02.901417 20952 http.cpp:996] Creating default 'jwt' HTTP authenticator for realm
'mesos-agent-readonly'
I1105 03:57:02.901602 20952 http.cpp:975] Creating default 'basic' HTTP authenticator for
realm 'mesos-agent-readwrite'
I1105 03:57:02.901707 20952 http.cpp:996] Creating default 'jwt' HTTP authenticator for realm
'mesos-agent-readwrite'
I1105 03:57:02.903244 20952 slave.cpp:531] Agent resources: cpus(*):2; mem(*):1024; disk(*):1024;
ports(*):[31000-32000]
I1105 03:57:02.903331 20952 slave.cpp:539] Agent attributes: [  ]
I1105 03:57:02.903344 20952 slave.cpp:544] Agent hostname: 84eba6339187
I1105 03:57:02.903502 20944 status_update_manager.cpp:177] Pausing sending status updates
I1105 03:57:02.904685 20951 state.cpp:62] Recovering state from '/tmp/Endpoint_SlaveEndpointTest_UnauthorizedRequest_2_sOEDaF/meta'
I1105 03:57:02.904940 20935 status_update_manager.cpp:203] Recovering status update manager
I1105 03:57:02.905221 20939 containerizer.cpp:608] Recovering containerizer
I1105 03:57:02.906900 20939 provisioner.cpp:410] Provisioner recovery complete
I1105 03:57:02.907310 20935 slave.cpp:6100] Finished recovery
I1105 03:57:02.907732 20935 slave.cpp:6282] Querying resource estimator for oversubscribable
resources
I1105 03:57:02.907959 20943 slave.cpp:6296] Received oversubscribable resources {} from the
resource estimator
I1105 03:57:02.909720 20942 process.cpp:3741] Handling HTTP event for process 'slave(749)'
with path: '/slave(749)/containers'
I1105 03:57:02.911370 20948 http.cpp:1115] HTTP GET for /slave(749)/containers from 172.17.0.3:54246
I1105 03:57:02.911434 20948 http.cpp:936] Authorizing principal 'test-principal' to GET the
'/containers' endpoint
I1105 03:57:02.913627 20955 slave.cpp:796] Agent terminating
[       OK ] Endpoint/SlaveEndpointTest.UnauthorizedRequest/2 (28 ms)
[ RUN      ] Endpoint/SlaveEndpointTest.NoAuthorizer/0
I1105 03:57:02.924196  1305 containerizer.cpp:221] Using isolation: posix/cpu,posix/mem,filesystem/posix,network/cni
W1105 03:57:02.924685  1305 backend.cpp:76] Failed to create 'aufs' backend: AufsBackend requires
root privileges
W1105 03:57:02.924788  1305 backend.cpp:76] Failed to create 'bind' backend: BindBackend requires
root privileges
I1105 03:57:02.924818  1305 provisioner.cpp:249] Using default backend 'copy'
I1105 03:57:02.926451  1305 cluster.cpp:448] Creating default 'local' authorizer
I1105 03:57:02.928071 20939 slave.cpp:231] Mesos agent started on (750)@172.17.0.3:36975
I1105 03:57:02.928097 20939 slave.cpp:232] Flags at startup: --acls="" --appc_simple_discovery_uri_prefix="http://"
--appc_store_dir="/tmp/mesos/store/appc" --authenticate_http_executors="true" --authenticate_http_readonly="true"
--authenticate_http_readwrite="true" --authenticatee="crammd5" --authentication_backoff_factor="1secs"
--authorizer="local" --cgroups_cpu_enable_pids_and_tids_count="false" --cgroups_enable_cfs="false"
--cgroups_hierarchy="/sys/fs/cgroup" --cgroups_limit_swap="false" --cgroups_root="mesos" --container_disk_watch_interval="15secs"
--containerizers="mesos" --credential="/tmp/Endpoint_SlaveEndpointTest_NoAuthorizer_0_3fbhGe/credential"
--default_role="*" --disk_watch_interval="1mins" --docker="docker" --docker_kill_orphans="true"
--docker_registry="https://registry-1.docker.io" --docker_remove_delay="6hrs" --docker_socket="/var/run/docker.sock"
--docker_stop_timeout="0ns" --docker_store_dir="/tmp/mesos/store/docker" --docker_volume_checkpoint_dir="/var/run/mesos/isolators/docker/volume"
--enforce_container_disk_quota="false" --executor_registration_timeout="1mins" --executor_reregistration_timeout="2secs"
--executor_secret_key="/tmp/Endpoint_SlaveEndpointTest_NoAuthorizer_0_3fbhGe/executor_secret_key"
--executor_shutdown_grace_period="5secs" --fetcher_cache_dir="/tmp/Endpoint_SlaveEndpointTest_NoAuthorizer_0_3fbhGe/fetch"
--fetcher_cache_size="2GB" --frameworks_home="" --gc_delay="1weeks" --gc_disk_headroom="0.1"
--hadoop_home="" --help="false" --hostname_lookup="true" --http_command_executor="false" --http_credentials="/tmp/Endpoint_SlaveEndpointTest_NoAuthorizer_0_3fbhGe/http_credentials"
--http_heartbeat_interval="30secs" --initialize_driver_logging="true" --isolation="posix/cpu,posix/mem"
--launcher="posix" --launcher_dir="/mesos/mesos-1.3.2/_build/src" --logbufsecs="0" --logging_level="INFO"
--max_completed_executors_per_framework="150" --oversubscribed_resources_interval="15secs"
--perf_duration="10secs" --perf_interval="1mins" --port="5051" --qos_correction_interval_min="0ns"
--quiet="false" --recover="reconnect" --recovery_timeout="15mins" --registration_backoff_factor="10ms"
--resources="cpus:2;gpus:0;mem:1024;disk:1024;ports:[31000-32000]" --revocable_cpu_low_priority="true"
--runtime_dir="/tmp/Endpoint_SlaveEndpointTest_NoAuthorizer_0_3fbhGe" --sandbox_directory="/mnt/mesos/sandbox"
--strict="true" --switch_user="true" --systemd_enable_support="true" --systemd_runtime_directory="/run/systemd/system"
--version="false" --work_dir="/tmp/Endpoint_SlaveEndpointTest_NoAuthorizer_0_sdjEy7"
I1105 03:57:02.928620 20939 credentials.hpp:86] Loading credential for authentication from
'/tmp/Endpoint_SlaveEndpointTest_NoAuthorizer_0_3fbhGe/credential'
I1105 03:57:02.928752 20939 slave.cpp:264] Agent using credential for: test-principal
I1105 03:57:02.928781 20939 credentials.hpp:37] Loading credentials for authentication from
'/tmp/Endpoint_SlaveEndpointTest_NoAuthorizer_0_3fbhGe/http_credentials'
I1105 03:57:02.929054 20939 http.cpp:975] Creating default 'basic' HTTP authenticator for
realm 'mesos-agent-executor'
I1105 03:57:02.929185 20939 http.cpp:996] Creating default 'jwt' HTTP authenticator for realm
'mesos-agent-executor'
I1105 03:57:02.929384 20939 http.cpp:975] Creating default 'basic' HTTP authenticator for
realm 'mesos-agent-readonly'
I1105 03:57:02.929471 20939 http.cpp:996] Creating default 'jwt' HTTP authenticator for realm
'mesos-agent-readonly'
I1105 03:57:02.929641 20939 http.cpp:975] Creating default 'basic' HTTP authenticator for
realm 'mesos-agent-readwrite'
I1105 03:57:02.929729 20939 http.cpp:996] Creating default 'jwt' HTTP authenticator for realm
'mesos-agent-readwrite'
I1105 03:57:02.931197 20939 slave.cpp:531] Agent resources: cpus(*):2; mem(*):1024; disk(*):1024;
ports(*):[31000-32000]
I1105 03:57:02.931277 20939 slave.cpp:539] Agent attributes: [  ]
I1105 03:57:02.931288 20939 slave.cpp:544] Agent hostname: 84eba6339187
I1105 03:57:02.931412 20945 status_update_manager.cpp:177] Pausing sending status updates
I1105 03:57:02.932708 20936 state.cpp:62] Recovering state from '/tmp/Endpoint_SlaveEndpointTest_NoAuthorizer_0_sdjEy7/meta'
I1105 03:57:02.933037 20934 status_update_manager.cpp:203] Recovering status update manager
I1105 03:57:02.933239 20935 containerizer.cpp:608] Recovering containerizer
I1105 03:57:02.934726 20939 provisioner.cpp:410] Provisioner recovery complete
I1105 03:57:02.935134 20948 slave.cpp:6100] Finished recovery
I1105 03:57:02.935565 20948 slave.cpp:6282] Querying resource estimator for oversubscribable
resources
I1105 03:57:02.935796 20949 slave.cpp:6296] Received oversubscribable resources {} from the
resource estimator
I1105 03:57:02.937489 20936 process.cpp:3741] Handling HTTP event for process 'slave(750)'
with path: '/slave(750)/monitor/statistics'
I1105 03:57:02.939249 20944 http.cpp:1115] HTTP GET for /slave(750)/monitor/statistics from
172.17.0.3:54248
I1105 03:57:02.939337 20944 http.cpp:936] Authorizing principal 'test-principal' to GET the
'/monitor/statistics' endpoint
I1105 03:57:02.942996 20956 slave.cpp:796] Agent terminating
[       OK ] Endpoint/SlaveEndpointTest.NoAuthorizer/0 (29 ms)
[ RUN      ] Endpoint/SlaveEndpointTest.NoAuthorizer/1
I1105 03:57:02.953567  1305 containerizer.cpp:221] Using isolation: posix/cpu,posix/mem,filesystem/posix,network/cni
W1105 03:57:02.954044  1305 backend.cpp:76] Failed to create 'aufs' backend: AufsBackend requires
root privileges
W1105 03:57:02.954138  1305 backend.cpp:76] Failed to create 'bind' backend: BindBackend requires
root privileges
I1105 03:57:02.954166  1305 provisioner.cpp:249] Using default backend 'copy'
I1105 03:57:02.955647  1305 cluster.cpp:448] Creating default 'local' authorizer
I1105 03:57:02.957993 20947 slave.cpp:231] Mesos agent started on (751)@172.17.0.3:36975
I1105 03:57:02.958015 20947 slave.cpp:232] Flags at startup: --acls="" --appc_simple_discovery_uri_prefix="http://"
--appc_store_dir="/tmp/mesos/store/appc" --authenticate_http_executors="true" --authenticate_http_readonly="true"
--authenticate_http_readwrite="true" --authenticatee="crammd5" --authentication_backoff_factor="1secs"
--authorizer="local" --cgroups_cpu_enable_pids_and_tids_count="false" --cgroups_enable_cfs="false"
--cgroups_hierarchy="/sys/fs/cgroup" --cgroups_limit_swap="false" --cgroups_root="mesos" --container_disk_watch_interval="15secs"
--containerizers="mesos" --credential="/tmp/Endpoint_SlaveEndpointTest_NoAuthorizer_1_vu8FpH/credential"
--default_role="*" --disk_watch_interval="1mins" --docker="docker" --docker_kill_orphans="true"
--docker_registry="https://registry-1.docker.io" --docker_remove_delay="6hrs" --docker_socket="/var/run/docker.sock"
--docker_stop_timeout="0ns" --docker_store_dir="/tmp/mesos/store/docker" --docker_volume_checkpoint_dir="/var/run/mesos/isolators/docker/volume"
--enforce_container_disk_quota="false" --executor_registration_timeout="1mins" --executor_reregistration_timeout="2secs"
--executor_secret_key="/tmp/Endpoint_SlaveEndpointTest_NoAuthorizer_1_vu8FpH/executor_secret_key"
--executor_shutdown_grace_period="5secs" --fetcher_cache_dir="/tmp/Endpoint_SlaveEndpointTest_NoAuthorizer_1_vu8FpH/fetch"
--fetcher_cache_size="2GB" --frameworks_home="" --gc_delay="1weeks" --gc_disk_headroom="0.1"
--hadoop_home="" --help="false" --hostname_lookup="true" --http_command_executor="false" --http_credentials="/tmp/Endpoint_SlaveEndpointTest_NoAuthorizer_1_vu8FpH/http_credentials"
--http_heartbeat_interval="30secs" --initialize_driver_logging="true" --isolation="posix/cpu,posix/mem"
--launcher="posix" --launcher_dir="/mesos/mesos-1.3.2/_build/src" --logbufsecs="0" --logging_level="INFO"
--max_completed_executors_per_framework="150" --oversubscribed_resources_interval="15secs"
--perf_duration="10secs" --perf_interval="1mins" --port="5051" --qos_correction_interval_min="0ns"
--quiet="false" --recover="reconnect" --recovery_timeout="15mins" --registration_backoff_factor="10ms"
--resources="cpus:2;gpus:0;mem:1024;disk:1024;ports:[31000-32000]" --revocable_cpu_low_priority="true"
--runtime_dir="/tmp/Endpoint_SlaveEndpointTest_NoAuthorizer_1_vu8FpH" --sandbox_directory="/mnt/mesos/sandbox"
--strict="true" --switch_user="true" --systemd_enable_support="true" --systemd_runtime_directory="/run/systemd/system"
--version="false" --work_dir="/tmp/Endpoint_SlaveEndpointTest_NoAuthorizer_1_kS4FdA"
I1105 03:57:02.958341 20947 credentials.hpp:86] Loading credential for authentication from
'/tmp/Endpoint_SlaveEndpointTest_NoAuthorizer_1_vu8FpH/credential'
I1105 03:57:02.958482 20947 slave.cpp:264] Agent using credential for: test-principal
I1105 03:57:02.958500 20947 credentials.hpp:37] Loading credentials for authentication from
'/tmp/Endpoint_SlaveEndpointTest_NoAuthorizer_1_vu8FpH/http_credentials'
I1105 03:57:02.958745 20947 http.cpp:975] Creating default 'basic' HTTP authenticator for
realm 'mesos-agent-executor'
I1105 03:57:02.958914 20947 http.cpp:996] Creating default 'jwt' HTTP authenticator for realm
'mesos-agent-executor'
I1105 03:57:02.959136 20947 http.cpp:975] Creating default 'basic' HTTP authenticator for
realm 'mesos-agent-readonly'
I1105 03:57:02.959239 20947 http.cpp:996] Creating default 'jwt' HTTP authenticator for realm
'mesos-agent-readonly'
I1105 03:57:02.959548 20947 http.cpp:975] Creating default 'basic' HTTP authenticator for
realm 'mesos-agent-readwrite'
I1105 03:57:02.959661 20947 http.cpp:996] Creating default 'jwt' HTTP authenticator for realm
'mesos-agent-readwrite'
I1105 03:57:02.961068 20947 slave.cpp:531] Agent resources: cpus(*):2; mem(*):1024; disk(*):1024;
ports(*):[31000-32000]
I1105 03:57:02.961166 20947 slave.cpp:539] Agent attributes: [  ]
I1105 03:57:02.961179 20947 slave.cpp:544] Agent hostname: 84eba6339187
I1105 03:57:02.961313 20941 status_update_manager.cpp:177] Pausing sending status updates
I1105 03:57:02.962509 20939 state.cpp:62] Recovering state from '/tmp/Endpoint_SlaveEndpointTest_NoAuthorizer_1_kS4FdA/meta'
I1105 03:57:02.962764 20947 status_update_manager.cpp:203] Recovering status update manager
I1105 03:57:02.963053 20948 containerizer.cpp:608] Recovering containerizer
I1105 03:57:02.964625 20946 provisioner.cpp:410] Provisioner recovery complete
I1105 03:57:02.965034 20955 slave.cpp:6100] Finished recovery
I1105 03:57:02.965482 20955 slave.cpp:6282] Querying resource estimator for oversubscribable
resources
I1105 03:57:02.965893 20939 slave.cpp:6296] Received oversubscribable resources {} from the
resource estimator
I1105 03:57:02.967674 20937 process.cpp:3741] Handling HTTP event for process 'slave(751)'
with path: '/slave(751)/monitor/statistics.json'
I1105 03:57:02.969410 20954 http.cpp:1115] HTTP GET for /slave(751)/monitor/statistics.json
from 172.17.0.3:54250
I1105 03:57:02.969488 20954 http.cpp:936] Authorizing principal 'test-principal' to GET the
'/monitor/statistics.json' endpoint
I1105 03:57:02.973340 20957 slave.cpp:796] Agent terminating
[       OK ] Endpoint/SlaveEndpointTest.NoAuthorizer/1 (31 ms)
[ RUN      ] Endpoint/SlaveEndpointTest.NoAuthorizer/2
I1105 03:57:02.984719  1305 containerizer.cpp:221] Using isolation: posix/cpu,posix/mem,filesystem/posix,network/cni
W1105 03:57:02.985222  1305 backend.cpp:76] Failed to create 'aufs' backend: AufsBackend requires
root privileges
W1105 03:57:02.985314  1305 backend.cpp:76] Failed to create 'bind' backend: BindBackend requires
root privileges
I1105 03:57:02.985343  1305 provisioner.cpp:249] Using default backend 'copy'
I1105 03:57:02.987048  1305 cluster.cpp:448] Creating default 'local' authorizer
I1105 03:57:02.988620 20956 slave.cpp:231] Mesos agent started on (752)@172.17.0.3:36975
I1105 03:57:02.988641 20956 slave.cpp:232] Flags at startup: --acls="" --appc_simple_discovery_uri_prefix="http://"
--appc_store_dir="/tmp/mesos/store/appc" --authenticate_http_executors="true" --authenticate_http_readonly="true"
--authenticate_http_readwrite="true" --authenticatee="crammd5" --authentication_backoff_factor="1secs"
--authorizer="local" --cgroups_cpu_enable_pids_and_tids_count="false" --cgroups_enable_cfs="false"
--cgroups_hierarchy="/sys/fs/cgroup" --cgroups_limit_swap="false" --cgroups_root="mesos" --container_disk_watch_interval="15secs"
--containerizers="mesos" --credential="/tmp/Endpoint_SlaveEndpointTest_NoAuthorizer_2_BQTrra/credential"
--default_role="*" --disk_watch_interval="1mins" --docker="docker" --docker_kill_orphans="true"
--docker_registry="https://registry-1.docker.io" --docker_remove_delay="6hrs" --docker_socket="/var/run/docker.sock"
--docker_stop_timeout="0ns" --docker_store_dir="/tmp/mesos/store/docker" --docker_volume_checkpoint_dir="/var/run/mesos/isolators/docker/volume"
--enforce_container_disk_quota="false" --executor_registration_timeout="1mins" --executor_reregistration_timeout="2secs"
--executor_secret_key="/tmp/Endpoint_SlaveEndpointTest_NoAuthorizer_2_BQTrra/executor_secret_key"
--executor_shutdown_grace_period="5secs" --fetcher_cache_dir="/tmp/Endpoint_SlaveEndpointTest_NoAuthorizer_2_BQTrra/fetch"
--fetcher_cache_size="2GB" --frameworks_home="" --gc_delay="1weeks" --gc_disk_headroom="0.1"
--hadoop_home="" --help="false" --hostname_lookup="true" --http_command_executor="false" --http_credentials="/tmp/Endpoint_SlaveEndpointTest_NoAuthorizer_2_BQTrra/http_credentials"
--http_heartbeat_interval="30secs" --initialize_driver_logging="true" --isolation="posix/cpu,posix/mem"
--launcher="posix" --launcher_dir="/mesos/mesos-1.3.2/_build/src" --logbufsecs="0" --logging_level="INFO"
--max_completed_executors_per_framework="150" --oversubscribed_resources_interval="15secs"
--perf_duration="10secs" --perf_interval="1mins" --port="5051" --qos_correction_interval_min="0ns"
--quiet="false" --recover="reconnect" --recovery_timeout="15mins" --registration_backoff_factor="10ms"
--resources="cpus:2;gpus:0;mem:1024;disk:1024;ports:[31000-32000]" --revocable_cpu_low_priority="true"
--runtime_dir="/tmp/Endpoint_SlaveEndpointTest_NoAuthorizer_2_BQTrra" --sandbox_directory="/mnt/mesos/sandbox"
--strict="true" --switch_user="true" --systemd_enable_support="true" --systemd_runtime_directory="/run/systemd/system"
--version="false" --work_dir="/tmp/Endpoint_SlaveEndpointTest_NoAuthorizer_2_eMiOa3"
I1105 03:57:02.989064 20956 credentials.hpp:86] Loading credential for authentication from
'/tmp/Endpoint_SlaveEndpointTest_NoAuthorizer_2_BQTrra/credential'
I1105 03:57:02.989225 20956 slave.cpp:264] Agent using credential for: test-principal
I1105 03:57:02.989246 20956 credentials.hpp:37] Loading credentials for authentication from
'/tmp/Endpoint_SlaveEndpointTest_NoAuthorizer_2_BQTrra/http_credentials'
I1105 03:57:02.989560 20956 http.cpp:975] Creating default 'basic' HTTP authenticator for
realm 'mesos-agent-executor'
I1105 03:57:02.989670 20956 http.cpp:996] Creating default 'jwt' HTTP authenticator for realm
'mesos-agent-executor'
I1105 03:57:02.989900 20956 http.cpp:975] Creating default 'basic' HTTP authenticator for
realm 'mesos-agent-readonly'
I1105 03:57:02.990041 20956 http.cpp:996] Creating default 'jwt' HTTP authenticator for realm
'mesos-agent-readonly'
I1105 03:57:02.990259 20956 http.cpp:975] Creating default 'basic' HTTP authenticator for
realm 'mesos-agent-readwrite'
I1105 03:57:02.990363 20956 http.cpp:996] Creating default 'jwt' HTTP authenticator for realm
'mesos-agent-readwrite'
I1105 03:57:02.991843 20956 slave.cpp:531] Agent resources: cpus(*):2; mem(*):1024; disk(*):1024;
ports(*):[31000-32000]
I1105 03:57:02.991926 20956 slave.cpp:539] Agent attributes: [  ]
I1105 03:57:02.991938 20956 slave.cpp:544] Agent hostname: 84eba6339187
I1105 03:57:02.992066 20944 status_update_manager.cpp:177] Pausing sending status updates
I1105 03:57:02.993669 20938 state.cpp:62] Recovering state from '/tmp/Endpoint_SlaveEndpointTest_NoAuthorizer_2_eMiOa3/meta'
I1105 03:57:02.993955 20957 status_update_manager.cpp:203] Recovering status update manager
I1105 03:57:02.994173 20954 containerizer.cpp:608] Recovering containerizer
I1105 03:57:02.995793 20943 provisioner.cpp:410] Provisioner recovery complete
I1105 03:57:02.996311 20949 slave.cpp:6100] Finished recovery
I1105 03:57:02.996820 20949 slave.cpp:6282] Querying resource estimator for oversubscribable
resources
I1105 03:57:02.997061 20949 slave.cpp:6296] Received oversubscribable resources {} from the
resource estimator
I1105 03:57:02.998787 20935 process.cpp:3741] Handling HTTP event for process 'slave(752)'
with path: '/slave(752)/containers'
I1105 03:57:03.000769 20956 http.cpp:1115] HTTP GET for /slave(752)/containers from 172.17.0.3:54252
I1105 03:57:03.000839 20956 http.cpp:936] Authorizing principal 'test-principal' to GET the
'/containers' endpoint
I1105 03:57:03.005139 20952 slave.cpp:796] Agent terminating
[       OK ] Endpoint/SlaveEndpointTest.NoAuthorizer/2 (31 ms)
[----------] 9 tests from Endpoint/SlaveEndpointTest (262 ms total)

[----------] Global test environment tear-down
[==========] 1578 tests from 177 test cases ran. (713912 ms total)
[  PASSED  ] 1576 tests.
[  FAILED  ] 2 tests, listed below:
[  FAILED  ] DefaultExecutorCheckTest.CommandCheckDeliveredAndReconciled
[  FAILED  ] DefaultExecutorCheckTest.CommandCheckStatusChange

 2 FAILED TESTS
  YOU HAVE 22 DISABLED TESTS

E1105 03:57:03.071879 20958 process.cpp:956] Failed to accept socket: future discarded
make[4]: *** [check-local] Error 1
make[4]: Leaving directory `/mesos/mesos-1.3.2/_build/src'
make[3]: *** [check-am] Error 2
make[3]: Leaving directory `/mesos/mesos-1.3.2/_build/src'
make[2]: *** [check] Error 2
make[2]: Leaving directory `/mesos/mesos-1.3.2/_build/src'
make[1]: *** [check-recursive] Error 1
make[1]: Leaving directory `/mesos/mesos-1.3.2/_build'
make: *** [distcheck] Error 1
+ docker rmi mesos-1509850776-18352
Untagged: mesos-1509850776-18352:latest
Deleted: sha256:7993090cc68064e3ccea60894f1aeccf5d812879c341256d840de0eda4689b80
Deleted: sha256:79571bb3f531cc5ce4903077684071a436e40b12830cd0cbc93ffe25d902b482
Deleted: sha256:4eff511b4828611d99944244e9e88c24e1be69f6fadd1d202ce25b556f7ea6f7
Deleted: sha256:5dc93c55d7ed128b28de16435841b4fadbe3cfea3660ecd9ba757031ed74b24f
Deleted: sha256:c2c893d0a7a881319010938ed83ca5dddd9fe7239df82d9bd0f06fb154eb6f3e
Deleted: sha256:633769e0097af8a33ee9ad697b0b96a20e9d9d7ebcec324cd8e51f59d0b1410c
Deleted: sha256:4fa178bf19f0903572fe5ddc9a8183810669d6592fcee8c7b11b55fbfa891872
Deleted: sha256:64d5af982a3d76aea5271cde18fab728040a63ceb56f925eba1fd3ddc44476a7
Deleted: sha256:c0e89e514965c10b99a99318c22dade709bd087d194b2583e4991ed148b9514a
Deleted: sha256:36ef729708000808542d0ad70b40c4d7e5fb29e2543807ec68e81c84eb254db9
Deleted: sha256:abf4584f3f66790a3c4a5d9efe0aef5755963caaf5323c215bfc3c4c1829f376
Deleted: sha256:c426fbbeec782528737a67e8f2a732dbd22d7904bc374b5394ed90d6a996474a
Deleted: sha256:3d9ccc0fa08125e9c4a835755de8614a8b71e105fbd9266065243898d75cea85
Deleted: sha256:583c6069c99f5f911af6cde8ec40d633a827f91861f5c1fb03cd61a073b4fd5f
Deleted: sha256:cb90e66dcba263bd77d0785508b43ec6fcf83d2ba228508c0e9514a6766dfc6a
Deleted: sha256:b4c820010fd5f686604a229464abbd6853c7aa7383fe109b55c8c0e324b2180f
Deleted: sha256:b1f769d808462cd99412b0f8c5ba5495edc5c82d0d3ba87e1b135ddaf2983773
Deleted: sha256:652f10e7e29fb53a26daebec58e97fbe880ac9eb34d180bd57d0a1197fc5a90f
Deleted: sha256:03d8dcb680b1f24160a36b8ef64562107283a0603f23b73f50b52c839180fe09
Deleted: sha256:af71361ca36cb87a5041926a1cc97f3c15da7de10d667092aa7117fd5784196e
Deleted: sha256:980e5b0b2d89d6a02904b8add6f2689d1127e3fb7a17466f277e2f22c5b09874
Deleted: sha256:4d63c26961a7ded6f23bd32667fb46aa7deaa74d9d4ba2cc9cf4185924039d82
Deleted: sha256:f86699bc453308890f7615f8d8d67dd18fde896f02b8ce7a1e42a21325f880af
Deleted: sha256:9fbc7cb95a6229b80d942bc631d065226c167c156ef9e81444496e266b5f8d1d
Build step 'Execute shell' marked build as failure
Not sending mail to unregistered user zhq527725@gmail.com


Mime
View raw message