mesos-builds mailing list archives

Site index · List index
Message view « Date » · « Thread »
Top « Date » · « Thread »
From Apache Jenkins Server <jenk...@builds.apache.org>
Subject Build failed in Jenkins: Mesos-Buildbot » autotools,clang,--verbose --disable-libtool-wrappers --enable-libevent --enable-ssl,GLOG_v=1 MESOS_VERBOSE=1,ubuntu:14.04,(ubuntu)&&(!ubuntu-us1)&&(!ubuntu-eu2)&&(!qnode3)&&(!H23) #4396
Date Fri, 03 Nov 2017 00:05:40 GMT
See <https://builds.apache.org/job/Mesos-Buildbot/BUILDTOOL=autotools,COMPILER=clang,CONFIGURATION=--verbose%20--disable-libtool-wrappers%20--enable-libevent%20--enable-ssl,ENVIRONMENT=GLOG_v=1%20MESOS_VERBOSE=1,OS=ubuntu%3A14.04,label_exp=(ubuntu)&&(!ubuntu-us1)&&(!ubuntu-eu2)&&(!qnode3)&&(!H23)/4396/display/redirect>

------------------------------------------
[...truncated 2.53 MB...]
I1103 00:05:25.763247 26057 openssl.cpp:429] Will not verify peer certificate!
NOTE: Set LIBPROCESS_SSL_VERIFY_CERT=1 to enable peer certificate verification
I1103 00:05:25.763250 26057 openssl.cpp:435] Will only verify peer certificate if presented!
NOTE: Set LIBPROCESS_SSL_REQUIRE_CERT=1 to require peer certificate verification
I1103 00:05:25.766135 26057 process.cpp:1251] libprocess is initialized on 172.17.0.3:37651
with 16 worker threads
[       OK ] Scheme/HTTPTest.PathParse/0 (326 ms)
[ RUN      ] Scheme/HTTPTest.PathParse/1
I1103 00:05:25.768519 26057 process.cpp:1251] libprocess is initialized on 172.17.0.3:55677
with 16 worker threads
[       OK ] Scheme/HTTPTest.PathParse/1 (2 ms)
[ RUN      ] Scheme/HTTPTest.Get/0
I1103 00:05:26.307354 26057 openssl.cpp:419] CA file path is unspecified! NOTE: Set CA file
path with LIBPROCESS_SSL_CA_FILE=<filepath>
I1103 00:05:26.307379 26057 openssl.cpp:424] CA directory path unspecified! NOTE: Set CA directory
path with LIBPROCESS_SSL_CA_DIR=<dirpath>
I1103 00:05:26.307384 26057 openssl.cpp:429] Will not verify peer certificate!
NOTE: Set LIBPROCESS_SSL_VERIFY_CERT=1 to enable peer certificate verification
I1103 00:05:26.307387 26057 openssl.cpp:435] Will only verify peer certificate if presented!
NOTE: Set LIBPROCESS_SSL_REQUIRE_CERT=1 to require peer certificate verification
I1103 00:05:26.310819 26057 process.cpp:1251] libprocess is initialized on 172.17.0.3:52342
with 16 worker threads
I1103 00:05:26.318576 27095 process.cpp:3714] Handling HTTP event for process '(81)' with
path: '/(81)/get'
I1103 00:05:26.326153 27089 process.cpp:3714] Handling HTTP event for process '(81)' with
path: '/(81)/get'
[       OK ] Scheme/HTTPTest.Get/0 (560 ms)
[ RUN      ] Scheme/HTTPTest.Get/1
I1103 00:05:26.331166 26057 process.cpp:1251] libprocess is initialized on 172.17.0.3:59485
with 16 worker threads
I1103 00:05:26.332232 27104 process.cpp:3714] Handling HTTP event for process '(82)' with
path: '/(82)/get'
I1103 00:05:26.334575 27103 process.cpp:3714] Handling HTTP event for process '(82)' with
path: '/(82)/get'
[       OK ] Scheme/HTTPTest.Get/1 (9 ms)
[ RUN      ] Scheme/HTTPTest.NestedGet/0
I1103 00:05:26.470404 26057 openssl.cpp:419] CA file path is unspecified! NOTE: Set CA file
path with LIBPROCESS_SSL_CA_FILE=<filepath>
I1103 00:05:26.470420 26057 openssl.cpp:424] CA directory path unspecified! NOTE: Set CA directory
path with LIBPROCESS_SSL_CA_DIR=<dirpath>
I1103 00:05:26.470425 26057 openssl.cpp:429] Will not verify peer certificate!
NOTE: Set LIBPROCESS_SSL_VERIFY_CERT=1 to enable peer certificate verification
I1103 00:05:26.470429 26057 openssl.cpp:435] Will only verify peer certificate if presented!
NOTE: Set LIBPROCESS_SSL_REQUIRE_CERT=1 to require peer certificate verification
I1103 00:05:26.472852 26057 process.cpp:1251] libprocess is initialized on 172.17.0.3:34111
with 16 worker threads
I1103 00:05:26.481035 27121 process.cpp:3714] Handling HTTP event for process '(83)' with
path: '/(83)//a/b/c'
I1103 00:05:26.488618 27121 process.cpp:3714] Handling HTTP event for process '(83)' with
path: '/(83)//a/b'
[       OK ] Scheme/HTTPTest.NestedGet/0 (153 ms)
[ RUN      ] Scheme/HTTPTest.NestedGet/1
I1103 00:05:26.492341 26057 process.cpp:1251] libprocess is initialized on 172.17.0.3:52802
with 16 worker threads
I1103 00:05:26.493507 27150 process.cpp:3714] Handling HTTP event for process '(84)' with
path: '/(84)//a/b/c'
I1103 00:05:26.495714 27142 process.cpp:3714] Handling HTTP event for process '(84)' with
path: '/(84)//a/b'
[       OK ] Scheme/HTTPTest.NestedGet/1 (7 ms)
[ RUN      ] Scheme/HTTPTest.StreamingGetComplete/0
I1103 00:05:26.980104 26057 openssl.cpp:419] CA file path is unspecified! NOTE: Set CA file
path with LIBPROCESS_SSL_CA_FILE=<filepath>
I1103 00:05:26.980124 26057 openssl.cpp:424] CA directory path unspecified! NOTE: Set CA directory
path with LIBPROCESS_SSL_CA_DIR=<dirpath>
I1103 00:05:26.980129 26057 openssl.cpp:429] Will not verify peer certificate!
NOTE: Set LIBPROCESS_SSL_VERIFY_CERT=1 to enable peer certificate verification
I1103 00:05:26.980134 26057 openssl.cpp:435] Will only verify peer certificate if presented!
NOTE: Set LIBPROCESS_SSL_REQUIRE_CERT=1 to require peer certificate verification
I1103 00:05:26.983214 26057 process.cpp:1251] libprocess is initialized on 172.17.0.3:60931
with 16 worker threads
I1103 00:05:26.990170 27158 process.cpp:3714] Handling HTTP event for process '(85)' with
path: '/(85)/pipe'
[       OK ] Scheme/HTTPTest.StreamingGetComplete/0 (535 ms)
[ RUN      ] Scheme/HTTPTest.StreamingGetComplete/1
I1103 00:05:27.034977 26057 process.cpp:1251] libprocess is initialized on 172.17.0.3:43123
with 16 worker threads
I1103 00:05:27.036134 27171 process.cpp:3714] Handling HTTP event for process '(86)' with
path: '/(86)/pipe'
[       OK ] Scheme/HTTPTest.StreamingGetComplete/1 (6 ms)
[ RUN      ] Scheme/HTTPTest.StreamingGetFailure/0
I1103 00:05:27.620496 26057 openssl.cpp:419] CA file path is unspecified! NOTE: Set CA file
path with LIBPROCESS_SSL_CA_FILE=<filepath>
I1103 00:05:27.620519 26057 openssl.cpp:424] CA directory path unspecified! NOTE: Set CA directory
path with LIBPROCESS_SSL_CA_DIR=<dirpath>
I1103 00:05:27.620525 26057 openssl.cpp:429] Will not verify peer certificate!
NOTE: Set LIBPROCESS_SSL_VERIFY_CERT=1 to enable peer certificate verification
I1103 00:05:27.620529 26057 openssl.cpp:435] Will only verify peer certificate if presented!
NOTE: Set LIBPROCESS_SSL_REQUIRE_CERT=1 to require peer certificate verification
I1103 00:05:27.623936 26057 process.cpp:1251] libprocess is initialized on 172.17.0.3:43975
with 16 worker threads
I1103 00:05:27.629628 27197 process.cpp:3714] Handling HTTP event for process '(87)' with
path: '/(87)/pipe'
I1103 00:05:27.670444 27202 process.cpp:1609] Failed to read from stream: oops
[       OK ] Scheme/HTTPTest.StreamingGetFailure/0 (634 ms)
[ RUN      ] Scheme/HTTPTest.StreamingGetFailure/1
I1103 00:05:27.675300 26057 process.cpp:1251] libprocess is initialized on 172.17.0.3:55372
with 16 worker threads
I1103 00:05:27.676877 27210 process.cpp:3714] Handling HTTP event for process '(88)' with
path: '/(88)/pipe'
I1103 00:05:27.679586 27219 process.cpp:1609] Failed to read from stream: oops
[       OK ] Scheme/HTTPTest.StreamingGetFailure/1 (8 ms)
[ RUN      ] Scheme/HTTPTest.PipeEquality/0
I1103 00:05:27.985218 26057 openssl.cpp:419] CA file path is unspecified! NOTE: Set CA file
path with LIBPROCESS_SSL_CA_FILE=<filepath>
I1103 00:05:27.985234 26057 openssl.cpp:424] CA directory path unspecified! NOTE: Set CA directory
path with LIBPROCESS_SSL_CA_DIR=<dirpath>
I1103 00:05:27.985239 26057 openssl.cpp:429] Will not verify peer certificate!
NOTE: Set LIBPROCESS_SSL_VERIFY_CERT=1 to enable peer certificate verification
I1103 00:05:27.985244 26057 openssl.cpp:435] Will only verify peer certificate if presented!
NOTE: Set LIBPROCESS_SSL_REQUIRE_CERT=1 to require peer certificate verification
I1103 00:05:27.990324 26057 process.cpp:1251] libprocess is initialized on 172.17.0.3:40498
with 16 worker threads
[       OK ] Scheme/HTTPTest.PipeEquality/0 (310 ms)
[ RUN      ] Scheme/HTTPTest.PipeEquality/1
I1103 00:05:27.993924 26057 process.cpp:1251] libprocess is initialized on 172.17.0.3:33067
with 16 worker threads
[       OK ] Scheme/HTTPTest.PipeEquality/1 (4 ms)
[ RUN      ] Scheme/HTTPTest.Post/0
I1103 00:05:28.315567 26057 openssl.cpp:419] CA file path is unspecified! NOTE: Set CA file
path with LIBPROCESS_SSL_CA_FILE=<filepath>
I1103 00:05:28.315592 26057 openssl.cpp:424] CA directory path unspecified! NOTE: Set CA directory
path with LIBPROCESS_SSL_CA_DIR=<dirpath>
I1103 00:05:28.315596 26057 openssl.cpp:429] Will not verify peer certificate!
NOTE: Set LIBPROCESS_SSL_VERIFY_CERT=1 to enable peer certificate verification
I1103 00:05:28.315600 26057 openssl.cpp:435] Will only verify peer certificate if presented!
NOTE: Set LIBPROCESS_SSL_REQUIRE_CERT=1 to require peer certificate verification
I1103 00:05:28.318720 26057 process.cpp:1251] libprocess is initialized on 172.17.0.3:36182
with 16 worker threads
I1103 00:05:28.326685 27266 process.cpp:3714] Handling HTTP event for process '(89)' with
path: '/(89)/post'
I1103 00:05:28.373368 27270 process.cpp:3714] Handling HTTP event for process '(89)' with
path: '/(89)/post'
[       OK ] Scheme/HTTPTest.Post/0 (419 ms)
[ RUN      ] Scheme/HTTPTest.Post/1
I1103 00:05:28.416589 26057 process.cpp:1251] libprocess is initialized on 172.17.0.3:47637
with 16 worker threads
I1103 00:05:28.423116 27279 process.cpp:3714] Handling HTTP event for process '(90)' with
path: '/(90)/post'
I1103 00:05:28.425856 27288 process.cpp:3714] Handling HTTP event for process '(90)' with
path: '/(90)/post'
[       OK ] Scheme/HTTPTest.Post/1 (15 ms)
[ RUN      ] Scheme/HTTPTest.Delete/0
I1103 00:05:28.828848 26057 openssl.cpp:419] CA file path is unspecified! NOTE: Set CA file
path with LIBPROCESS_SSL_CA_FILE=<filepath>
I1103 00:05:28.828873 26057 openssl.cpp:424] CA directory path unspecified! NOTE: Set CA directory
path with LIBPROCESS_SSL_CA_DIR=<dirpath>
I1103 00:05:28.828881 26057 openssl.cpp:429] Will not verify peer certificate!
NOTE: Set LIBPROCESS_SSL_VERIFY_CERT=1 to enable peer certificate verification
I1103 00:05:28.828888 26057 openssl.cpp:435] Will only verify peer certificate if presented!
NOTE: Set LIBPROCESS_SSL_REQUIRE_CERT=1 to require peer certificate verification
I1103 00:05:28.831825 26057 process.cpp:1251] libprocess is initialized on 172.17.0.3:40220
with 16 worker threads
I1103 00:05:28.837698 27293 process.cpp:3714] Handling HTTP event for process '(91)' with
path: '/(91)/delete'
[       OK ] Scheme/HTTPTest.Delete/0 (411 ms)
[ RUN      ] Scheme/HTTPTest.Delete/1
I1103 00:05:28.841516 26057 process.cpp:1251] libprocess is initialized on 172.17.0.3:33622
with 16 worker threads
I1103 00:05:28.843206 27321 process.cpp:3714] Handling HTTP event for process '(92)' with
path: '/(92)/delete'
[       OK ] Scheme/HTTPTest.Delete/1 (7 ms)
[ RUN      ] Scheme/HTTPTest.Request/0
I1103 00:05:28.979751 26057 openssl.cpp:419] CA file path is unspecified! NOTE: Set CA file
path with LIBPROCESS_SSL_CA_FILE=<filepath>
I1103 00:05:28.979768 26057 openssl.cpp:424] CA directory path unspecified! NOTE: Set CA directory
path with LIBPROCESS_SSL_CA_DIR=<dirpath>
I1103 00:05:28.979775 26057 openssl.cpp:429] Will not verify peer certificate!
NOTE: Set LIBPROCESS_SSL_VERIFY_CERT=1 to enable peer certificate verification
I1103 00:05:28.979781 26057 openssl.cpp:435] Will only verify peer certificate if presented!
NOTE: Set LIBPROCESS_SSL_REQUIRE_CERT=1 to require peer certificate verification
I1103 00:05:28.982347 26057 process.cpp:1251] libprocess is initialized on 172.17.0.3:37482
with 16 worker threads
I1103 00:05:28.990353 27332 process.cpp:3714] Handling HTTP event for process '(93)' with
path: '/(93)/request'
[       OK ] Scheme/HTTPTest.Request/0 (147 ms)
[ RUN      ] Scheme/HTTPTest.Request/1
I1103 00:05:28.996376 26057 process.cpp:1251] libprocess is initialized on 172.17.0.3:37478
with 16 worker threads
I1103 00:05:28.997987 27345 process.cpp:3714] Handling HTTP event for process '(94)' with
path: '/(94)/request'
[       OK ] Scheme/HTTPTest.Request/1 (6 ms)
[ RUN      ] Scheme/HTTPTest.QueryEncodeDecode/0
I1103 00:05:29.142521 26057 openssl.cpp:419] CA file path is unspecified! NOTE: Set CA file
path with LIBPROCESS_SSL_CA_FILE=<filepath>
I1103 00:05:29.142536 26057 openssl.cpp:424] CA directory path unspecified! NOTE: Set CA directory
path with LIBPROCESS_SSL_CA_DIR=<dirpath>
I1103 00:05:29.142541 26057 openssl.cpp:429] Will not verify peer certificate!
NOTE: Set LIBPROCESS_SSL_VERIFY_CERT=1 to enable peer certificate verification
I1103 00:05:29.142545 26057 openssl.cpp:435] Will only verify peer certificate if presented!
NOTE: Set LIBPROCESS_SSL_REQUIRE_CERT=1 to require peer certificate verification
I1103 00:05:29.144451 26057 process.cpp:1251] libprocess is initialized on 172.17.0.3:45121
with 16 worker threads
[       OK ] Scheme/HTTPTest.QueryEncodeDecode/0 (145 ms)
[ RUN      ] Scheme/HTTPTest.QueryEncodeDecode/1
I1103 00:05:29.147696 26057 process.cpp:1251] libprocess is initialized on 172.17.0.3:59280
with 16 worker threads
[       OK ] Scheme/HTTPTest.QueryEncodeDecode/1 (4 ms)
[ RUN      ] Scheme/HTTPTest.Headers/0
I1103 00:05:29.718247 26057 openssl.cpp:419] CA file path is unspecified! NOTE: Set CA file
path with LIBPROCESS_SSL_CA_FILE=<filepath>
I1103 00:05:29.718268 26057 openssl.cpp:424] CA directory path unspecified! NOTE: Set CA directory
path with LIBPROCESS_SSL_CA_DIR=<dirpath>
I1103 00:05:29.718273 26057 openssl.cpp:429] Will not verify peer certificate!
NOTE: Set LIBPROCESS_SSL_VERIFY_CERT=1 to enable peer certificate verification
I1103 00:05:29.718277 26057 openssl.cpp:435] Will only verify peer certificate if presented!
NOTE: Set LIBPROCESS_SSL_REQUIRE_CERT=1 to require peer certificate verification
I1103 00:05:29.723258 26057 process.cpp:1251] libprocess is initialized on 172.17.0.3:33897
with 16 worker threads
[       OK ] Scheme/HTTPTest.Headers/0 (575 ms)
[ RUN      ] Scheme/HTTPTest.Headers/1
I1103 00:05:29.727243 26057 process.cpp:1251] libprocess is initialized on 172.17.0.3:53918
with 16 worker threads
[       OK ] Scheme/HTTPTest.Headers/1 (4 ms)
[ RUN      ] Scheme/HTTPTest.CaseInsensitiveHeaders/0
I1103 00:05:29.988610 26057 openssl.cpp:419] CA file path is unspecified! NOTE: Set CA file
path with LIBPROCESS_SSL_CA_FILE=<filepath>
I1103 00:05:29.988626 26057 openssl.cpp:424] CA directory path unspecified! NOTE: Set CA directory
path with LIBPROCESS_SSL_CA_DIR=<dirpath>
I1103 00:05:29.988631 26057 openssl.cpp:429] Will not verify peer certificate!
NOTE: Set LIBPROCESS_SSL_VERIFY_CERT=1 to enable peer certificate verification
I1103 00:05:29.988634 26057 openssl.cpp:435] Will only verify peer certificate if presented!
NOTE: Set LIBPROCESS_SSL_REQUIRE_CERT=1 to require peer certificate verification
I1103 00:05:29.992393 26057 process.cpp:1251] libprocess is initialized on 172.17.0.3:58825
with 16 worker threads
[       OK ] Scheme/HTTPTest.CaseInsensitiveHeaders/0 (265 ms)
[ RUN      ] Scheme/HTTPTest.CaseInsensitiveHeaders/1
I1103 00:05:29.996088 26057 process.cpp:1251] libprocess is initialized on 172.17.0.3:37998
with 16 worker threads
[       OK ] Scheme/HTTPTest.CaseInsensitiveHeaders/1 (4 ms)
[ RUN      ] Scheme/HTTPTest.WWWAuthenticateHeader/0
I1103 00:05:30.542959 26057 openssl.cpp:419] CA file path is unspecified! NOTE: Set CA file
path with LIBPROCESS_SSL_CA_FILE=<filepath>
I1103 00:05:30.542980 26057 openssl.cpp:424] CA directory path unspecified! NOTE: Set CA directory
path with LIBPROCESS_SSL_CA_DIR=<dirpath>
I1103 00:05:30.542987 26057 openssl.cpp:429] Will not verify peer certificate!
NOTE: Set LIBPROCESS_SSL_VERIFY_CERT=1 to enable peer certificate verification
I1103 00:05:30.542992 26057 openssl.cpp:435] Will only verify peer certificate if presented!
NOTE: Set LIBPROCESS_SSL_REQUIRE_CERT=1 to require peer certificate verification
I1103 00:05:30.545431 26057 process.cpp:1251] libprocess is initialized on 172.17.0.3:44148
with 16 worker threads
[       OK ] Scheme/HTTPTest.WWWAuthenticateHeader/0 (550 ms)
[ RUN      ] Scheme/HTTPTest.WWWAuthenticateHeader/1
I1103 00:05:30.551196 26057 process.cpp:1251] libprocess is initialized on 172.17.0.3:41906
with 16 worker threads
[       OK ] Scheme/HTTPTest.WWWAuthenticateHeader/1 (5 ms)
[ RUN      ] Scheme/HTTPTest.Accepts/0
I1103 00:05:30.818209 26057 openssl.cpp:419] CA file path is unspecified! NOTE: Set CA file
path with LIBPROCESS_SSL_CA_FILE=<filepath>
I1103 00:05:30.818233 26057 openssl.cpp:424] CA directory path unspecified! NOTE: Set CA directory
path with LIBPROCESS_SSL_CA_DIR=<dirpath>
I1103 00:05:30.818240 26057 openssl.cpp:429] Will not verify peer certificate!
NOTE: Set LIBPROCESS_SSL_VERIFY_CERT=1 to enable peer certificate verification
I1103 00:05:30.818246 26057 openssl.cpp:435] Will only verify peer certificate if presented!
NOTE: Set LIBPROCESS_SSL_REQUIRE_CERT=1 to require peer certificate verification
*** Aborted at 1509667530 (unix time) try "date -d @1509667530" if you are using GNU date
***
PC: @     0x2b029feb7e62 (unknown)
*** SIGSEGV (@0x2b02b1640258) received by PID 26057 (TID 0x2b02a7b5a700) from PID 18446744072390705752;
stack trace: ***
    @     0x2b029e009330 (unknown)
I1103 00:05:30.821411 26057 process.cpp:1251] libprocess is initialized on 172.17.0.3:48510
with 16 worker threads
    @     0x2b029feb7e62 (unknown)
    @     0x2b029feb848c (unknown)
    @           0x44336f process::UPID::UPID()
[       OK ] Scheme/HTTPTest.Accepts/0 (275 ms)
[ RUN      ] Scheme/HTTPTest.Accepts/1
    @           0x9fa19e process::DispatchEvent::DispatchEvent()
    @           0x9e3c53 process::internal::dispatch()
    @           0x9f9c5d process::dispatch<>()
    @           0x9e2c77 process::ProcessBase::route()
    @           0xafac7d process::ProcessBase::route<>()
    @           0xaf8550 process::Help::initialize()
    @           0xaf8602 process::Help::initialize()
    @           0x9dd760 process::ProcessManager::resume()
    @           0x9ebf8c process::ProcessManager::init_threads()::$_2::operator()()
    @           0x9ebe95 _ZNSt12_Bind_simpleIFZN7process14ProcessManager12init_threadsEvE3$_2vEE9_M_invokeIJEEEvSt12_Index_tupleIJXspT_EEE
    @           0x9ebe65 std::_Bind_simple<>::operator()()
    @           0x9ebe3c std::thread::_Impl<>::_M_run()
    @     0x2b029feaea60 (unknown)
    @     0x2b029e001184 start_thread
    @     0x2b02a071affd (unknown)
make[7]: *** [check-local] Segmentation fault
make[7]: Leaving directory `/mesos/mesos-1.2.3/_build/3rdparty/libprocess'
make[6]: *** [check-am] Error 2
make[6]: Leaving directory `/mesos/mesos-1.2.3/_build/3rdparty/libprocess'
make[5]: *** [check-recursive] Error 1
make[5]: Leaving directory `/mesos/mesos-1.2.3/_build/3rdparty/libprocess'
make[4]: *** [check] Error 2
make[4]: Leaving directory `/mesos/mesos-1.2.3/_build/3rdparty/libprocess'
make[3]: *** [check-recursive] Error 1
make[3]: Leaving directory `/mesos/mesos-1.2.3/_build/3rdparty'
make[2]: *** [check] Error 2
make[2]: Leaving directory `/mesos/mesos-1.2.3/_build/3rdparty'
make[1]: *** [check-recursive] Error 1
make[1]: Leaving directory `/mesos/mesos-1.2.3/_build'
make: *** [distcheck] Error 1
+ docker rmi mesos-1509665941-28610
Untagged: mesos-1509665941-28610:latest
Deleted: sha256:928d1dd45ef0c075cc4c246d9ae25459a11a6d340d9866afef032c411caf9020
Deleted: sha256:a0859c58079996bc26ae7bffb4394f580fc8b7b437baef2d06d37663f460bb65
Deleted: sha256:93f34173a5adaf3c7b0e4597786f7a877457a17233e4ddb30d68869b53ec1871
Deleted: sha256:50a771d97f662ef4104bd23eec3fdd1722bc35e36158ff6b97ccd30d446c2032
Deleted: sha256:a277426ea7a2f8492a7d33ea2ec0d11347a03f8f164abed5ced0a9231479a157
Deleted: sha256:1e29c9d876d45fdba9759eef448d71074a685157e7e7a3868f13497825be9ae1
Deleted: sha256:36a42bc677b4bb682d2bdb1dc8063a2cf77963e0dcbea7871d9b702e544442c3
Deleted: sha256:5405a10ee1901850c08ba7db35507084715f4ff4fcc9bdabd0c708b7cc1e6cd2
Deleted: sha256:a0d3cc0b549459e0029e65c8052c90265b3662dc3cb20086770a11e7a2fe8ff3
Deleted: sha256:2bc8930d4c7b52c3a495833212fcb7c41d29833f67aa59aeb5c8ac77a74927e7
Deleted: sha256:858c09b00239bffb21567db5a7674b34df9d84251288a3ec1fd5fc322ea80126
Deleted: sha256:47a4001d0cce4ee153f597356b63df0825851f68891aa932a1ddb1c8894679e2
Deleted: sha256:3e37290b1de70e8c4eb854897923d6698be6be3d339472f9fa9853da1f919a99
Deleted: sha256:9e908737f3bc316fe83005f93b0e5fe9aa050994c7288728acc857769b5ba002
Deleted: sha256:9f844de5b9704556bbf2acce57644ce43c60b5e5e7c6829d3609cf0c52f7190e
Deleted: sha256:8eeb6a10c01d149e4c62cc6d175b37c5c8f8d53bc767bf22f9572f5f1a3a2338
Deleted: sha256:e0067824bf69de05723e611fd9219b120a38a5a67a764d5facb187bc76174c16
Deleted: sha256:2b48800c6c430fd0228c6c0c627d674d09c940835a849ff7a0b5188445d6ea61
Deleted: sha256:36c23d64677842559c5f5650b40aca5162091daa250ca84ee54b499f3086e361
Deleted: sha256:2e8d2802eda7017d863d49034e8d12e430d9bb9361eef9d073ffa1c7cb5f3418
Deleted: sha256:f06905a57b4416a04a2faaec61e49e3ed55c04bde563cd9c983e5f96bae177c4
Deleted: sha256:395402d5530fcf7864b723cd663a7b33eb954fdb903a96671f242b1a06807e4e
Deleted: sha256:1ace53a0a508025ed98ac79932d0c52fbb2e767905ed3720ef81bb91d612733d
Deleted: sha256:4962adf4d753fa5a47f0391fda4e5264f1bea29e03883f2bcca12e48201cd12e
Build step 'Execute shell' marked build as failure

Mime
View raw message