mesos-builds mailing list archives

Site index · List index
Message view « Date » · « Thread »
Top « Date » · « Thread »
From Apache Jenkins Server <jenk...@builds.apache.org>
Subject Build failed in Jenkins: Mesos-Buildbot » cmake,clang,--verbose --disable-libtool-wrappers --enable-libevent --enable-ssl,GLOG_v=1 MESOS_VERBOSE=1,ubuntu:14.04,(ubuntu)&&(!ubuntu-us1)&&(!ubuntu-eu2)&&(!qnode3)&&(!H23) #4451
Date Tue, 14 Nov 2017 01:38:09 GMT
See <https://builds.apache.org/job/Mesos-Buildbot/BUILDTOOL=cmake,COMPILER=clang,CONFIGURATION=--verbose%20--disable-libtool-wrappers%20--enable-libevent%20--enable-ssl,ENVIRONMENT=GLOG_v=1%20MESOS_VERBOSE=1,OS=ubuntu%3A14.04,label_exp=(ubuntu)&&(!ubuntu-us1)&&(!ubuntu-eu2)&&(!qnode3)&&(!H23)/4451/display/redirect?page=changes>

Changes:

[yujie.jay] Handled the resource conversion for new operations in master.

[songzihao1990] Added a test `CgroupsIsolatorTest.ROOT_CGROUPS_BlkioUsage`.

------------------------------------------
[...truncated 27.84 MB...]
3: I1114 01:38:01.034093 18277 status_update_manager.cpp:177] Pausing sending status updates
3: I1114 01:38:01.035605 18266 state.cpp:64] Recovering state from '/tmp/ContentType_ResourceProviderManagerHttpApiTest_AgentEndpoint_1_sL3Rlm/meta'
3: I1114 01:38:01.035863 18273 status_update_manager.cpp:203] Recovering status update manager
3: I1114 01:38:01.036036 18285 containerizer.cpp:662] Recovering containerizer
3: I1114 01:38:01.037405 18274 provisioner.cpp:416] Provisioner recovery complete
3: I1114 01:38:01.037737 18277 slave.cpp:6432] Finished recovery
3: I1114 01:38:01.038458 18266 status_update_manager.cpp:177] Pausing sending status updates
3: I1114 01:38:01.038501 18272 slave.cpp:1007] New master detected at master@172.17.0.4:42218
3: I1114 01:38:01.038553 18272 slave.cpp:1042] Detecting new master
3: I1114 01:38:01.042368 18267 process.cpp:3925] Handling HTTP event for process 'slave(750)'
with path: '/slave(750)/api/v1/resource_provider'
3: I1114 01:38:01.044190 18274 http.cpp:1185] HTTP POST for /slave(750)/api/v1/resource_provider
from 172.17.0.4:35596
3: I1114 01:38:01.044797 18287 manager.cpp:381] Subscribing resource provider {"name":"test","type":"org.apache.mesos.rp.test"}
3: I1114 01:38:01.052511 18278 slave.cpp:883] Agent terminating
3: I1114 01:38:01.057657 18265 master.cpp:1151] Master terminating
3: [       OK ] ContentType/ResourceProviderManagerHttpApiTest.AgentEndpoint/1 (50 ms)
3: [ RUN      ] ContentType/ResourceProviderManagerHttpApiTest.ConvertResources/0
3: I1114 01:38:01.063501 18265 cluster.cpp:162] Creating default 'local' authorizer
3: I1114 01:38:01.066292 18276 master.cpp:448] Master 2258d378-4e87-49ff-bf59-557eb423861a
(146ee66cea76) started on 172.17.0.4:42218
3: I1114 01:38:01.066325 18276 master.cpp:450] Flags at startup: --acls="" --agent_ping_timeout="15secs"
--agent_reregister_timeout="10mins" --allocation_interval="1secs" --allocator="HierarchicalDRF"
--authenticate_agents="true" --authenticate_frameworks="true" --authenticate_http_frameworks="true"
--authenticate_http_readonly="true" --authenticate_http_readwrite="true" --authenticators="crammd5"
--authorizers="local" --credentials="/tmp/Y9TrLh/credentials" --filter_gpu_resources="true"
--framework_sorter="drf" --help="false" --hostname_lookup="true" --http_authenticators="basic"
--http_framework_authenticators="basic" --initialize_driver_logging="true" --log_auto_initialize="true"
--logbufsecs="0" --logging_level="INFO" --max_agent_ping_timeouts="5" --max_completed_frameworks="50"
--max_completed_tasks_per_framework="1000" --max_unreachable_tasks_per_framework="1000" --port="5050"
--quiet="false" --recovery_agent_removal_limit="100%" --registry="in_memory" --registry_fetch_timeout="1mins"
--registry_gc_interval="15mins" --registry_max_agent_age="2weeks" --registry_max_agent_count="102400"
--registry_store_timeout="100secs" --registry_strict="false" --root_submissions="true" --user_sorter="drf"
--version="false" --webui_dir="/usr/local/share/mesos/webui" --work_dir="/tmp/Y9TrLh/master"
--zk_session_timeout="10secs"
3: I1114 01:38:01.066591 18276 master.cpp:499] Master only allowing authenticated frameworks
to register
3: I1114 01:38:01.066596 18276 master.cpp:505] Master only allowing authenticated agents to
register
3: I1114 01:38:01.066601 18276 master.cpp:511] Master only allowing authenticated HTTP frameworks
to register
3: I1114 01:38:01.066604 18276 credentials.hpp:37] Loading credentials for authentication
from '/tmp/Y9TrLh/credentials'
3: I1114 01:38:01.066903 18276 master.cpp:555] Using default 'crammd5' authenticator
3: I1114 01:38:01.067034 18276 http.cpp:1045] Creating default 'basic' HTTP authenticator
for realm 'mesos-master-readonly'
3: I1114 01:38:01.067190 18276 http.cpp:1045] Creating default 'basic' HTTP authenticator
for realm 'mesos-master-readwrite'
3: I1114 01:38:01.067314 18276 http.cpp:1045] Creating default 'basic' HTTP authenticator
for realm 'mesos-master-scheduler'
3: I1114 01:38:01.067409 18276 master.cpp:634] Authorization enabled
3: I1114 01:38:01.067553 18284 hierarchical.cpp:171] Initialized hierarchical allocator process
3: I1114 01:38:01.067574 18275 whitelist_watcher.cpp:77] No whitelist given
3: I1114 01:38:01.070149 18287 master.cpp:2213] Elected as the leading master!
3: I1114 01:38:01.070165 18287 master.cpp:1693] Recovering from registrar
3: I1114 01:38:01.070269 18268 registrar.cpp:347] Recovering registrar
3: I1114 01:38:01.070859 18268 registrar.cpp:391] Successfully fetched the registry (0B) in
560896ns
3: I1114 01:38:01.071007 18268 registrar.cpp:495] Applied 1 operations in 41329ns; attempting
to update the registry
3: I1114 01:38:01.071521 18268 registrar.cpp:552] Successfully updated the registry in 461056ns
3: I1114 01:38:01.071617 18268 registrar.cpp:424] Successfully recovered registrar
3: I1114 01:38:01.071923 18286 master.cpp:1806] Recovered 0 agents from the registry (129B);
allowing 10mins for agents to re-register
3: I1114 01:38:01.071985 18288 hierarchical.cpp:209] Skipping recovery of hierarchical allocator:
nothing to recover
3: W1114 01:38:01.076634 18265 process.cpp:3178] Attempted to spawn already running process
files@172.17.0.4:42218
3: I1114 01:38:01.077483 18265 containerizer.cpp:301] Using isolation { environment_secret,
posix/cpu, posix/mem, filesystem/posix, network/cni }
3: W1114 01:38:01.077975 18265 backend.cpp:76] Failed to create 'aufs' backend: AufsBackend
requires root privileges
3: W1114 01:38:01.078091 18265 backend.cpp:76] Failed to create 'bind' backend: BindBackend
requires root privileges
3: I1114 01:38:01.078124 18265 provisioner.cpp:255] Using default backend 'copy'
3: I1114 01:38:01.079885 18265 cluster.cpp:448] Creating default 'local' authorizer
3: I1114 01:38:01.081717 18288 slave.cpp:262] Mesos agent started on (751)@172.17.0.4:42218
3: I1114 01:38:01.081753 18288 slave.cpp:263] Flags at startup: --acls="" --agent_features="capabilities
{
3:   type: MULTI_ROLE
3: }
3: capabilities {
3:   type: HIERARCHICAL_ROLE
3: }
3: capabilities {
3:   type: RESERVATION_REFINEMENT
3: }
3: capabilities {
3:   type: RESOURCE_PROVIDER
3: }
3: " --appc_simple_discovery_uri_prefix="http://" --appc_store_dir="/tmp/ContentType_ResourceProviderManagerHttpApiTest_ConvertResources_0_IUPqcU/store/appc"
--authenticate_http_executors="true" --authenticate_http_readonly="true" --authenticate_http_readwrite="false"
--authenticatee="crammd5" --authentication_backoff_factor="1secs" --authorizer="local" --cgroups_cpu_enable_pids_and_tids_count="false"
--cgroups_enable_cfs="false" --cgroups_hierarchy="/sys/fs/cgroup" --cgroups_limit_swap="false"
--cgroups_root="mesos" --container_disk_watch_interval="15secs" --containerizers="mesos" --credential="/tmp/ContentType_ResourceProviderManagerHttpApiTest_ConvertResources_0_IUPqcU/credential"
--default_role="*" --disallow_sharing_agent_pid_namespace="false" --disk_watch_interval="1mins"
--docker="docker" --docker_kill_orphans="true" --docker_registry="https://registry-1.docker.io"
--docker_remove_delay="6hrs" --docker_socket="/var/run/docker.sock" --docker_stop_timeout="0ns"
--docker_store_dir="/tmp/ContentType_ResourceProviderManagerHttpApiTest_ConvertResources_0_IUPqcU/store/docker"
--docker_volume_checkpoint_dir="/var/run/mesos/isolators/docker/volume" --enforce_container_disk_quota="false"
--executor_registration_timeout="1mins" --executor_reregistration_timeout="2secs" --executor_secret_key="/tmp/ContentType_ResourceProviderManagerHttpApiTest_ConvertResources_0_IUPqcU/executor_secret_key"
--executor_shutdown_grace_period="5secs" --fetcher_cache_dir="/tmp/ContentType_ResourceProviderManagerHttpApiTest_ConvertResources_0_IUPqcU/fetch"
--fetcher_cache_size="2GB" --frameworks_home="" --gc_delay="1weeks" --gc_disk_headroom="0.1"
--hadoop_home="" --help="false" --hostname_lookup="true" --http_command_executor="false" --http_credentials="/tmp/ContentType_ResourceProviderManagerHttpApiTest_ConvertResources_0_IUPqcU/http_credentials"
--http_heartbeat_interval="30secs" --initialize_driver_logging="true" --isolation="posix/cpu,posix/mem"
--launcher="posix" --launcher_dir="/mesos/build/src" --logbufsecs="0" --logging_level="INFO"
--max_completed_executors_per_framework="150" --oversubscribed_resources_interval="15secs"
--perf_duration="10secs" --perf_interval="1mins" --port="5051" --qos_correction_interval_min="0ns"
--quiet="false" --recover="reconnect" --recovery_timeout="15mins" --registration_backoff_factor="10ms"
--resources="cpus:2;gpus:0;mem:1024;disk:1024;ports:[31000-32000]" --revocable_cpu_low_priority="true"
--runtime_dir="/tmp/ContentType_ResourceProviderManagerHttpApiTest_ConvertResources_0_IUPqcU"
--sandbox_directory="/mnt/mesos/sandbox" --strict="true" --switch_user="true" --systemd_enable_support="true"
--systemd_runtime_directory="/run/systemd/system" --version="false" --work_dir="/tmp/ContentType_ResourceProviderManagerHttpApiTest_ConvertResources_0_pSMVYA"
--zk_session_timeout="10secs"
3: I1114 01:38:01.082270 18288 credentials.hpp:86] Loading credential for authentication from
'/tmp/ContentType_ResourceProviderManagerHttpApiTest_ConvertResources_0_IUPqcU/credential'
3: I1114 01:38:01.082433 18288 slave.cpp:295] Agent using credential for: test-principal
3: I1114 01:38:01.082453 18288 credentials.hpp:37] Loading credentials for authentication
from '/tmp/ContentType_ResourceProviderManagerHttpApiTest_ConvertResources_0_IUPqcU/http_credentials'
3: I1114 01:38:01.082734 18288 http.cpp:1045] Creating default 'basic' HTTP authenticator
for realm 'mesos-agent-executor'
3: I1114 01:38:01.082885 18288 http.cpp:1066] Creating default 'jwt' HTTP authenticator for
realm 'mesos-agent-executor'
3: I1114 01:38:01.083092 18288 http.cpp:1045] Creating default 'basic' HTTP authenticator
for realm 'mesos-agent-readonly'
3: I1114 01:38:01.083211 18288 http.cpp:1066] Creating default 'jwt' HTTP authenticator for
realm 'mesos-agent-readonly'
3: I1114 01:38:01.084640 18288 slave.cpp:593] Agent resources: [{"name":"cpus","scalar":{"value":2.0},"type":"SCALAR"},{"name":"mem","scalar":{"value":1024.0},"type":"SCALAR"},{"name":"disk","scalar":{"value":1024.0},"type":"SCALAR"},{"name":"ports","ranges":{"range":[{"begin":31000,"end":32000}]},"type":"RANGES"}]
3: I1114 01:38:01.084822 18288 slave.cpp:601] Agent attributes: [  ]
3: I1114 01:38:01.084831 18288 slave.cpp:610] Agent hostname: 146ee66cea76
3: I1114 01:38:01.084962 18279 status_update_manager.cpp:177] Pausing sending status updates
3: I1114 01:38:01.086391 18271 state.cpp:64] Recovering state from '/tmp/ContentType_ResourceProviderManagerHttpApiTest_ConvertResources_0_pSMVYA/meta'
3: I1114 01:38:01.086654 18286 status_update_manager.cpp:203] Recovering status update manager
3: I1114 01:38:01.086828 18278 containerizer.cpp:662] Recovering containerizer
3: I1114 01:38:01.088083 18270 provisioner.cpp:416] Provisioner recovery complete
3: I1114 01:38:01.088349 18279 slave.cpp:6432] Finished recovery
3: I1114 01:38:01.089072 18268 status_update_manager.cpp:177] Pausing sending status updates
3: I1114 01:38:01.089095 18279 slave.cpp:1007] New master detected at master@172.17.0.4:42218
3: I1114 01:38:01.089187 18279 slave.cpp:1042] Detecting new master
3: I1114 01:38:01.091413 18271 slave.cpp:1069] Authenticating with master master@172.17.0.4:42218
3: I1114 01:38:01.091482 18271 slave.cpp:1078] Using default CRAM-MD5 authenticatee
3: I1114 01:38:01.091719 18267 authenticatee.cpp:121] Creating new client SASL connection
3: I1114 01:38:01.092008 18272 master.cpp:8285] Authenticating slave(751)@172.17.0.4:42218
3: I1114 01:38:01.092108 18286 authenticator.cpp:414] Starting authentication session for
crammd5-authenticatee(1381)@172.17.0.4:42218
3: I1114 01:38:01.092386 18281 authenticator.cpp:98] Creating new server SASL connection
3: I1114 01:38:01.092625 18276 authenticatee.cpp:213] Received SASL authentication mechanisms:
CRAM-MD5
3: I1114 01:38:01.092653 18276 authenticatee.cpp:239] Attempting to authenticate with mechanism
'CRAM-MD5'
3: I1114 01:38:01.092753 18275 authenticator.cpp:204] Received SASL authentication start
3: I1114 01:38:01.092806 18275 authenticator.cpp:326] Authentication requires more steps
3: I1114 01:38:01.092903 18284 authenticatee.cpp:259] Received SASL authentication step
3: I1114 01:38:01.093014 18280 authenticator.cpp:232] Received SASL authentication step
3: I1114 01:38:01.093050 18280 auxprop.cpp:109] Request to lookup properties for user: 'test-principal'
realm: '146ee66cea76' server FQDN: '146ee66cea76' SASL_AUXPROP_VERIFY_AGAINST_HASH: false
SASL_AUXPROP_OVERRIDE: false SASL_AUXPROP_AUTHZID: false 
3: I1114 01:38:01.093066 18280 auxprop.cpp:181] Looking up auxiliary property '*userPassword'
3: I1114 01:38:01.093116 18280 auxprop.cpp:181] Looking up auxiliary property '*cmusaslsecretCRAM-MD5'
3: I1114 01:38:01.093137 18280 auxprop.cpp:109] Request to lookup properties for user: 'test-principal'
realm: '146ee66cea76' server FQDN: '146ee66cea76' SASL_AUXPROP_VERIFY_AGAINST_HASH: false
SASL_AUXPROP_OVERRIDE: false SASL_AUXPROP_AUTHZID: true 
3: I1114 01:38:01.093149 18280 auxprop.cpp:131] Skipping auxiliary property '*userPassword'
since SASL_AUXPROP_AUTHZID == true
3: I1114 01:38:01.093155 18280 auxprop.cpp:131] Skipping auxiliary property '*cmusaslsecretCRAM-MD5'
since SASL_AUXPROP_AUTHZID == true
3: I1114 01:38:01.093168 18280 authenticator.cpp:318] Authentication success
3: I1114 01:38:01.093240 18289 authenticatee.cpp:299] Authentication success
3: I1114 01:38:01.093364 18285 master.cpp:8315] Successfully authenticated principal 'test-principal'
at slave(751)@172.17.0.4:42218
3: I1114 01:38:01.093395 18283 authenticator.cpp:432] Authentication session cleanup for crammd5-authenticatee(1381)@172.17.0.4:42218
3: I1114 01:38:01.093508 18278 slave.cpp:1161] Successfully authenticated with master master@172.17.0.4:42218
3: I1114 01:38:01.093755 18278 slave.cpp:1682] Will retry registration in 19.502206ms if necessary
3: I1114 01:38:01.094063 18269 master.cpp:6032] Received register agent message from slave(751)@172.17.0.4:42218
(146ee66cea76)
3: I1114 01:38:01.094094 18269 master.cpp:3870] Authorizing agent with principal 'test-principal'
3: I1114 01:38:01.094584 18266 master.cpp:6092] Authorized registration of agent at slave(751)@172.17.0.4:42218
(146ee66cea76)
3: I1114 01:38:01.094689 18266 master.cpp:6185] Registering agent at slave(751)@172.17.0.4:42218
(146ee66cea76) with id 2258d378-4e87-49ff-bf59-557eb423861a-S0
3: I1114 01:38:01.095041 18282 registrar.cpp:495] Applied 1 operations in 76432ns; attempting
to update the registry
3: I1114 01:38:01.095656 18282 registrar.cpp:552] Successfully updated the registry in 545024ns
3: I1114 01:38:01.095841 18267 master.cpp:6232] Admitted agent 2258d378-4e87-49ff-bf59-557eb423861a-S0
at slave(751)@172.17.0.4:42218 (146ee66cea76)
3: I1114 01:38:01.096536 18286 slave.cpp:1207] Registered with master master@172.17.0.4:42218;
given agent ID 2258d378-4e87-49ff-bf59-557eb423861a-S0
3: I1114 01:38:01.096648 18275 status_update_manager.cpp:184] Resuming sending status updates
3: I1114 01:38:01.096403 18267 master.cpp:6263] Registered agent 2258d378-4e87-49ff-bf59-557eb423861a-S0
at slave(751)@172.17.0.4:42218 (146ee66cea76) with [{"name":"cpus","scalar":{"value":2.0},"type":"SCALAR"},{"name":"mem","scalar":{"value":1024.0},"type":"SCALAR"},{"name":"disk","scalar":{"value":1024.0},"type":"SCALAR"},{"name":"ports","ranges":{"range":[{"begin":31000,"end":32000}]},"type":"RANGES"}]
3: I1114 01:38:01.096906 18281 hierarchical.cpp:593] Added agent 2258d378-4e87-49ff-bf59-557eb423861a-S0
(146ee66cea76) with cpus:2; mem:1024; disk:1024; ports:[31000-32000] (allocated: {})
3: I1114 01:38:01.096940 18286 slave.cpp:1227] Checkpointing SlaveInfo to '/tmp/ContentType_ResourceProviderManagerHttpApiTest_ConvertResources_0_pSMVYA/meta/slaves/2258d378-4e87-49ff-bf59-557eb423861a-S0/slave.info'
3: I1114 01:38:01.097280 18281 hierarchical.cpp:1450] Performed allocation for 1 agents in
187312ns
3: I1114 01:38:01.097405 18286 slave.cpp:1285] Forwarding total resources cpus:2; mem:1024;
disk:1024; ports:[31000-32000]
3: I1114 01:38:01.097458 18286 slave.cpp:1295] Forwarding total oversubscribed resources {}
3: I1114 01:38:01.098091 18284 master.cpp:7051] Received update of agent 2258d378-4e87-49ff-bf59-557eb423861a-S0
at slave(751)@172.17.0.4:42218 (146ee66cea76) with total resources cpus:2; mem:1024; disk:1024;
ports:[31000-32000]
3: I1114 01:38:01.098155 18284 master.cpp:7064] Received update of agent 2258d378-4e87-49ff-bf59-557eb423861a-S0
at slave(751)@172.17.0.4:42218 (146ee66cea76) with total oversubscribed resources {}
3: I1114 01:38:01.098347 18284 master.cpp:7082] Ignoring update on agent 2258d378-4e87-49ff-bf59-557eb423861a-S0
at slave(751)@172.17.0.4:42218 (146ee66cea76) as it reports no changes
3: I1114 01:38:01.098448 18273 http_connection.hpp:221] New endpoint detected at http://172.17.0.4:42218/slave(751)/api/v1/resource_provider
3: I1114 01:38:01.100054 18279 http_connection.hpp:277] Connected with the remote endpoint
at http://172.17.0.4:42218/slave(751)/api/v1/resource_provider
3: I1114 01:38:01.100814 18286 http_connection.hpp:129] Sending 1 call to http://172.17.0.4:42218/slave(751)/api/v1/resource_provider
3: I1114 01:38:01.101624 18270 process.cpp:3925] Handling HTTP event for process 'slave(751)'
with path: '/slave(751)/api/v1/resource_provider'
3: I1114 01:38:01.102689 18266 http.cpp:1185] HTTP POST for /slave(751)/api/v1/resource_provider
from 172.17.0.4:35598
3: I1114 01:38:01.103005 18268 manager.cpp:381] Subscribing resource provider {"name":"test","type":"org.apache.mesos.rp.test"}
3: I1114 01:38:01.105355 18278 http_connection.hpp:129] Sending 3 call to http://172.17.0.4:42218/slave(751)/api/v1/resource_provider
3: I1114 01:38:01.106308 18281 process.cpp:3925] Handling HTTP event for process 'slave(751)'
with path: '/slave(751)/api/v1/resource_provider'
3: I1114 01:38:01.107276 18280 http.cpp:1185] HTTP POST for /slave(751)/api/v1/resource_provider
from 172.17.0.4:35600
3: I1114 01:38:01.107718 18286 slave.cpp:6719] Handling resource provider message 'UPDATE_TOTAL_RESOURCES:
34e42b99-270a-41a0-9913-777d4b2c5c4e disk[RAW]:200'
3: I1114 01:38:01.107841 18286 slave.cpp:6764] Forwarding new total resources cpus:2; mem:1024;
disk:1024; ports:[31000-32000]; disk[RAW]:200
3: I1114 01:38:01.108685 18274 master.cpp:7051] Received update of agent 2258d378-4e87-49ff-bf59-557eb423861a-S0
at slave(751)@172.17.0.4:42218 (146ee66cea76) with total resources cpus:2; mem:1024; disk:1024;
ports:[31000-32000]; disk[RAW]:200
3: I1114 01:38:01.110018 18265 scheduler.cpp:190] Version: 1.5.0
3: I1114 01:38:01.110327 18288 scheduler.cpp:313] Using default 'basic' HTTP authenticatee
3: I1114 01:38:01.110407 18273 hierarchical.cpp:660] Agent 2258d378-4e87-49ff-bf59-557eb423861a-S0
(146ee66cea76) updated with total resources cpus:2; mem:1024; disk:1024; ports:[31000-32000];
disk[RAW]:200
3: I1114 01:38:01.110759 18272 scheduler.cpp:496] New master detected at master@172.17.0.4:42218
3: I1114 01:38:01.110762 18273 hierarchical.cpp:1450] Performed allocation for 1 agents in
163717ns
3: I1114 01:38:01.110783 18272 scheduler.cpp:505] Waiting for 0ns before initiating a re-(connection)
attempt with the master
3: I1114 01:38:01.112200 18289 scheduler.cpp:387] Connected with the master at http://172.17.0.4:42218/master/api/v1/scheduler
3: I1114 01:38:01.113152 18268 scheduler.cpp:249] Sending SUBSCRIBE call to http://172.17.0.4:42218/master/api/v1/scheduler
3: I1114 01:38:01.114055 18271 process.cpp:3925] Handling HTTP event for process 'master'
with path: '/master/api/v1/scheduler'
3: I1114 01:38:01.115059 18283 http.cpp:1185] HTTP POST for /master/api/v1/scheduler from
172.17.0.4:35602
3: I1114 01:38:01.115291 18283 master.cpp:2613] Received subscription request for HTTP framework
'default'
3: I1114 01:38:01.115334 18283 master.cpp:2278] Authorizing framework principal 'test-principal'
to receive offers for roles '{ * }'
3: I1114 01:38:01.115797 18277 master.cpp:2748] Subscribing framework 'default' with checkpointing
disabled and capabilities [ RESERVATION_REFINEMENT ]
3: I1114 01:38:01.116519 18274 hierarchical.cpp:303] Added framework 2258d378-4e87-49ff-bf59-557eb423861a-0000
3: I1114 01:38:01.117022 18271 scheduler.cpp:741] Enqueuing event SUBSCRIBED received from
http://172.17.0.4:42218/master/api/v1/scheduler
3: I1114 01:38:01.117378 18271 scheduler.cpp:741] Enqueuing event HEARTBEAT received from
http://172.17.0.4:42218/master/api/v1/scheduler
3: I1114 01:38:01.117868 18274 hierarchical.cpp:1450] Performed allocation for 1 agents in
1.219819ms
3: I1114 01:38:01.118403 18281 master.cpp:8115] Sending 1 offers to framework 2258d378-4e87-49ff-bf59-557eb423861a-0000
(default)
3: I1114 01:38:01.120007 18266 scheduler.cpp:741] Enqueuing event OFFERS received from http://172.17.0.4:42218/master/api/v1/scheduler
3: I1114 01:38:01.121301 18289 scheduler.cpp:249] Sending ACCEPT call to http://172.17.0.4:42218/master/api/v1/scheduler
3: I1114 01:38:01.122547 18288 process.cpp:3925] Handling HTTP event for process 'master'
with path: '/master/api/v1/scheduler'
3: I1114 01:38:01.123473 18279 http.cpp:1185] HTTP POST for /master/api/v1/scheduler from
172.17.0.4:35604
3: I1114 01:38:01.124495 18279 master.cpp:10017] Removing offer 2258d378-4e87-49ff-bf59-557eb423861a-O0
3: I1114 01:38:01.124598 18279 master.cpp:4228] Processing ACCEPT call for offers: [ 2258d378-4e87-49ff-bf59-557eb423861a-O0
] on agent 2258d378-4e87-49ff-bf59-557eb423861a-S0 at slave(751)@172.17.0.4:42218 (146ee66cea76)
for framework 2258d378-4e87-49ff-bf59-557eb423861a-0000 (default)
3: I1114 01:38:01.125241 18279 master.cpp:5293] Processing CREATE_BLOCK operation with source
disk(allocated: *)[RAW]:200 from framework 2258d378-4e87-49ff-bf59-557eb423861a-0000 (default)
to agent 2258d378-4e87-49ff-bf59-557eb423861a-S0 at slave(751)@172.17.0.4:42218 (146ee66cea76)
3: I1114 01:38:01.125807 18279 master.cpp:9900] Sending offer operation Í«Ï·¦ôMف$[]:ä¨
to agent 2258d378-4e87-49ff-bf59-557eb423861a-S0 at slave(751)@172.17.0.4:42218 (146ee66cea76)
3: I1114 01:38:01.126850 18287 hierarchical.cpp:1125] Recovered cpus(allocated: *):2; mem(allocated:
*):1024; disk(allocated: *):1024; ports(allocated: *):[31000-32000] (total: cpus:2; mem:1024;
disk:1024; ports:[31000-32000]; disk[RAW]:200, allocated: disk(allocated: *)[RAW]:200) on
agent 2258d378-4e87-49ff-bf59-557eb423861a-S0 from framework 2258d378-4e87-49ff-bf59-557eb423861a-0000
3: I1114 01:38:01.126938 18287 hierarchical.cpp:1171] Framework 2258d378-4e87-49ff-bf59-557eb423861a-0000
filtered agent 2258d378-4e87-49ff-bf59-557eb423861a-S0 for 5secs
3: I1114 01:38:01.128521 18288 http_connection.hpp:129] Sending 2 call to http://172.17.0.4:42218/slave(751)/api/v1/resource_provider
3: I1114 01:38:01.129139 18284 process.cpp:3925] Handling HTTP event for process 'slave(751)'
with path: '/slave(751)/api/v1/resource_provider'
3: I1114 01:38:01.168615 18279 http.cpp:1185] HTTP POST for /slave(751)/api/v1/resource_provider
from 172.17.0.4:35600
3: I1114 01:38:01.169548 18267 slave.cpp:6719] Handling resource provider message 'UPDATE_OFFER_OPERATION_STATUS:
{"framework_id":{"value":"2258d378-4e87-49ff-bf59-557eb423861a-0000"},"status":{"state":"OFFER_OPERATION_FINISHED","converted_resources":[{"provider_id":{"value":"34e42b99-270a-41a0-9913-777d4b2c5c4e"},"name":"disk","type":"SCALAR","scalar":{"value":200.0},"allocation_info":{"role":"*"},"disk":{"source":{"type":"BLOCK"}}}]},"latest_status":{"state":"OFFER_OPERATION_FINISHED","converted_resources":[{"provider_id":{"value":"34e42b99-270a-41a0-9913-777d4b2c5c4e"},"name":"disk","type":"SCALAR","scalar":{"value":200.0},"allocation_info":{"role":"*"},"disk":{"source":{"type":"BLOCK"}}}]},"operation_uuid":"zavPt6b0TdmBJFtdOuSoEA=="}'
3: I1114 01:38:01.169911 18267 slave.cpp:6893] Updating the state of offer operation '' (uuid:
Í«Ï·¦ôMف$[]:ä¨) of framework 2258d378-4e87-49ff-bf59-557eb423861a-0000 (latest
state: OFFER_OPERATION_FINISHED, status update state: OFFER_OPERATION_FINISHED)
3: I1114 01:38:01.170297 18267 slave.cpp:6817] Forwarding status update of offer operation
'' (uuid: cdabcfb7-a6f4-4dd9-8124-5b5d3ae4a810) for framework 2258d378-4e87-49ff-bf59-557eb423861a-0000
3: I1114 01:38:01.170882 18270 master.cpp:9698] Updating the state of offer operation '' (uuid:
cdabcfb7-a6f4-4dd9-8124-5b5d3ae4a810) of framework 2258d378-4e87-49ff-bf59-557eb423861a-0000
(latest state: OFFER_OPERATION_FINISHED, status update state: OFFER_OPERATION_FINISHED)
3: F1114 01:38:01.171216 18270 master.cpp:11027] CHECK_SOME(resources): cpus:2; mem:1024;
disk:1024; ports:[31000-32000]; disk[RAW]:200 does not contain disk(allocated: *)[RAW]:200

3: *** Check failure stack trace: ***
3:     @     0x2add7320ea53  google::LogMessage::SendToLog()
3:     @     0x2add7320eecf  google::LogMessage::Flush()
3:     @     0x2add7321295d  google::LogMessageFatal::~LogMessageFatal()
3: I1114 01:38:01.172716 18285 hierarchical.cpp:849] Updated allocation of framework 2258d378-4e87-49ff-bf59-557eb423861a-0000
on agent 2258d378-4e87-49ff-bf59-557eb423861a-S0 from disk(allocated: *)[RAW]:200 to disk(allocated:
*)[BLOCK]:200
3: I1114 01:38:01.173086 18285 hierarchical.cpp:1125] Recovered disk(allocated: *)[BLOCK]:200
(total: cpus:2; mem:1024; disk:1024; ports:[31000-32000]; disk[BLOCK]:200, allocated: {})
on agent 2258d378-4e87-49ff-bf59-557eb423861a-S0 from framework 2258d378-4e87-49ff-bf59-557eb423861a-0000
3:     @           0xaa32b7  _CheckFatal::~_CheckFatal()
3: I1114 01:38:01.182101 18278 hierarchical.cpp:1450] Performed allocation for 1 agents in
1.40907ms
3:     @     0x2add6ff1a77b  mesos::internal::master::Slave::apply()
3:     @     0x2add6ff10014  mesos::internal::master::Master::updateOfferOperation()
3:     @     0x2add6fec104d  mesos::internal::master::Master::offerOperationStatusUpdate()
3:     @     0x2add70031d74  ProtobufProcess<>::_handlerM<>()
3:     @     0x2add7003285c  _ZNSt5_BindIFPFvPN5mesos8internal6master6MasterEMS3_FvRKNS1_26OfferOperationStatusUpdateEERKN7process4UPIDERKSsES4_S9_St12_PlaceholderILi1EESI_ILi2EEEE6__callIvJSD_SF_EJLm0ELm1ELm2ELm3EEEET_OSt5tupleIJDpT0_EESt12_Index_tupleIJXspT1_EEE
3:     @     0x2add70032753  _ZNSt5_BindIFPFvPN5mesos8internal6master6MasterEMS3_FvRKNS1_26OfferOperationStatusUpdateEERKN7process4UPIDERKSsES4_S9_St12_PlaceholderILi1EESI_ILi2EEEEclIJSD_SF_EvEET0_DpOT_
3:     @     0x2add700324d7  std::_Function_handler<>::_M_invoke()
3:     @           0xcedb00  std::function<>::operator()()
3:     @     0x2add6ff37786  ProtobufProcess<>::visit()
3:     @     0x2add6feceee5  mesos::internal::master::Master::_visit()
3:     @     0x2add6fece504  mesos::internal::master::Master::visit()
3:     @     0x2add6fecf0f7  mesos::internal::master::Master::visit()
3:     @     0x2add70010e7e  process::MessageEvent::visit()
3:     @           0xaead01  process::ProcessBase::serve()
3:     @     0x2add72740772  process::ProcessManager::resume()
3:     @     0x2add72750801  process::ProcessManager::init_threads()::$_9::operator()()
3:     @     0x2add72750745  _ZNSt12_Bind_simpleIFZN7process14ProcessManager12init_threadsEvE3$_9vEE9_M_invokeIJEEEvSt12_Index_tupleIJXspT_EEE
3:     @     0x2add72750715  std::_Bind_simple<>::operator()()
3:     @     0x2add727506ec  std::thread::_Impl<>::_M_run()
3:     @     0x2add77166a60  (unknown)
3:     @     0x2add7343b184  start_thread
3:     @     0x2add779d2ffd  (unknown)
3/3 Test #3: MesosTests .......................***Exception: Other293.46 sec

67% tests passed, 1 tests failed out of 3

Total Test time (real) = 329.79 sec

The following tests FAILED:
	  3 - MesosTests (OTHER_FAULT)
Errors while running CTest
make[3]: Leaving directory `/mesos/build'
make[3]: *** [CMakeFiles/check] Error 8
make[2]: Leaving directory `/mesos/build'
make[2]: *** [CMakeFiles/check.dir/all] Error 2
make[1]: Leaving directory `/mesos/build'
make[1]: *** [CMakeFiles/check.dir/rule] Error 2
make: *** [check] Error 2
+ docker rmi mesos-1510621675-10365
Untagged: mesos-1510621675-10365:latest
Deleted: sha256:0fc27debaeab30d7692550f957ce7f20d35fa4fff4b2cb97d890c778c283313b
Deleted: sha256:ab0d6ef39f7a8ede6d29f94b2b8827987562088f24fd667707c6c6ab15ca384b
Deleted: sha256:7408316734af348fa7850da8231cd39ba0b1ec81f8c760557fd03835a0a600c2
Deleted: sha256:3533b7ccce091de81c028b2be3ebdcffb20d50069a1df5bec7518e85af61b645
Deleted: sha256:6a1786c3d5b6059cd950a277d2d047cc3702855be1bc83de3e0b3debbe0440d4
Deleted: sha256:c065b9d9910a7b529eb9da32585e7915793e2d06ebcbc6192631830c6eb30ff0
Deleted: sha256:624b93fd17f488727e5b9ef6c91e290e352d66b654554ad0d37a43e181968682
Deleted: sha256:04290ea251d6da09ac916c316eb53ae80966217d9117aedefa1f042896251626
Deleted: sha256:945aeff80f764b6ded60124ad7d6b800a0ce8a16ef92d884d688b427a3d8bd18
Deleted: sha256:08625439a5410fdbddbd5ceed7e2fd5547a0ac952b7e3bbeb872c376e083c5de
Deleted: sha256:f5c53d5f1819c9d0a1041b83430367fb84444c870bef289b78cab5e276983a71
Deleted: sha256:d014ccc0a28bb5dd5727a19bd9d14037543566a78a039b0bd69e3851fce582c3
Deleted: sha256:60e65c6538fd42b9b9b5b1b1f190c28f9319c42dd94cf1440b7893b7dcd48742
Deleted: sha256:d1e0183d980e9b331a63a4ac171a35829dc9570ee61b25d005b8126859f92de1
Deleted: sha256:0c24391acf078bb43793ef0d4033d31bf26ec8cf57d05dd78d04834d5adf15ea
Deleted: sha256:f7cff153b09a8f7d7ca54270301205554f52e66b9441ceea888a1af93fcf55b2
Deleted: sha256:cb025ad1f6ad581e827f95ffe1321184f112c3ed2e7812009b15f80b1ccf574f
Deleted: sha256:c2ecf4414c500dcbbf32bfe993075c113ae082fefff790bfd2f79f46c8f7efcb
Deleted: sha256:671c893f35c44e6468140c741fcf895bc96e9d4e92d740d4f335e08940b22311
Deleted: sha256:b215f33ccb06b7e96d03000b1b8a8c2488918441b3a7c730b05bd353a43dc343
Deleted: sha256:572ebabe350a06fb1d9397e1e8b71a20af9c99e45dbf33b59e35aec29e0a62e9
Deleted: sha256:3db847f9f016b2d916ed8ad1dd09ebd940cc7ece3d33c390e0cee144f612f221
Deleted: sha256:139bfb2b0121ed0aa9c046c2afef5ef881842a4531c118750c6fe720d6e219ff
Deleted: sha256:d0594c51f4507096e8867c913f12f797e5315e82c5f6df55d0ccf5b86213cf60
Deleted: sha256:06fe14ce3791deae5386cb81e0a00cd3d6e02f50f1aab959592103ff0d0356f5
Deleted: sha256:3174c75415124bbe3676378d808c4928f848cd4731e453e42f0597524f5e444f
Deleted: sha256:0573f8f3b114bd2ddf61b3ed17f45336be6a4a1f1f321ae1fc810854585a461f
Deleted: sha256:1f3d7ac745c837862adb803527aaa36ec0067b0b1bc8b2243b561e935990e9ed
Deleted: sha256:977aee11d640de705e152823f0c84bd7f739f06e5c3a1b0f73d31dcff4f4bc15
Deleted: sha256:91df8953de44efbc5baf2f03494a79a42b97c2eb2268e20086d6226bff23a7ff
Build step 'Execute shell' marked build as failure
Not sending mail to unregistered user songzihao1990@gmail.com
Not sending mail to unregistered user yujie.jay@gmail.com

Mime
View raw message