mesos-builds mailing list archives

Site index · List index
Message view « Date » · « Thread »
Top « Date » · « Thread »
From Alex R <al...@apache.org>
Subject Re: Build failed in Jenkins: Mesos-Buildbot » autotools,gcc,--verbose --disable-libtool-wrappers,GLOG_v=1 MESOS_VERBOSE=1,centos:7,(ubuntu)&&(!ubuntu-us1)&&(!ubuntu-eu2)&&(!qnode3)&&(!H23) #4357
Date Tue, 24 Oct 2017 17:18:56 GMT
Just checked: it was not. Closed MESOS-7440.

On 24 October 2017 at 08:23, Andrei Budnik <abudnik@mesosphere.io> wrote:

> Was this patch back-ported to 1.4.1?
>
> On Tue, Oct 24, 2017 at 5:12 PM, Alex R <alexr@apache.org> wrote:
>
>> These were supposed to be fixed with by https://github.com/apache/m
>> esos/commit/d863620e5cb82b7f22cade0da0a0d18afbdf9136
>> I'll have a look.
>>
>> On 23 October 2017 at 13:57, Benjamin Mahler <bmahler@apache.org> wrote:
>>
>>> Is anyone digging into these? I see no activity on
>>> https://issues.apache.org/jira/browse/MESOS-7440.
>>>
>>> On Sun, Oct 22, 2017 at 10:40 PM, Apache Jenkins Server <
>>> jenkins@builds.apache.org> wrote:
>>>
>>>> See <https://builds.apache.org/job/Mesos-Buildbot/BUILDTOOL=auto
>>>> tools,COMPILER=gcc,CONFIGURATION=--verbose%20--disable-libto
>>>> ol-wrappers,ENVIRONMENT=GLOG_v=1%20MESOS_VERBOSE=1,OS=centos
>>>> %3A7,label_exp=(ubuntu)&&(!ubuntu-us1)&&(!ubuntu-eu2)&&(!qno
>>>> de3)&&(!H23)/4357/display/redirect>
>>>>
>>>> ------------------------------------------
>>>> [...truncated 30.86 MB...]
>>>> I1023 05:40:26.778672 6168 http.cpp:1045] Creating default 'basic'
>>>> HTTP authenticator for realm 'mesos-agent-readonly'
>>>> I1023 05:40:26.778993  6168 http.cpp:1045] Creating default 'basic'
>>>> HTTP authenticator for realm 'mesos-agent-readwrite'
>>>> I1023 05:40:26.781251  6168 slave.cpp:565] Agent resources:
>>>> [{"name":"cpus","scalar":{"value":2.0},"type":"SCALAR"},{"na
>>>> me":"mem","scalar":{"value":1024.0},"type":"SCALAR"},{"name"
>>>> :"disk","scalar":{"value":1024.0},"type":"SCALAR"},{"name":"
>>>> ports","ranges":{"range":[{"begin":31000,"end":32000}]},"typ
>>>> e":"RANGES"}]
>>>> I1023 05:40:26.781694  6168 slave.cpp:573] Agent attributes: [  ]
>>>> I1023 05:40:26.781718  6168 slave.cpp:582] Agent hostname: 7462a85b6824
>>>> I1023 05:40:26.781955  6163 status_update_manager.cpp:177] Pausing
>>>> sending status updates
>>>> I1023 05:40:26.784184  6162 state.cpp:64] Recovering state from
>>>> '/tmp/Endpoint_SlaveEndpointTest_AuthorizedRequest_2_74RDmQ/meta'
>>>> I1023 05:40:26.784605  6163 status_update_manager.cpp:203] Recovering
>>>> status update manager
>>>> I1023 05:40:26.784904  6164 containerizer.cpp:609] Recovering
>>>> containerizer
>>>> I1023 05:40:26.787271  6168 provisioner.cpp:416] Provisioner recovery
>>>> complete
>>>> I1023 05:40:26.787889  6164 slave.cpp:6295] Finished recovery
>>>> I1023 05:40:26.788600  6164 slave.cpp:6477] Querying resource estimator
>>>> for oversubscribable resources
>>>> I1023 05:40:26.789077  6166 slave.cpp:6491] Received oversubscribable
>>>> resources {} from the resource estimator
>>>> I1023 05:40:26.793305  6168 process.cpp:3938] Handling HTTP event for
>>>> process 'slave(796)' with path: '/slave(796)/containers'
>>>> I1023 05:40:26.795511  6162 http.cpp:1185] HTTP GET for
>>>> /slave(796)/containers from 172.17.0.3:53220
>>>> I1023 05:40:26.795629  6162 http.cpp:976] Authorizing principal
>>>> 'test-principal' to GET the '/containers' endpoint
>>>> I1023 05:40:26.801371  6165 slave.cpp:843] Agent terminating
>>>> [       OK ] Endpoint/SlaveEndpointTest.AuthorizedRequest/2 (48 ms)
>>>> [ RUN      ] Endpoint/SlaveEndpointTest.UnauthorizedRequest/0
>>>> I1023 05:40:26.819031  6143 containerizer.cpp:246] Using isolation:
>>>> posix/cpu,posix/mem,filesystem/posix,network/cni,environment_secret
>>>> W1023 05:40:26.819830  6143 backend.cpp:76] Failed to create 'overlay'
>>>> backend: OverlayBackend requires root privileges
>>>> W1023 05:40:26.820036  6143 backend.cpp:76] Failed to create 'bind'
>>>> backend: BindBackend requires root privileges
>>>> I1023 05:40:26.820083  6143 provisioner.cpp:255] Using default backend
>>>> 'copy'
>>>> I1023 05:40:26.825731  6163 slave.cpp:250] Mesos agent started on (797)@
>>>> 172.17.0.3:33485
>>>> I1023 05:40:26.825773 6163 slave.cpp:251] Flags at startup: --acls=""
>>>> --appc_simple_discovery_uri_prefix="http://"
>>>> --appc_store_dir="/tmp/Endpoint_SlaveEndpointTest_UnauthorizedRequest_0_wurBF9/store/appc"
>>>> --authenticate_http_readonly="true" --authenticate_http_readwrite="true"
>>>> --authenticatee="crammd5" --authentication_backoff_factor="1secs"
>>>> --authorizer="local" --cgroups_cpu_enable_pids_and_tids_count="false"
>>>> --cgroups_enable_cfs="false" --cgroups_hierarchy="/sys/fs/cgroup"
>>>> --cgroups_limit_swap="false" --cgroups_root="mesos"
>>>> --container_disk_watch_interval="15secs" --containerizers="mesos"
>>>> --credential="/tmp/Endpoint_SlaveEndpointTest_UnauthorizedRequest_0_wurBF9/credential"
>>>> --default_role="*" --disallow_sharing_agent_pid_namespace="false"
>>>> --disk_watch_interval="1mins" --docker="docker"
>>>> --docker_kill_orphans="true" --docker_registry="https://reg
>>>> istry-1.docker.io" --docker_remove_delay="6hrs"
>>>> --docker_socket="/var/run/docker.sock" --docker_stop_timeout="0ns"
>>>> --docker_store_dir="/tmp/Endpoint_SlaveEndpointTest_Unauthor
>>>> izedRequest_0_wurBF9/store/docker" --docker_volume_checkpoint_dir
>>>> ="/var/run/mesos/isolators/docker/volume"
>>>> --enforce_container_disk_quota="false" --executor_registration_timeout="1mins"
>>>> --executor_reregistration_timeout="2secs"
>>>> --executor_shutdown_grace_period="5secs" --fetcher_cache_dir="/tmp/Endp
>>>> oint_SlaveEndpointTest_UnauthorizedRequest_0_wurBF9/fetch"
>>>> --fetcher_cache_size="2GB" --frameworks_home="" --gc_delay="1weeks"
>>>> --gc_disk_headroom="0.1" --hadoop_home="" --help="false"
>>>> --hostname_lookup="true" --http_command_executor="false"
>>>> --http_credentials="/tmp/Endpoint_SlaveEndpointTest_Unauthor
>>>> izedRequest_0_wurBF9/http_credentials" --http_heartbeat_interval="30secs"
>>>> --initialize_driver_logging="true" --isolation="posix/cpu,posix/mem"
>>>> --launcher="posix" --launcher_dir="/mesos/mesos-1.4.1/_build/src"
>>>> --logbufsecs="0" --logging_level="INFO" --max_completed_executors_per_framework="150"
>>>> --oversubscribed_resources_interval="15secs" --perf_duration="10secs"
>>>> --perf_interval="1mins" --port="5051" --qos_correction_interval_min="0ns"
>>>> --quiet="false" --recover="reconnect" --recovery_timeout="15mins"
>>>> --registration_backoff_factor="10ms" --resources="cpus:2;gpus:0;mem
>>>> :1024;disk:1024;ports:[31000-32000]" --revocable_cpu_low_priority="true"
>>>> --runtime_dir="/tmp/Endpoint_SlaveEndpointTest_UnauthorizedRequest_0_wurBF9"
>>>> --sandbox_directory="/mnt/mesos/sandbox" --strict="true"
>>>> --switch_user="true" --systemd_enable_support="true"
>>>> --systemd_runtime_directory="/run/systemd/system" --version="false"
>>>> --work_dir="/tmp/Endpoint_SlaveEndpointTest_UnauthorizedRequ
>>>> est_0_zVaizu"
>>>> I1023 05:40:26.826669  6163 credentials.hpp:86] Loading credential for
>>>> authentication from '/tmp/Endpoint_SlaveEndpointTe
>>>> st_UnauthorizedRequest_0_wurBF9/credential'
>>>> I1023 05:40:26.827118  6163 slave.cpp:283] Agent using credential for:
>>>> test-principal
>>>> I1023 05:40:26.827152  6163 credentials.hpp:37] Loading credentials for
>>>> authentication from '/tmp/Endpoint_SlaveEndpointTe
>>>> st_UnauthorizedRequest_0_wurBF9/http_credentials'
>>>> I1023 05:40:26.827716  6163 http.cpp:1045] Creating default 'basic'
>>>> HTTP authenticator for realm 'mesos-agent-readonly'
>>>> I1023 05:40:26.828151  6163 http.cpp:1045] Creating default 'basic'
>>>> HTTP authenticator for realm 'mesos-agent-readwrite'
>>>> I1023 05:40:26.830621  6163 slave.cpp:565] Agent resources:
>>>> [{"name":"cpus","scalar":{"value":2.0},"type":"SCALAR"},{"na
>>>> me":"mem","scalar":{"value":1024.0},"type":"SCALAR"},{"name"
>>>> :"disk","scalar":{"value":1024.0},"type":"SCALAR"},{"name":"
>>>> ports","ranges":{"range":[{"begin":31000,"end":32000}]},"typ
>>>> e":"RANGES"}]
>>>> I1023 05:40:26.831066  6163 slave.cpp:573] Agent attributes: [  ]
>>>> I1023 05:40:26.831089  6163 slave.cpp:582] Agent hostname: 7462a85b6824
>>>> I1023 05:40:26.831425  6169 status_update_manager.cpp:177] Pausing
>>>> sending status updates
>>>> I1023 05:40:26.833825  6163 state.cpp:64] Recovering state from
>>>> '/tmp/Endpoint_SlaveEndpointTest_UnauthorizedRequest_0_zVaizu/meta'
>>>> I1023 05:40:26.834261  6166 status_update_manager.cpp:203] Recovering
>>>> status update manager
>>>> I1023 05:40:26.834656  6165 containerizer.cpp:609] Recovering
>>>> containerizer
>>>> I1023 05:40:26.836877  6163 provisioner.cpp:416] Provisioner recovery
>>>> complete
>>>> I1023 05:40:26.837399  6168 slave.cpp:6295] Finished recovery
>>>> I1023 05:40:26.838057  6168 slave.cpp:6477] Querying resource estimator
>>>> for oversubscribable resources
>>>> I1023 05:40:26.838577  6162 slave.cpp:6491] Received oversubscribable
>>>> resources {} from the resource estimator
>>>> I1023 05:40:26.842967  6167 process.cpp:3938] Handling HTTP event for
>>>> process 'slave(797)' with path: '/slave(797)/monitor/statistics'
>>>> I1023 05:40:26.845044  6168 http.cpp:1185] HTTP GET for
>>>> /slave(797)/monitor/statistics from 172.17.0.3:53222
>>>> I1023 05:40:26.845162  6168 http.cpp:976] Authorizing principal
>>>> 'test-principal' to GET the '/monitor/statistics' endpoint
>>>> I1023 05:40:26.849460  6143 slave.cpp:843] Agent terminating
>>>> [       OK ] Endpoint/SlaveEndpointTest.UnauthorizedRequest/0 (51 ms)
>>>> [ RUN      ] Endpoint/SlaveEndpointTest.UnauthorizedRequest/1
>>>> I1023 05:40:26.870400  6143 containerizer.cpp:246] Using isolation:
>>>> posix/cpu,posix/mem,filesystem/posix,network/cni,environment_secret
>>>> W1023 05:40:26.871178  6143 backend.cpp:76] Failed to create 'overlay'
>>>> backend: OverlayBackend requires root privileges
>>>> W1023 05:40:26.871373  6143 backend.cpp:76] Failed to create 'bind'
>>>> backend: BindBackend requires root privileges
>>>> I1023 05:40:26.871415  6143 provisioner.cpp:255] Using default backend
>>>> 'copy'
>>>> I1023 05:40:26.877429  6163 slave.cpp:250] Mesos agent started on (798)@
>>>> 172.17.0.3:33485
>>>> I1023 05:40:26.877470 6163 slave.cpp:251] Flags at startup: --acls=""
>>>> --appc_simple_discovery_uri_prefix="http://"
>>>> --appc_store_dir="/tmp/Endpoint_SlaveEndpointTest_UnauthorizedRequest_1_EK47wO/store/appc"
>>>> --authenticate_http_readonly="true" --authenticate_http_readwrite="true"
>>>> --authenticatee="crammd5" --authentication_backoff_factor="1secs"
>>>> --authorizer="local" --cgroups_cpu_enable_pids_and_tids_count="false"
>>>> --cgroups_enable_cfs="false" --cgroups_hierarchy="/sys/fs/cgroup"
>>>> --cgroups_limit_swap="false" --cgroups_root="mesos"
>>>> --container_disk_watch_interval="15secs" --containerizers="mesos"
>>>> --credential="/tmp/Endpoint_SlaveEndpointTest_UnauthorizedRequest_1_EK47wO/credential"
>>>> --default_role="*" --disallow_sharing_agent_pid_namespace="false"
>>>> --disk_watch_interval="1mins" --docker="docker"
>>>> --docker_kill_orphans="true" --docker_registry="https://reg
>>>> istry-1.docker.io" --docker_remove_delay="6hrs"
>>>> --docker_socket="/var/run/docker.sock" --docker_stop_timeout="0ns"
>>>> --docker_store_dir="/tmp/Endpoint_SlaveEndpointTest_Unauthor
>>>> izedRequest_1_EK47wO/store/docker" --docker_volume_checkpoint_dir
>>>> ="/var/run/mesos/isolators/docker/volume"
>>>> --enforce_container_disk_quota="false" --executor_registration_timeout="1mins"
>>>> --executor_reregistration_timeout="2secs"
>>>> --executor_shutdown_grace_period="5secs" --fetcher_cache_dir="/tmp/Endp
>>>> oint_SlaveEndpointTest_UnauthorizedRequest_1_EK47wO/fetch"
>>>> --fetcher_cache_size="2GB" --frameworks_home="" --gc_delay="1weeks"
>>>> --gc_disk_headroom="0.1" --hadoop_home="" --help="false"
>>>> --hostname_lookup="true" --http_command_executor="false"
>>>> --http_credentials="/tmp/Endpoint_SlaveEndpointTest_Unauthor
>>>> izedRequest_1_EK47wO/http_credentials" --http_heartbeat_interval="30secs"
>>>> --initialize_driver_logging="true" --isolation="posix/cpu,posix/mem"
>>>> --launcher="posix" --launcher_dir="/mesos/mesos-1.4.1/_build/src"
>>>> --logbufsecs="0" --logging_level="INFO" --max_completed_executors_per_framework="150"
>>>> --oversubscribed_resources_interval="15secs" --perf_duration="10secs"
>>>> --perf_interval="1mins" --port="5051" --qos_correction_interval_min="0ns"
>>>> --quiet="false" --recover="reconnect" --recovery_timeout="15mins"
>>>> --registration_backoff_factor="10ms" --resources="cpus:2;gpus:0;mem
>>>> :1024;disk:1024;ports:[31000-32000]" --revocable_cpu_low_priority="true"
>>>> --runtime_dir="/tmp/Endpoint_SlaveEndpointTest_UnauthorizedRequest_1_EK47wO"
>>>> --sandbox_directory="/mnt/mesos/sandbox" --strict="true"
>>>> --switch_user="true" --systemd_enable_support="true"
>>>> --systemd_runtime_directory="/run/systemd/system" --version="false"
>>>> --work_dir="/tmp/Endpoint_SlaveEndpointTest_UnauthorizedRequ
>>>> est_1_lgYti9"
>>>> I1023 05:40:26.878623  6163 credentials.hpp:86] Loading credential for
>>>> authentication from '/tmp/Endpoint_SlaveEndpointTe
>>>> st_UnauthorizedRequest_1_EK47wO/credential'
>>>> I1023 05:40:26.878939  6163 slave.cpp:283] Agent using credential for:
>>>> test-principal
>>>> I1023 05:40:26.878985  6163 credentials.hpp:37] Loading credentials for
>>>> authentication from '/tmp/Endpoint_SlaveEndpointTe
>>>> st_UnauthorizedRequest_1_EK47wO/http_credentials'
>>>> I1023 05:40:26.880869  6163 http.cpp:1045] Creating default 'basic'
>>>> HTTP authenticator for realm 'mesos-agent-readonly'
>>>> I1023 05:40:26.881358  6163 http.cpp:1045] Creating default 'basic'
>>>> HTTP authenticator for realm 'mesos-agent-readwrite'
>>>> I1023 05:40:26.883869  6163 slave.cpp:565] Agent resources:
>>>> [{"name":"cpus","scalar":{"value":2.0},"type":"SCALAR"},{"na
>>>> me":"mem","scalar":{"value":1024.0},"type":"SCALAR"},{"name"
>>>> :"disk","scalar":{"value":1024.0},"type":"SCALAR"},{"name":"
>>>> ports","ranges":{"range":[{"begin":31000,"end":32000}]},"typ
>>>> e":"RANGES"}]
>>>> I1023 05:40:26.884316  6163 slave.cpp:573] Agent attributes: [  ]
>>>> I1023 05:40:26.884338  6163 slave.cpp:582] Agent hostname: 7462a85b6824
>>>> I1023 05:40:26.884557  6166 status_update_manager.cpp:177] Pausing
>>>> sending status updates
>>>> I1023 05:40:26.887290  6165 state.cpp:64] Recovering state from
>>>> '/tmp/Endpoint_SlaveEndpointTest_UnauthorizedRequest_1_lgYti9/meta'
>>>> I1023 05:40:26.887760  6165 status_update_manager.cpp:203] Recovering
>>>> status update manager
>>>> I1023 05:40:26.888047  6162 containerizer.cpp:609] Recovering
>>>> containerizer
>>>> I1023 05:40:26.890261  6169 provisioner.cpp:416] Provisioner recovery
>>>> complete
>>>> I1023 05:40:26.890750  6164 slave.cpp:6295] Finished recovery
>>>> I1023 05:40:26.891355  6164 slave.cpp:6477] Querying resource estimator
>>>> for oversubscribable resources
>>>> I1023 05:40:26.891762  6162 slave.cpp:6491] Received oversubscribable
>>>> resources {} from the resource estimator
>>>> I1023 05:40:26.896399  6164 process.cpp:3938] Handling HTTP event for
>>>> process 'slave(798)' with path: '/slave(798)/monitor/statistics.json'
>>>> I1023 05:40:26.898491  6165 http.cpp:1185] HTTP GET for
>>>> /slave(798)/monitor/statistics.json from 172.17.0.3:53224
>>>> I1023 05:40:26.898617  6165 http.cpp:976] Authorizing principal
>>>> 'test-principal' to GET the '/monitor/statistics.json' endpoint
>>>> I1023 05:40:26.902390  6162 slave.cpp:843] Agent terminating
>>>> [       OK ] Endpoint/SlaveEndpointTest.UnauthorizedRequest/1 (49 ms)
>>>> [ RUN      ] Endpoint/SlaveEndpointTest.UnauthorizedRequest/2
>>>> I1023 05:40:26.920462  6143 containerizer.cpp:246] Using isolation:
>>>> posix/cpu,posix/mem,filesystem/posix,network/cni,environment_secret
>>>> W1023 05:40:26.921293  6143 backend.cpp:76] Failed to create 'overlay'
>>>> backend: OverlayBackend requires root privileges
>>>> W1023 05:40:26.921514  6143 backend.cpp:76] Failed to create 'bind'
>>>> backend: BindBackend requires root privileges
>>>> I1023 05:40:26.921558  6143 provisioner.cpp:255] Using default backend
>>>> 'copy'
>>>> I1023 05:40:26.928385  6165 slave.cpp:250] Mesos agent started on (799)@
>>>> 172.17.0.3:33485
>>>> I1023 05:40:26.928431 6165 slave.cpp:251] Flags at startup: --acls=""
>>>> --appc_simple_discovery_uri_prefix="http://"
>>>> --appc_store_dir="/tmp/Endpoint_SlaveEndpointTest_UnauthorizedRequest_2_ON6CVt/store/appc"
>>>> --authenticate_http_readonly="true" --authenticate_http_readwrite="true"
>>>> --authenticatee="crammd5" --authentication_backoff_factor="1secs"
>>>> --authorizer="local" --cgroups_cpu_enable_pids_and_tids_count="false"
>>>> --cgroups_enable_cfs="false" --cgroups_hierarchy="/sys/fs/cgroup"
>>>> --cgroups_limit_swap="false" --cgroups_root="mesos"
>>>> --container_disk_watch_interval="15secs" --containerizers="mesos"
>>>> --credential="/tmp/Endpoint_SlaveEndpointTest_UnauthorizedRequest_2_ON6CVt/credential"
>>>> --default_role="*" --disallow_sharing_agent_pid_namespace="false"
>>>> --disk_watch_interval="1mins" --docker="docker"
>>>> --docker_kill_orphans="true" --docker_registry="https://reg
>>>> istry-1.docker.io" --docker_remove_delay="6hrs"
>>>> --docker_socket="/var/run/docker.sock" --docker_stop_timeout="0ns"
>>>> --docker_store_dir="/tmp/Endpoint_SlaveEndpointTest_Unauthor
>>>> izedRequest_2_ON6CVt/store/docker" --docker_volume_checkpoint_dir
>>>> ="/var/run/mesos/isolators/docker/volume"
>>>> --enforce_container_disk_quota="false" --executor_registration_timeout="1mins"
>>>> --executor_reregistration_timeout="2secs"
>>>> --executor_shutdown_grace_period="5secs" --fetcher_cache_dir="/tmp/Endp
>>>> oint_SlaveEndpointTest_UnauthorizedRequest_2_ON6CVt/fetch"
>>>> --fetcher_cache_size="2GB" --frameworks_home="" --gc_delay="1weeks"
>>>> --gc_disk_headroom="0.1" --hadoop_home="" --help="false"
>>>> --hostname_lookup="true" --http_command_executor="false"
>>>> --http_credentials="/tmp/Endpoint_SlaveEndpointTest_Unauthor
>>>> izedRequest_2_ON6CVt/http_credentials" --http_heartbeat_interval="30secs"
>>>> --initialize_driver_logging="true" --isolation="posix/cpu,posix/mem"
>>>> --launcher="posix" --launcher_dir="/mesos/mesos-1.4.1/_build/src"
>>>> --logbufsecs="0" --logging_level="INFO" --max_completed_executors_per_framework="150"
>>>> --oversubscribed_resources_interval="15secs" --perf_duration="10secs"
>>>> --perf_interval="1mins" --port="5051" --qos_correction_interval_min="0ns"
>>>> --quiet="false" --recover="reconnect" --recovery_timeout="15mins"
>>>> --registration_backoff_factor="10ms" --resources="cpus:2;gpus:0;mem
>>>> :1024;disk:1024;ports:[31000-32000]" --revocable_cpu_low_priority="true"
>>>> --runtime_dir="/tmp/Endpoint_SlaveEndpointTest_UnauthorizedRequest_2_ON6CVt"
>>>> --sandbox_directory="/mnt/mesos/sandbox" --strict="true"
>>>> --switch_user="true" --systemd_enable_support="true"
>>>> --systemd_runtime_directory="/run/systemd/system" --version="false"
>>>> --work_dir="/tmp/Endpoint_SlaveEndpointTest_UnauthorizedRequ
>>>> est_2_jl8RyO"
>>>> I1023 05:40:26.929175  6165 credentials.hpp:86] Loading credential for
>>>> authentication from '/tmp/Endpoint_SlaveEndpointTe
>>>> st_UnauthorizedRequest_2_ON6CVt/credential'
>>>> I1023 05:40:26.929436  6165 slave.cpp:283] Agent using credential for:
>>>> test-principal
>>>> I1023 05:40:26.929462  6165 credentials.hpp:37] Loading credentials for
>>>> authentication from '/tmp/Endpoint_SlaveEndpointTe
>>>> st_UnauthorizedRequest_2_ON6CVt/http_credentials'
>>>> I1023 05:40:26.929850  6165 http.cpp:1045] Creating default 'basic'
>>>> HTTP authenticator for realm 'mesos-agent-readonly'
>>>> I1023 05:40:26.930119  6165 http.cpp:1045] Creating default 'basic'
>>>> HTTP authenticator for realm 'mesos-agent-readwrite'
>>>> I1023 05:40:26.932322  6165 slave.cpp:565] Agent resources:
>>>> [{"name":"cpus","scalar":{"value":2.0},"type":"SCALAR"},{"na
>>>> me":"mem","scalar":{"value":1024.0},"type":"SCALAR"},{"name"
>>>> :"disk","scalar":{"value":1024.0},"type":"SCALAR"},{"name":"
>>>> ports","ranges":{"range":[{"begin":31000,"end":32000}]},"typ
>>>> e":"RANGES"}]
>>>> I1023 05:40:26.932761  6165 slave.cpp:573] Agent attributes: [  ]
>>>> I1023 05:40:26.932782  6165 slave.cpp:582] Agent hostname: 7462a85b6824
>>>> I1023 05:40:26.933002  6168 status_update_manager.cpp:177] Pausing
>>>> sending status updates
>>>> I1023 05:40:26.935184  6167 state.cpp:64] Recovering state from
>>>> '/tmp/Endpoint_SlaveEndpointTest_UnauthorizedRequest_2_jl8RyO/meta'
>>>> I1023 05:40:26.936004  6168 status_update_manager.cpp:203] Recovering
>>>> status update manager
>>>> I1023 05:40:26.936328  6165 containerizer.cpp:609] Recovering
>>>> containerizer
>>>> I1023 05:40:26.938797  6162 provisioner.cpp:416] Provisioner recovery
>>>> complete
>>>> I1023 05:40:26.939556  6163 slave.cpp:6295] Finished recovery
>>>> I1023 05:40:26.940384  6163 slave.cpp:6477] Querying resource estimator
>>>> for oversubscribable resources
>>>> I1023 05:40:26.940814  6163 slave.cpp:6491] Received oversubscribable
>>>> resources {} from the resource estimator
>>>> I1023 05:40:26.944768  6164 process.cpp:3938] Handling HTTP event for
>>>> process 'slave(799)' with path: '/slave(799)/containers'
>>>> I1023 05:40:26.946840  6167 http.cpp:1185] HTTP GET for
>>>> /slave(799)/containers from 172.17.0.3:53226
>>>> I1023 05:40:26.946970  6167 http.cpp:976] Authorizing principal
>>>> 'test-principal' to GET the '/containers' endpoint
>>>> I1023 05:40:26.950239  6163 slave.cpp:843] Agent terminating
>>>> [       OK ] Endpoint/SlaveEndpointTest.UnauthorizedRequest/2 (52 ms)
>>>> [ RUN      ] Endpoint/SlaveEndpointTest.NoAuthorizer/0
>>>> I1023 05:40:26.973546  6143 containerizer.cpp:246] Using isolation:
>>>> posix/cpu,posix/mem,filesystem/posix,network/cni,environment_secret
>>>> W1023 05:40:26.974350  6143 backend.cpp:76] Failed to create 'overlay'
>>>> backend: OverlayBackend requires root privileges
>>>> W1023 05:40:26.974566  6143 backend.cpp:76] Failed to create 'bind'
>>>> backend: BindBackend requires root privileges
>>>> I1023 05:40:26.974614  6143 provisioner.cpp:255] Using default backend
>>>> 'copy'
>>>> I1023 05:40:26.977272  6143 cluster.cpp:448] Creating default 'local'
>>>> authorizer
>>>> I1023 05:40:26.980442  6167 slave.cpp:250] Mesos agent started on (800)@
>>>> 172.17.0.3:33485
>>>> I1023 05:40:26.980485 6167 slave.cpp:251] Flags at startup: --acls=""
>>>> --appc_simple_discovery_uri_prefix="http://"
>>>> --appc_store_dir="/tmp/Endpoint_SlaveEndpointTest_NoAuthorizer_0_yx5ER9/store/appc"
>>>> --authenticate_http_readonly="true" --authenticate_http_readwrite="true"
>>>> --authenticatee="crammd5" --authentication_backoff_factor="1secs"
>>>> --authorizer="local" --cgroups_cpu_enable_pids_and_tids_count="false"
>>>> --cgroups_enable_cfs="false" --cgroups_hierarchy="/sys/fs/cgroup"
>>>> --cgroups_limit_swap="false" --cgroups_root="mesos"
>>>> --container_disk_watch_interval="15secs" --containerizers="mesos"
>>>> --credential="/tmp/Endpoint_SlaveEndpointTest_NoAuthorizer_0_yx5ER9/credential"
>>>> --default_role="*" --disallow_sharing_agent_pid_namespace="false"
>>>> --disk_watch_interval="1mins" --docker="docker"
>>>> --docker_kill_orphans="true" --docker_registry="https://reg
>>>> istry-1.docker.io" --docker_remove_delay="6hrs"
>>>> --docker_socket="/var/run/docker.sock" --docker_stop_timeout="0ns"
>>>> --docker_store_dir="/tmp/Endpoint_SlaveEndpointTest_NoAuthorizer_0_yx5ER9/store/docker"
>>>> --docker_volume_checkpoint_dir="/var/run/mesos/isolators/docker/volume"
>>>> --enforce_container_disk_quota="false" --executor_registration_timeout="1mins"
>>>> --executor_reregistration_timeout="2secs"
>>>> --executor_shutdown_grace_period="5secs" --fetcher_cache_dir="/tmp/Endp
>>>> oint_SlaveEndpointTest_NoAuthorizer_0_yx5ER9/fetch"
>>>> --fetcher_cache_size="2GB" --frameworks_home="" --gc_delay="1weeks"
>>>> --gc_disk_headroom="0.1" --hadoop_home="" --help="false"
>>>> --hostname_lookup="true" --http_command_executor="false"
>>>> --http_credentials="/tmp/Endpoint_SlaveEndpointTest_NoAuthor
>>>> izer_0_yx5ER9/http_credentials" --http_heartbeat_interval="30secs"
>>>> --initialize_driver_logging="true" --isolation="posix/cpu,posix/mem"
>>>> --launcher="posix" --launcher_dir="/mesos/mesos-1.4.1/_build/src"
>>>> --logbufsecs="0" --logging_level="INFO" --max_completed_executors_per_framework="150"
>>>> --oversubscribed_resources_interval="15secs" --perf_duration="10secs"
>>>> --perf_interval="1mins" --port="5051" --qos_correction_interval_min="0ns"
>>>> --quiet="false" --recover="reconnect" --recovery_timeout="15mins"
>>>> --registration_backoff_factor="10ms" --resources="cpus:2;gpus:0;mem
>>>> :1024;disk:1024;ports:[31000-32000]" --revocable_cpu_low_priority="true"
>>>> --runtime_dir="/tmp/Endpoint_SlaveEndpointTest_NoAuthorizer_0_yx5ER9"
>>>> --sandbox_directory="/mnt/mesos/sandbox" --strict="true"
>>>> --switch_user="true" --systemd_enable_support="true"
>>>> --systemd_runtime_directory="/run/systemd/system" --version="false"
>>>> --work_dir="/tmp/Endpoint_SlaveEndpointTest_NoAuthorizer_0_RQgnmu"
>>>> I1023 05:40:26.981242  6167 credentials.hpp:86] Loading credential for
>>>> authentication from '/tmp/Endpoint_SlaveEndpointTe
>>>> st_NoAuthorizer_0_yx5ER9/credential'
>>>> I1023 05:40:26.981521  6167 slave.cpp:283] Agent using credential for:
>>>> test-principal
>>>> I1023 05:40:26.981546  6167 credentials.hpp:37] Loading credentials for
>>>> authentication from '/tmp/Endpoint_SlaveEndpointTe
>>>> st_NoAuthorizer_0_yx5ER9/http_credentials'
>>>> I1023 05:40:26.981922  6167 http.cpp:1045] Creating default 'basic'
>>>> HTTP authenticator for realm 'mesos-agent-readonly'
>>>> I1023 05:40:26.982209  6167 http.cpp:1045] Creating default 'basic'
>>>> HTTP authenticator for realm 'mesos-agent-readwrite'
>>>> I1023 05:40:26.984434  6167 slave.cpp:565] Agent resources:
>>>> [{"name":"cpus","scalar":{"value":2.0},"type":"SCALAR"},{"na
>>>> me":"mem","scalar":{"value":1024.0},"type":"SCALAR"},{"name"
>>>> :"disk","scalar":{"value":1024.0},"type":"SCALAR"},{"name":"
>>>> ports","ranges":{"range":[{"begin":31000,"end":32000}]},"typ
>>>> e":"RANGES"}]
>>>> I1023 05:40:26.984874  6167 slave.cpp:573] Agent attributes: [  ]
>>>> I1023 05:40:26.984897  6167 slave.cpp:582] Agent hostname: 7462a85b6824
>>>> I1023 05:40:26.985131  6162 status_update_manager.cpp:177] Pausing
>>>> sending status updates
>>>> I1023 05:40:26.987217  6164 state.cpp:64] Recovering state from
>>>> '/tmp/Endpoint_SlaveEndpointTest_NoAuthorizer_0_RQgnmu/meta'
>>>> I1023 05:40:26.987884  6164 status_update_manager.cpp:203] Recovering
>>>> status update manager
>>>> I1023 05:40:26.988165  6166 containerizer.cpp:609] Recovering
>>>> containerizer
>>>> I1023 05:40:26.990679  6168 provisioner.cpp:416] Provisioner recovery
>>>> complete
>>>> I1023 05:40:26.991209  6165 slave.cpp:6295] Finished recovery
>>>> I1023 05:40:26.992070  6165 slave.cpp:6477] Querying resource estimator
>>>> for oversubscribable resources
>>>> I1023 05:40:26.992730  6167 slave.cpp:6491] Received oversubscribable
>>>> resources {} from the resource estimator
>>>> I1023 05:40:26.996987  6166 process.cpp:3938] Handling HTTP event for
>>>> process 'slave(800)' with path: '/slave(800)/monitor/statistics'
>>>> I1023 05:40:26.999444  6165 http.cpp:1185] HTTP GET for
>>>> /slave(800)/monitor/statistics from 172.17.0.3:53228
>>>> I1023 05:40:26.999835  6165 http.cpp:976] Authorizing principal
>>>> 'test-principal' to GET the '/monitor/statistics' endpoint
>>>> I1023 05:40:27.005466  6143 slave.cpp:843] Agent terminating
>>>> [       OK ] Endpoint/SlaveEndpointTest.NoAuthorizer/0 (50 ms)
>>>> [ RUN      ] Endpoint/SlaveEndpointTest.NoAuthorizer/1
>>>> I1023 05:40:27.023430  6143 containerizer.cpp:246] Using isolation:
>>>> posix/cpu,posix/mem,filesystem/posix,network/cni,environment_secret
>>>> W1023 05:40:27.024233  6143 backend.cpp:76] Failed to create 'overlay'
>>>> backend: OverlayBackend requires root privileges
>>>> W1023 05:40:27.024453  6143 backend.cpp:76] Failed to create 'bind'
>>>> backend: BindBackend requires root privileges
>>>> I1023 05:40:27.024502  6143 provisioner.cpp:255] Using default backend
>>>> 'copy'
>>>> I1023 05:40:27.027142  6143 cluster.cpp:448] Creating default 'local'
>>>> authorizer
>>>> I1023 05:40:27.031044  6169 slave.cpp:250] Mesos agent started on (801)@
>>>> 172.17.0.3:33485
>>>> I1023 05:40:27.031086  6169 slave.cpp:251] Flags at startup: --acls=""
>>>> --appc_simple_discovery_uri_prefix="http://"
>>>> --appc_store_dir="/tmp/Endpoint_SlaveEndpointTest_NoAuthorizer_1_81ofkQ/store/appc"
>>>> --authenticate_http_readonly="true" --authenticate_http_readwrite="true"
>>>> --authenticatee="crammd5" --authentication_backoff_factor="1secs"
>>>> --authorizer="local" --cgroups_cpu_enable_pids_and_tids_count="false"
>>>> --cgroups_enable_cfs="false" --cgroups_hierarchy="/sys/fs/cgroup"
>>>> --cgroups_limit_swap="false" --cgroups_root="mesos"
>>>> --container_disk_watch_interval="15secs" --containerizers="mesos"
>>>> --credential="/tmp/Endpoint_SlaveEndpointTest_NoAuthorizer_1_81ofkQ/credential"
>>>> --default_role="*" --disallow_sharing_agent_pid_namespace="false"
>>>> --disk_watch_interval="1mins" --docker="docker"
>>>> --docker_kill_orphans="true" --docker_registry="https://reg
>>>> istry-1.docker.io" --docker_remove_delay="6hrs"
>>>> --docker_socket="/var/run/docker.sock" --docker_stop_timeout="0ns"
>>>> --docker_store_dir="/tmp/Endpoint_SlaveEndpointTest_NoAuthorizer_1_81ofkQ/store/docker"
>>>> --docker_volume_checkpoint_dir="/var/run/mesos/isolators/docker/volume"
>>>> --enforce_container_disk_quota="false" --executor_registration_timeout="1mins"
>>>> --executor_reregistration_timeout="2secs"
>>>> --executor_shutdown_grace_period="5secs" --fetcher_cache_dir="/tmp/Endp
>>>> oint_SlaveEndpointTest_NoAuthorizer_1_81ofkQ/fetch"
>>>> --fetcher_cache_size="2GB" --frameworks_home="" --gc_delay="1weeks"
>>>> --gc_disk_headroom="0.1" --hadoop_home="" --help="false"
>>>> --hostname_lookup="true" --http_command_executor="false"
>>>> --http_credentials="/tmp/Endpoint_SlaveEndpointTest_NoAuthor
>>>> izer_1_81ofkQ/http_credentials" --http_heartbeat_interval="30secs"
>>>> --initialize_driver_logging="true" --isolation="posix/cpu,posix/mem"
>>>> --launcher="posix" --launcher_dir="/mesos/mesos-1.4.1/_build/src"
>>>> --logbufsecs="0" --logging_level="INFO" --max_completed_executors_per_framework="150"
>>>> --oversubscribed_resources_interval="15secs" --perf_duration="10secs"
>>>> --perf_interval="1mins" --port="5051" --qos_correction_interval_min="0ns"
>>>> --quiet="false" --recover="reconnect" --recovery_timeout="15mins"
>>>> --registration_backoff_factor="10ms" --resources="cpus:2;gpus:0;mem
>>>> :1024;disk:1024;ports:[31000-32000]" --revocable_cpu_low_priority="true"
>>>> --runtime_dir="/tmp/Endpoint_SlaveEndpointTest_NoAuthorizer_1_81ofkQ"
>>>> --sandbox_directory="/mnt/mesos/sandbox" --strict="true"
>>>> --switch_user="true" --systemd_enable_support="true"
>>>> --systemd_runtime_directory="/run/systemd/system" --version="false"
>>>> --work_dir="/tmp/Endpoint_SlaveEndpointTest_NoAuthorizer_1_fx5TGa"
>>>> I1023 05:40:27.031816  6169 credentials.hpp:86] Loading credential for
>>>> authentication from '/tmp/Endpoint_SlaveEndpointTe
>>>> st_NoAuthorizer_1_81ofkQ/credential'
>>>> I1023 05:40:27.032071  6169 slave.cpp:283] Agent using credential for:
>>>> test-principal
>>>> I1023 05:40:27.032099  6169 credentials.hpp:37] Loading credentials for
>>>> authentication from '/tmp/Endpoint_SlaveEndpointTe
>>>> st_NoAuthorizer_1_81ofkQ/http_credentials'
>>>> I1023 05:40:27.032474  6169 http.cpp:1045] Creating default 'basic'
>>>> HTTP authenticator for realm 'mesos-agent-readonly'
>>>> I1023 05:40:27.032758  6169 http.cpp:1045] Creating default 'basic'
>>>> HTTP authenticator for realm 'mesos-agent-readwrite'
>>>> I1023 05:40:27.035006  6169 slave.cpp:565] Agent resources:
>>>> [{"name":"cpus","scalar":{"value":2.0},"type":"SCALAR"},{"na
>>>> me":"mem","scalar":{"value":1024.0},"type":"SCALAR"},{"name"
>>>> :"disk","scalar":{"value":1024.0},"type":"SCALAR"},{"name":"
>>>> ports","ranges":{"range":[{"begin":31000,"end":32000}]},"typ
>>>> e":"RANGES"}]
>>>> I1023 05:40:27.035449  6169 slave.cpp:573] Agent attributes: [  ]
>>>> I1023 05:40:27.035471  6169 slave.cpp:582] Agent hostname: 7462a85b6824
>>>> I1023 05:40:27.035773  6164 status_update_manager.cpp:177] Pausing
>>>> sending status updates
>>>> I1023 05:40:27.037991  6169 state.cpp:64] Recovering state from
>>>> '/tmp/Endpoint_SlaveEndpointTest_NoAuthorizer_1_fx5TGa/meta'
>>>> I1023 05:40:27.038671  6166 status_update_manager.cpp:203] Recovering
>>>> status update manager
>>>> I1023 05:40:27.038998  6165 containerizer.cpp:609] Recovering
>>>> containerizer
>>>> I1023 05:40:27.041339  6168 provisioner.cpp:416] Provisioner recovery
>>>> complete
>>>> I1023 05:40:27.041827  6165 slave.cpp:6295] Finished recovery
>>>> I1023 05:40:27.042807  6165 slave.cpp:6477] Querying resource estimator
>>>> for oversubscribable resources
>>>> I1023 05:40:27.043251  6164 slave.cpp:6491] Received oversubscribable
>>>> resources {} from the resource estimator
>>>> I1023 05:40:27.047390  6168 process.cpp:3938] Handling HTTP event for
>>>> process 'slave(801)' with path: '/slave(801)/monitor/statistics.json'
>>>> I1023 05:40:27.049531  6165 http.cpp:1185] HTTP GET for
>>>> /slave(801)/monitor/statistics.json from 172.17.0.3:53230
>>>> I1023 05:40:27.049655  6165 http.cpp:976] Authorizing principal
>>>> 'test-principal' to GET the '/monitor/statistics.json' endpoint
>>>> I1023 05:40:27.055521  6143 slave.cpp:843] Agent terminating
>>>> [       OK ] Endpoint/SlaveEndpointTest.NoAuthorizer/1 (49 ms)
>>>> [ RUN      ] Endpoint/SlaveEndpointTest.NoAuthorizer/2
>>>> I1023 05:40:27.073215  6143 containerizer.cpp:246] Using isolation:
>>>> posix/cpu,posix/mem,filesystem/posix,network/cni,environment_secret
>>>> W1023 05:40:27.074026  6143 backend.cpp:76] Failed to create 'overlay'
>>>> backend: OverlayBackend requires root privileges
>>>> W1023 05:40:27.074239  6143 backend.cpp:76] Failed to create 'bind'
>>>> backend: BindBackend requires root privileges
>>>> I1023 05:40:27.074280  6143 provisioner.cpp:255] Using default backend
>>>> 'copy'
>>>> I1023 05:40:27.076905  6143 cluster.cpp:448] Creating default 'local'
>>>> authorizer
>>>> I1023 05:40:27.080049  6162 slave.cpp:250] Mesos agent started on (802)@
>>>> 172.17.0.3:33485
>>>> I1023 05:40:27.080091  6162 slave.cpp:251] Flags at startup: --acls=""
>>>> --appc_simple_discovery_uri_prefix="http://"
>>>> --appc_store_dir="/tmp/Endpoint_SlaveEndpointTest_NoAuthorizer_2_A64fjx/store/appc"
>>>> --authenticate_http_readonly="true" --authenticate_http_readwrite="true"
>>>> --authenticatee="crammd5" --authentication_backoff_factor="1secs"
>>>> --authorizer="local" --cgroups_cpu_enable_pids_and_tids_count="false"
>>>> --cgroups_enable_cfs="false" --cgroups_hierarchy="/sys/fs/cgroup"
>>>> --cgroups_limit_swap="false" --cgroups_root="mesos"
>>>> --container_disk_watch_interval="15secs" --containerizers="mesos"
>>>> --credential="/tmp/Endpoint_SlaveEndpointTest_NoAuthorizer_2_A64fjx/credential"
>>>> --default_role="*" --disallow_sharing_agent_pid_namespace="false"
>>>> --disk_watch_interval="1mins" --docker="docker"
>>>> --docker_kill_orphans="true" --docker_registry="https://reg
>>>> istry-1.docker.io" --docker_remove_delay="6hrs"
>>>> --docker_socket="/var/run/docker.sock" --docker_stop_timeout="0ns"
>>>> --docker_store_dir="/tmp/Endpoint_SlaveEndpointTest_NoAuthorizer_2_A64fjx/store/docker"
>>>> --docker_volume_checkpoint_dir="/var/run/mesos/isolators/docker/volume"
>>>> --enforce_container_disk_quota="false" --executor_registration_timeout="1mins"
>>>> --executor_reregistration_timeout="2secs"
>>>> --executor_shutdown_grace_period="5secs" --fetcher_cache_dir="/tmp/Endp
>>>> oint_SlaveEndpointTest_NoAuthorizer_2_A64fjx/fetch"
>>>> --fetcher_cache_size="2GB" --frameworks_home="" --gc_delay="1weeks"
>>>> --gc_disk_headroom="0.1" --hadoop_home="" --help="false"
>>>> --hostname_lookup="true" --http_command_executor="false"
>>>> --http_credentials="/tmp/Endpoint_SlaveEndpointTest_NoAuthor
>>>> izer_2_A64fjx/http_credentials" --http_heartbeat_interval="30secs"
>>>> --initialize_driver_logging="true" --isolation="posix/cpu,posix/mem"
>>>> --launcher="posix" --launcher_dir="/mesos/mesos-1.4.1/_build/src"
>>>> --logbufsecs="0" --logging_level="INFO" --max_completed_executors_per_framework="150"
>>>> --oversubscribed_resources_interval="15secs" --perf_duration="10secs"
>>>> --perf_interval="1mins" --port="5051" --qos_correction_interval_min="0ns"
>>>> --quiet="false" --recover="reconnect" --recovery_timeout="15mins"
>>>> --registration_backoff_factor="10ms" --resources="cpus:2;gpus:0;mem
>>>> :1024;disk:1024;ports:[31000-32000]" --revocable_cpu_low_priority="true"
>>>> --runtime_dir="/tmp/Endpoint_SlaveEndpointTest_NoAuthorizer_2_A64fjx"
>>>> --sandbox_directory="/mnt/mesos/sandbox" --strict="true"
>>>> --switch_user="true" --systemd_enable_support="true"
>>>> --systemd_runtime_directory="/run/systemd/system" --version="false"
>>>> --work_dir="/tmp/Endpoint_SlaveEndpointTest_NoAuthorizer_2_NOyQxR"
>>>> I1023 05:40:27.080914  6162 credentials.hpp:86] Loading credential for
>>>> authentication from '/tmp/Endpoint_SlaveEndpointTe
>>>> st_NoAuthorizer_2_A64fjx/credential'
>>>> I1023 05:40:27.081249  6162 slave.cpp:283] Agent using credential for:
>>>> test-principal
>>>> I1023 05:40:27.081276  6162 credentials.hpp:37] Loading credentials for
>>>> authentication from '/tmp/Endpoint_SlaveEndpointTe
>>>> st_NoAuthorizer_2_A64fjx/http_credentials'
>>>> I1023 05:40:27.081703  6162 http.cpp:1045] Creating default 'basic'
>>>> HTTP authenticator for realm 'mesos-agent-readonly'
>>>> I1023 05:40:27.082036  6162 http.cpp:1045] Creating default 'basic'
>>>> HTTP authenticator for realm 'mesos-agent-readwrite'
>>>> I1023 05:40:27.084321  6162 slave.cpp:565] Agent resources:
>>>> [{"name":"cpus","scalar":{"value":2.0},"type":"SCALAR"},{"na
>>>> me":"mem","scalar":{"value":1024.0},"type":"SCALAR"},{"name"
>>>> :"disk","scalar":{"value":1024.0},"type":"SCALAR"},{"name":"
>>>> ports","ranges":{"range":[{"begin":31000,"end":32000}]},"typ
>>>> e":"RANGES"}]
>>>> I1023 05:40:27.084764  6162 slave.cpp:573] Agent attributes: [  ]
>>>> I1023 05:40:27.084790  6162 slave.cpp:582] Agent hostname: 7462a85b6824
>>>> I1023 05:40:27.085041  6169 status_update_manager.cpp:177] Pausing
>>>> sending status updates
>>>> I1023 05:40:27.087270  6165 state.cpp:64] Recovering state from
>>>> '/tmp/Endpoint_SlaveEndpointTest_NoAuthorizer_2_NOyQxR/meta'
>>>> I1023 05:40:27.087783  6166 status_update_manager.cpp:203] Recovering
>>>> status update manager
>>>> I1023 05:40:27.088316  6163 containerizer.cpp:609] Recovering
>>>> containerizer
>>>> I1023 05:40:27.090533  6163 provisioner.cpp:416] Provisioner recovery
>>>> complete
>>>> I1023 05:40:27.091136  6163 slave.cpp:6295] Finished recovery
>>>> I1023 05:40:27.091814  6163 slave.cpp:6477] Querying resource estimator
>>>> for oversubscribable resources
>>>> I1023 05:40:27.092324  6164 slave.cpp:6491] Received oversubscribable
>>>> resources {} from the resource estimator
>>>> I1023 05:40:27.096385  6162 process.cpp:3938] Handling HTTP event for
>>>> process 'slave(802)' with path: '/slave(802)/containers'
>>>> I1023 05:40:27.098773  6166 http.cpp:1185] HTTP GET for
>>>> /slave(802)/containers from 172.17.0.3:53232
>>>> I1023 05:40:27.098901  6166 http.cpp:976] Authorizing principal
>>>> 'test-principal' to GET the '/containers' endpoint
>>>> I1023 05:40:27.104995  6143 slave.cpp:843] Agent terminating
>>>> [       OK ] Endpoint/SlaveEndpointTest.NoAuthorizer/2 (55 ms)
>>>> [----------] 9 tests from Endpoint/SlaveEndpointTest (456 ms total)
>>>>
>>>> [----------] 2 tests from ContainerizerType/DefaultContainerDNSFlagTest
>>>> [ RUN      ] ContainerizerType/DefaultConta
>>>> inerDNSFlagTest.ValidateFlag/0
>>>> [       OK ] ContainerizerType/DefaultContainerDNSFlagTest.ValidateFlag/0
>>>> (20 ms)
>>>> [ RUN      ] ContainerizerType/DefaultConta
>>>> inerDNSFlagTest.ValidateFlag/1
>>>> [       OK ] ContainerizerType/DefaultContainerDNSFlagTest.ValidateFlag/1
>>>> (22 ms)
>>>> [----------] 2 tests from ContainerizerType/DefaultContainerDNSFlagTest
>>>> (42 ms total)
>>>>
>>>> [----------] Global test environment tear-down
>>>> [==========] 1652 tests from 182 test cases ran. (774737 ms total)
>>>> [  PASSED  ] 1647 tests.
>>>> [  FAILED  ] 5 tests, listed below:
>>>> [  FAILED  ] CommandExecutorCheckTest.Comma
>>>> ndCheckDeliveredAndReconciled
>>>> [  FAILED  ] DefaultExecutorCheckTest.Comma
>>>> ndCheckDeliveredAndReconciled
>>>> [  FAILED  ] DefaultExecutorCheckTest.CommandCheckStatusChange
>>>> [  FAILED  ] DefaultExecutorCheckTest.CommandCheckSeesParentsEnv
>>>> [  FAILED  ] DefaultExecutorCheckTest.CommandCheckSharesWorkDirWithTask
>>>>
>>>>  5 FAILED TESTS
>>>>   YOU HAVE 20 DISABLED TESTS
>>>>
>>>> I1023 05:40:27.306797  6170 process.cpp:1068] Failed to accept socket:
>>>> future discarded
>>>> make[4]: *** [check-local] Error 1
>>>> make[4]: Leaving directory `/mesos/mesos-1.4.1/_build/src'
>>>> make[3]: *** [check-am] Error 2
>>>> make[3]: Leaving directory `/mesos/mesos-1.4.1/_build/src'
>>>> make[2]: *** [check] Error 2
>>>> make[2]: Leaving directory `/mesos/mesos-1.4.1/_build/src'
>>>> make[1]: *** [check-recursive] Error 1
>>>> make[1]: Leaving directory `/mesos/mesos-1.4.1/_build'
>>>> make: *** [distcheck] Error 1
>>>> + docker rmi mesos-1508732261-25974
>>>> Untagged: mesos-1508732261-25974:latest
>>>> Deleted: sha256:6801f42d64d69d2cae1103f6ed133ce6b81ee58ac99ee3b79717b
>>>> f69f8e94ffd
>>>> Deleted: sha256:97775dd2d554ce65043c70310a20f0c7f26b81993174372f25828
>>>> 35720c1b9b1
>>>> Deleted: sha256:ce57b3802cfb6d26878442aa44efa156e648e7f92b6c2e1907669
>>>> 6be495f3e80
>>>> Deleted: sha256:f861b9140176a75814acccb86a51f2fca3913fb366c73362bc14f
>>>> ba4b7c49880
>>>> Deleted: sha256:2771731687e7af57fff560d3a9804394d482ad8f65b50b1887427
>>>> 5f6c0dff490
>>>> Deleted: sha256:03f595add7020f5910119c52087cea287252ead0e6c6bd59b4d37
>>>> a10983f04f7
>>>> Deleted: sha256:b73c483bbc298dc48494fbe2bae6d5be948be948452849218dad3
>>>> 2b95c688a52
>>>> Deleted: sha256:870ccfa0e8fabc83c274e0be5501c6729ead7414652e7ff854f8c
>>>> c626cd20079
>>>> Deleted: sha256:533d28e02dc9beca6a44b28b893c84cf9f19272776fd2bf19b6ef
>>>> 1cfcfad8d65
>>>> Deleted: sha256:c5b251c2530b3b4ce208bc453003d9869aedc334ecf151e79e0a3
>>>> 65b7f4f7984
>>>> Deleted: sha256:9c33cb680248c31418a5027bf2b2ad33bb3fc700b0f894441e7c3
>>>> 27153b4df41
>>>> Deleted: sha256:4f0bfe5868a263d4b444983a46c565d5869c5b2b2b31307b63004
>>>> 126be7d2c99
>>>> Deleted: sha256:205ec95763be6fc10bd3dcf68c98bd12b5b924551f64b09b2305f
>>>> 425503a7a60
>>>> Deleted: sha256:0ed67484837790570d86b5721de84fbf6d0347491750f0612e9ed
>>>> 2afbd99df7d
>>>> Deleted: sha256:36c6b4efbb40ee059772988a7dfe8864eaed2c10741f7fe64ec78
>>>> 4f3559d1340
>>>> Deleted: sha256:26230159d60a47ef3413a83f2093d119ead1a5b2bc3264724c24f
>>>> 3f171472e53
>>>> Deleted: sha256:9295332c1c4a691edc493236e86829241446cfbb3f49547cb3bd7
>>>> fd9e0c03906
>>>> Deleted: sha256:b2bf490789e68eb27655b77be4497fd7dc44408c49b5090b5f13a
>>>> 23a0046f8ea
>>>> Deleted: sha256:10b43e395a4cc239b3c639f05687bbf18fa3f9c87ce45273530d2
>>>> e618b69b6f8
>>>> Deleted: sha256:ef0573142dce0de372ee10fb531c3e6d9727d1c8acd9ab0a21b59
>>>> 5023ff04856
>>>> Deleted: sha256:1c5c329a2c072e1aabf4fbde694f471d2877e43620853fe27d9d4
>>>> aedd91e9c3c
>>>> Deleted: sha256:8be5246f1564c1603e6e2b3d293059c02657ed1d7000fda935a3a
>>>> 56fa3c6dbe5
>>>> Deleted: sha256:9caa81b8832874b0aff94411e0760bc561dc27ae6bb4f6d9f0d29
>>>> be80eadc538
>>>> Deleted: sha256:0a74fb37732f549d6117ce888d16328500a2668ddc42a4a544216
>>>> bfbd4398610
>>>> Deleted: sha256:bb9d0123171547314be49495b89abf433ecde7a405390fb9d1cab
>>>> f263dc2a84f
>>>> Build step 'Execute shell' marked build as failure
>>>>
>>>>
>>>
>>
>

Mime
  • Unnamed multipart/alternative (inline, None, 0 bytes)
View raw message