mesos-builds mailing list archives

Site index · List index
Message view « Date » · « Thread »
Top « Date » · « Thread »
From Apache Jenkins Server <jenk...@builds.apache.org>
Subject Build failed in Jenkins: Mesos-Buildbot » autotools,gcc,--verbose --disable-libtool-wrappers,GLOG_v=1 MESOS_VERBOSE=1,ubuntu:14.04,(ubuntu)&&(!ubuntu-us1)&&(!ubuntu-eu2)&&(!qnode3)&&(!H23) #4383
Date Tue, 31 Oct 2017 12:15:48 GMT
See <https://builds.apache.org/job/Mesos-Buildbot/BUILDTOOL=autotools,COMPILER=gcc,CONFIGURATION=--verbose%20--disable-libtool-wrappers,ENVIRONMENT=GLOG_v=1%20MESOS_VERBOSE=1,OS=ubuntu%3A14.04,label_exp=(ubuntu)&&(!ubuntu-us1)&&(!ubuntu-eu2)&&(!qnode3)&&(!H23)/4383/display/redirect>

------------------------------------------
[...truncated 32.16 MB...]
I1031 12:15:33.193433  5304 http.cpp:976] Authorizing principal 'test-principal' to GET the
'/monitor/statistics.json' endpoint
I1031 12:15:33.199129  5300 slave.cpp:875] Agent terminating
[       OK ] Endpoint/SlaveEndpointTest.AuthorizedRequest/1 (60 ms)
[ RUN      ] Endpoint/SlaveEndpointTest.AuthorizedRequest/2
I1031 12:15:33.230435  5300 containerizer.cpp:301] Using isolation { environment_secret, posix/cpu,
posix/mem, filesystem/posix, network/cni }
W1031 12:15:33.231132  5300 backend.cpp:76] Failed to create 'aufs' backend: AufsBackend requires
root privileges
W1031 12:15:33.231480  5300 backend.cpp:76] Failed to create 'bind' backend: BindBackend requires
root privileges
I1031 12:15:33.231523  5300 provisioner.cpp:255] Using default backend 'copy'
I1031 12:15:33.236325  5307 slave.cpp:254] Mesos agent started on (823)@172.17.0.3:41552
I1031 12:15:33.236352  5307 slave.cpp:255] Flags at startup: --acls="" --appc_simple_discovery_uri_prefix="http://"
--appc_store_dir="/tmp/Endpoint_SlaveEndpointTest_AuthorizedRequest_2_gS4ADP/store/appc" --authenticate_http_readonly="true"
--authenticate_http_readwrite="true" --authenticatee="crammd5" --authentication_backoff_factor="1secs"
--authorizer="local" --cgroups_cpu_enable_pids_and_tids_count="false" --cgroups_enable_cfs="false"
--cgroups_hierarchy="/sys/fs/cgroup" --cgroups_limit_swap="false" --cgroups_root="mesos" --container_disk_watch_interval="15secs"
--containerizers="mesos" --credential="/tmp/Endpoint_SlaveEndpointTest_AuthorizedRequest_2_gS4ADP/credential"
--default_role="*" --disallow_sharing_agent_pid_namespace="false" --disk_watch_interval="1mins"
--docker="docker" --docker_kill_orphans="true" --docker_registry="https://registry-1.docker.io"
--docker_remove_delay="6hrs" --docker_socket="/var/run/docker.sock" --docker_stop_timeout="0ns"
--docker_store_dir="/tmp/Endpoint_SlaveEndpointTest_AuthorizedRequest_2_gS4ADP/store/docker"
--docker_volume_checkpoint_dir="/var/run/mesos/isolators/docker/volume" --enforce_container_disk_quota="false"
--executor_registration_timeout="1mins" --executor_reregistration_timeout="2secs" --executor_shutdown_grace_period="5secs"
--fetcher_cache_dir="/tmp/Endpoint_SlaveEndpointTest_AuthorizedRequest_2_gS4ADP/fetch" --fetcher_cache_size="2GB"
--frameworks_home="" --gc_delay="1weeks" --gc_disk_headroom="0.1" --hadoop_home="" --help="false"
--hostname_lookup="true" --http_command_executor="false" --http_credentials="/tmp/Endpoint_SlaveEndpointTest_AuthorizedRequest_2_gS4ADP/http_credentials"
--http_heartbeat_interval="30secs" --initialize_driver_logging="true" --isolation="posix/cpu,posix/mem"
--launcher="posix" --launcher_dir="/mesos/mesos-1.5.0/_build/src" --logbufsecs="0" --logging_level="INFO"
--max_completed_executors_per_framework="150" --oversubscribed_resources_interval="15secs"
--perf_duration="10secs" --perf_interval="1mins" --port="5051" --qos_correction_interval_min="0ns"
--quiet="false" --recover="reconnect" --recovery_timeout="15mins" --registration_backoff_factor="10ms"
--resources="cpus:2;gpus:0;mem:1024;disk:1024;ports:[31000-32000]" --revocable_cpu_low_priority="true"
--runtime_dir="/tmp/Endpoint_SlaveEndpointTest_AuthorizedRequest_2_gS4ADP" --sandbox_directory="/mnt/mesos/sandbox"
--strict="true" --switch_user="true" --systemd_enable_support="true" --systemd_runtime_directory="/run/systemd/system"
--version="false" --work_dir="/tmp/Endpoint_SlaveEndpointTest_AuthorizedRequest_2_FL9nSM"
--zk_session_timeout="10secs"
I1031 12:15:33.236798  5307 credentials.hpp:86] Loading credential for authentication from
'/tmp/Endpoint_SlaveEndpointTest_AuthorizedRequest_2_gS4ADP/credential'
I1031 12:15:33.237076  5307 slave.cpp:287] Agent using credential for: test-principal
I1031 12:15:33.237103  5307 credentials.hpp:37] Loading credentials for authentication from
'/tmp/Endpoint_SlaveEndpointTest_AuthorizedRequest_2_gS4ADP/http_credentials'
I1031 12:15:33.237442  5307 http.cpp:1045] Creating default 'basic' HTTP authenticator for
realm 'mesos-agent-readonly'
I1031 12:15:33.237746  5307 http.cpp:1045] Creating default 'basic' HTTP authenticator for
realm 'mesos-agent-readwrite'
I1031 12:15:33.239379  5307 slave.cpp:585] Agent resources: [{"name":"cpus","scalar":{"value":2.0},"type":"SCALAR"},{"name":"mem","scalar":{"value":1024.0},"type":"SCALAR"},{"name":"disk","scalar":{"value":1024.0},"type":"SCALAR"},{"name":"ports","ranges":{"range":[{"begin":31000,"end":32000}]},"type":"RANGES"}]
I1031 12:15:33.239576  5307 slave.cpp:593] Agent attributes: [  ]
I1031 12:15:33.239596  5307 slave.cpp:602] Agent hostname: edae2d3a6e8d
I1031 12:15:33.240023  5306 status_update_manager.cpp:177] Pausing sending status updates
I1031 12:15:33.241557  5302 state.cpp:64] Recovering state from '/tmp/Endpoint_SlaveEndpointTest_AuthorizedRequest_2_FL9nSM/meta'
I1031 12:15:33.242673  5302 status_update_manager.cpp:203] Recovering status update manager
I1031 12:15:33.243165  5302 containerizer.cpp:662] Recovering containerizer
I1031 12:15:33.245172  5306 provisioner.cpp:416] Provisioner recovery complete
I1031 12:15:33.245893  5306 slave.cpp:6340] Finished recovery
I1031 12:15:33.250844  5302 process.cpp:3938] Handling HTTP event for process 'slave(823)'
with path: '/slave(823)/containers'
I1031 12:15:33.252945  5301 http.cpp:1185] HTTP GET for /slave(823)/containers from 172.17.0.3:42970
I1031 12:15:33.253201  5301 http.cpp:976] Authorizing principal 'test-principal' to GET the
'/containers' endpoint
I1031 12:15:33.258469  5300 slave.cpp:875] Agent terminating
[       OK ] Endpoint/SlaveEndpointTest.AuthorizedRequest/2 (52 ms)
[ RUN      ] Endpoint/SlaveEndpointTest.UnauthorizedRequest/0
I1031 12:15:33.283416  5300 containerizer.cpp:301] Using isolation { environment_secret, posix/cpu,
posix/mem, filesystem/posix, network/cni }
W1031 12:15:33.284032  5300 backend.cpp:76] Failed to create 'aufs' backend: AufsBackend requires
root privileges
W1031 12:15:33.284242  5300 backend.cpp:76] Failed to create 'bind' backend: BindBackend requires
root privileges
I1031 12:15:33.284288  5300 provisioner.cpp:255] Using default backend 'copy'
I1031 12:15:33.290244  5303 slave.cpp:254] Mesos agent started on (824)@172.17.0.3:41552
I1031 12:15:33.290380  5303 slave.cpp:255] Flags at startup: --acls="" --appc_simple_discovery_uri_prefix="http://"
--appc_store_dir="/tmp/Endpoint_SlaveEndpointTest_UnauthorizedRequest_0_ZkLjb1/store/appc"
--authenticate_http_readonly="true" --authenticate_http_readwrite="true" --authenticatee="crammd5"
--authentication_backoff_factor="1secs" --authorizer="local" --cgroups_cpu_enable_pids_and_tids_count="false"
--cgroups_enable_cfs="false" --cgroups_hierarchy="/sys/fs/cgroup" --cgroups_limit_swap="false"
--cgroups_root="mesos" --container_disk_watch_interval="15secs" --containerizers="mesos" --credential="/tmp/Endpoint_SlaveEndpointTest_UnauthorizedRequest_0_ZkLjb1/credential"
--default_role="*" --disallow_sharing_agent_pid_namespace="false" --disk_watch_interval="1mins"
--docker="docker" --docker_kill_orphans="true" --docker_registry="https://registry-1.docker.io"
--docker_remove_delay="6hrs" --docker_socket="/var/run/docker.sock" --docker_stop_timeout="0ns"
--docker_store_dir="/tmp/Endpoint_SlaveEndpointTest_UnauthorizedRequest_0_ZkLjb1/store/docker"
--docker_volume_checkpoint_dir="/var/run/mesos/isolators/docker/volume" --enforce_container_disk_quota="false"
--executor_registration_timeout="1mins" --executor_reregistration_timeout="2secs" --executor_shutdown_grace_period="5secs"
--fetcher_cache_dir="/tmp/Endpoint_SlaveEndpointTest_UnauthorizedRequest_0_ZkLjb1/fetch" --fetcher_cache_size="2GB"
--frameworks_home="" --gc_delay="1weeks" --gc_disk_headroom="0.1" --hadoop_home="" --help="false"
--hostname_lookup="true" --http_command_executor="false" --http_credentials="/tmp/Endpoint_SlaveEndpointTest_UnauthorizedRequest_0_ZkLjb1/http_credentials"
--http_heartbeat_interval="30secs" --initialize_driver_logging="true" --isolation="posix/cpu,posix/mem"
--launcher="posix" --launcher_dir="/mesos/mesos-1.5.0/_build/src" --logbufsecs="0" --logging_level="INFO"
--max_completed_executors_per_framework="150" --oversubscribed_resources_interval="15secs"
--perf_duration="10secs" --perf_interval="1mins" --port="5051" --qos_correction_interval_min="0ns"
--quiet="false" --recover="reconnect" --recovery_timeout="15mins" --registration_backoff_factor="10ms"
--resources="cpus:2;gpus:0;mem:1024;disk:1024;ports:[31000-32000]" --revocable_cpu_low_priority="true"
--runtime_dir="/tmp/Endpoint_SlaveEndpointTest_UnauthorizedRequest_0_ZkLjb1" --sandbox_directory="/mnt/mesos/sandbox"
--strict="true" --switch_user="true" --systemd_enable_support="true" --systemd_runtime_directory="/run/systemd/system"
--version="false" --work_dir="/tmp/Endpoint_SlaveEndpointTest_UnauthorizedRequest_0_kWWNgY"
--zk_session_timeout="10secs"
I1031 12:15:33.291334  5303 credentials.hpp:86] Loading credential for authentication from
'/tmp/Endpoint_SlaveEndpointTest_UnauthorizedRequest_0_ZkLjb1/credential'
I1031 12:15:33.292013  5303 slave.cpp:287] Agent using credential for: test-principal
I1031 12:15:33.292052  5303 credentials.hpp:37] Loading credentials for authentication from
'/tmp/Endpoint_SlaveEndpointTest_UnauthorizedRequest_0_ZkLjb1/http_credentials'
I1031 12:15:33.292780  5303 http.cpp:1045] Creating default 'basic' HTTP authenticator for
realm 'mesos-agent-readonly'
I1031 12:15:33.293316  5303 http.cpp:1045] Creating default 'basic' HTTP authenticator for
realm 'mesos-agent-readwrite'
I1031 12:15:33.295945  5303 slave.cpp:585] Agent resources: [{"name":"cpus","scalar":{"value":2.0},"type":"SCALAR"},{"name":"mem","scalar":{"value":1024.0},"type":"SCALAR"},{"name":"disk","scalar":{"value":1024.0},"type":"SCALAR"},{"name":"ports","ranges":{"range":[{"begin":31000,"end":32000}]},"type":"RANGES"}]
I1031 12:15:33.296315  5303 slave.cpp:593] Agent attributes: [  ]
I1031 12:15:33.296504  5303 slave.cpp:602] Agent hostname: edae2d3a6e8d
I1031 12:15:33.297037  5308 status_update_manager.cpp:177] Pausing sending status updates
I1031 12:15:33.300644  5302 state.cpp:64] Recovering state from '/tmp/Endpoint_SlaveEndpointTest_UnauthorizedRequest_0_kWWNgY/meta'
I1031 12:15:33.313423  5305 status_update_manager.cpp:203] Recovering status update manager
I1031 12:15:33.314117  5306 containerizer.cpp:662] Recovering containerizer
I1031 12:15:33.316318  5308 provisioner.cpp:416] Provisioner recovery complete
I1031 12:15:33.317495  5308 slave.cpp:6340] Finished recovery
I1031 12:15:33.322463  5302 process.cpp:3938] Handling HTTP event for process 'slave(824)'
with path: '/slave(824)/monitor/statistics'
I1031 12:15:33.324858  5302 http.cpp:1185] HTTP GET for /slave(824)/monitor/statistics from
172.17.0.3:42972
I1031 12:15:33.325117  5302 http.cpp:976] Authorizing principal 'test-principal' to GET the
'/monitor/statistics' endpoint
I1031 12:15:33.330236  5300 slave.cpp:875] Agent terminating
[       OK ] Endpoint/SlaveEndpointTest.UnauthorizedRequest/0 (69 ms)
[ RUN      ] Endpoint/SlaveEndpointTest.UnauthorizedRequest/1
I1031 12:15:33.354202  5300 containerizer.cpp:301] Using isolation { environment_secret, posix/cpu,
posix/mem, filesystem/posix, network/cni }
W1031 12:15:33.354725  5300 backend.cpp:76] Failed to create 'aufs' backend: AufsBackend requires
root privileges
W1031 12:15:33.354892  5300 backend.cpp:76] Failed to create 'bind' backend: BindBackend requires
root privileges
I1031 12:15:33.354935  5300 provisioner.cpp:255] Using default backend 'copy'
I1031 12:15:33.359369  5301 slave.cpp:254] Mesos agent started on (825)@172.17.0.3:41552
I1031 12:15:33.359403  5301 slave.cpp:255] Flags at startup: --acls="" --appc_simple_discovery_uri_prefix="http://"
--appc_store_dir="/tmp/Endpoint_SlaveEndpointTest_UnauthorizedRequest_1_hN7Dwd/store/appc"
--authenticate_http_readonly="true" --authenticate_http_readwrite="true" --authenticatee="crammd5"
--authentication_backoff_factor="1secs" --authorizer="local" --cgroups_cpu_enable_pids_and_tids_count="false"
--cgroups_enable_cfs="false" --cgroups_hierarchy="/sys/fs/cgroup" --cgroups_limit_swap="false"
--cgroups_root="mesos" --container_disk_watch_interval="15secs" --containerizers="mesos" --credential="/tmp/Endpoint_SlaveEndpointTest_UnauthorizedRequest_1_hN7Dwd/credential"
--default_role="*" --disallow_sharing_agent_pid_namespace="false" --disk_watch_interval="1mins"
--docker="docker" --docker_kill_orphans="true" --docker_registry="https://registry-1.docker.io"
--docker_remove_delay="6hrs" --docker_socket="/var/run/docker.sock" --docker_stop_timeout="0ns"
--docker_store_dir="/tmp/Endpoint_SlaveEndpointTest_UnauthorizedRequest_1_hN7Dwd/store/docker"
--docker_volume_checkpoint_dir="/var/run/mesos/isolators/docker/volume" --enforce_container_disk_quota="false"
--executor_registration_timeout="1mins" --executor_reregistration_timeout="2secs" --executor_shutdown_grace_period="5secs"
--fetcher_cache_dir="/tmp/Endpoint_SlaveEndpointTest_UnauthorizedRequest_1_hN7Dwd/fetch" --fetcher_cache_size="2GB"
--frameworks_home="" --gc_delay="1weeks" --gc_disk_headroom="0.1" --hadoop_home="" --help="false"
--hostname_lookup="true" --http_command_executor="false" --http_credentials="/tmp/Endpoint_SlaveEndpointTest_UnauthorizedRequest_1_hN7Dwd/http_credentials"
--http_heartbeat_interval="30secs" --initialize_driver_logging="true" --isolation="posix/cpu,posix/mem"
--launcher="posix" --launcher_dir="/mesos/mesos-1.5.0/_build/src" --logbufsecs="0" --logging_level="INFO"
--max_completed_executors_per_framework="150" --oversubscribed_resources_interval="15secs"
--perf_duration="10secs" --perf_interval="1mins" --port="5051" --qos_correction_interval_min="0ns"
--quiet="false" --recover="reconnect" --recovery_timeout="15mins" --registration_backoff_factor="10ms"
--resources="cpus:2;gpus:0;mem:1024;disk:1024;ports:[31000-32000]" --revocable_cpu_low_priority="true"
--runtime_dir="/tmp/Endpoint_SlaveEndpointTest_UnauthorizedRequest_1_hN7Dwd" --sandbox_directory="/mnt/mesos/sandbox"
--strict="true" --switch_user="true" --systemd_enable_support="true" --systemd_runtime_directory="/run/systemd/system"
--version="false" --work_dir="/tmp/Endpoint_SlaveEndpointTest_UnauthorizedRequest_1_klsKpa"
--zk_session_timeout="10secs"
I1031 12:15:33.360213  5301 credentials.hpp:86] Loading credential for authentication from
'/tmp/Endpoint_SlaveEndpointTest_UnauthorizedRequest_1_hN7Dwd/credential'
I1031 12:15:33.360630  5301 slave.cpp:287] Agent using credential for: test-principal
I1031 12:15:33.360710  5301 credentials.hpp:37] Loading credentials for authentication from
'/tmp/Endpoint_SlaveEndpointTest_UnauthorizedRequest_1_hN7Dwd/http_credentials'
I1031 12:15:33.361256  5301 http.cpp:1045] Creating default 'basic' HTTP authenticator for
realm 'mesos-agent-readonly'
I1031 12:15:33.361637  5301 http.cpp:1045] Creating default 'basic' HTTP authenticator for
realm 'mesos-agent-readwrite'
I1031 12:15:33.363713  5301 slave.cpp:585] Agent resources: [{"name":"cpus","scalar":{"value":2.0},"type":"SCALAR"},{"name":"mem","scalar":{"value":1024.0},"type":"SCALAR"},{"name":"disk","scalar":{"value":1024.0},"type":"SCALAR"},{"name":"ports","ranges":{"range":[{"begin":31000,"end":32000}]},"type":"RANGES"}]
I1031 12:15:33.364413  5301 slave.cpp:593] Agent attributes: [  ]
I1031 12:15:33.364609  5301 slave.cpp:602] Agent hostname: edae2d3a6e8d
I1031 12:15:33.365079  5308 status_update_manager.cpp:177] Pausing sending status updates
I1031 12:15:33.367746  5306 state.cpp:64] Recovering state from '/tmp/Endpoint_SlaveEndpointTest_UnauthorizedRequest_1_klsKpa/meta'
I1031 12:15:33.379264  5304 status_update_manager.cpp:203] Recovering status update manager
I1031 12:15:33.379686  5305 containerizer.cpp:662] Recovering containerizer
I1031 12:15:33.382464  5304 provisioner.cpp:416] Provisioner recovery complete
I1031 12:15:33.383172  5304 slave.cpp:6340] Finished recovery
I1031 12:15:33.387943  5301 process.cpp:3938] Handling HTTP event for process 'slave(825)'
with path: '/slave(825)/monitor/statistics.json'
I1031 12:15:33.389953  5304 http.cpp:1185] HTTP GET for /slave(825)/monitor/statistics.json
from 172.17.0.3:42974
I1031 12:15:33.390182  5304 http.cpp:976] Authorizing principal 'test-principal' to GET the
'/monitor/statistics.json' endpoint
I1031 12:15:33.392796  5300 slave.cpp:875] Agent terminating
[       OK ] Endpoint/SlaveEndpointTest.UnauthorizedRequest/1 (60 ms)
[ RUN      ] Endpoint/SlaveEndpointTest.UnauthorizedRequest/2
I1031 12:15:33.414856  5300 containerizer.cpp:301] Using isolation { environment_secret, posix/cpu,
posix/mem, filesystem/posix, network/cni }
W1031 12:15:33.415354  5300 backend.cpp:76] Failed to create 'aufs' backend: AufsBackend requires
root privileges
W1031 12:15:33.415499  5300 backend.cpp:76] Failed to create 'bind' backend: BindBackend requires
root privileges
I1031 12:15:33.415544  5300 provisioner.cpp:255] Using default backend 'copy'
I1031 12:15:33.420413  5308 slave.cpp:254] Mesos agent started on (826)@172.17.0.3:41552
I1031 12:15:33.420442  5308 slave.cpp:255] Flags at startup: --acls="" --appc_simple_discovery_uri_prefix="http://"
--appc_store_dir="/tmp/Endpoint_SlaveEndpointTest_UnauthorizedRequest_2_nGYjzq/store/appc"
--authenticate_http_readonly="true" --authenticate_http_readwrite="true" --authenticatee="crammd5"
--authentication_backoff_factor="1secs" --authorizer="local" --cgroups_cpu_enable_pids_and_tids_count="false"
--cgroups_enable_cfs="false" --cgroups_hierarchy="/sys/fs/cgroup" --cgroups_limit_swap="false"
--cgroups_root="mesos" --container_disk_watch_interval="15secs" --containerizers="mesos" --credential="/tmp/Endpoint_SlaveEndpointTest_UnauthorizedRequest_2_nGYjzq/credential"
--default_role="*" --disallow_sharing_agent_pid_namespace="false" --disk_watch_interval="1mins"
--docker="docker" --docker_kill_orphans="true" --docker_registry="https://registry-1.docker.io"
--docker_remove_delay="6hrs" --docker_socket="/var/run/docker.sock" --docker_stop_timeout="0ns"
--docker_store_dir="/tmp/Endpoint_SlaveEndpointTest_UnauthorizedRequest_2_nGYjzq/store/docker"
--docker_volume_checkpoint_dir="/var/run/mesos/isolators/docker/volume" --enforce_container_disk_quota="false"
--executor_registration_timeout="1mins" --executor_reregistration_timeout="2secs" --executor_shutdown_grace_period="5secs"
--fetcher_cache_dir="/tmp/Endpoint_SlaveEndpointTest_UnauthorizedRequest_2_nGYjzq/fetch" --fetcher_cache_size="2GB"
--frameworks_home="" --gc_delay="1weeks" --gc_disk_headroom="0.1" --hadoop_home="" --help="false"
--hostname_lookup="true" --http_command_executor="false" --http_credentials="/tmp/Endpoint_SlaveEndpointTest_UnauthorizedRequest_2_nGYjzq/http_credentials"
--http_heartbeat_interval="30secs" --initialize_driver_logging="true" --isolation="posix/cpu,posix/mem"
--launcher="posix" --launcher_dir="/mesos/mesos-1.5.0/_build/src" --logbufsecs="0" --logging_level="INFO"
--max_completed_executors_per_framework="150" --oversubscribed_resources_interval="15secs"
--perf_duration="10secs" --perf_interval="1mins" --port="5051" --qos_correction_interval_min="0ns"
--quiet="false" --recover="reconnect" --recovery_timeout="15mins" --registration_backoff_factor="10ms"
--resources="cpus:2;gpus:0;mem:1024;disk:1024;ports:[31000-32000]" --revocable_cpu_low_priority="true"
--runtime_dir="/tmp/Endpoint_SlaveEndpointTest_UnauthorizedRequest_2_nGYjzq" --sandbox_directory="/mnt/mesos/sandbox"
--strict="true" --switch_user="true" --systemd_enable_support="true" --systemd_runtime_directory="/run/systemd/system"
--version="false" --work_dir="/tmp/Endpoint_SlaveEndpointTest_UnauthorizedRequest_2_Q3mPhn"
--zk_session_timeout="10secs"
I1031 12:15:33.420985  5308 credentials.hpp:86] Loading credential for authentication from
'/tmp/Endpoint_SlaveEndpointTest_UnauthorizedRequest_2_nGYjzq/credential'
I1031 12:15:33.421376  5308 slave.cpp:287] Agent using credential for: test-principal
I1031 12:15:33.421406  5308 credentials.hpp:37] Loading credentials for authentication from
'/tmp/Endpoint_SlaveEndpointTest_UnauthorizedRequest_2_nGYjzq/http_credentials'
I1031 12:15:33.421849  5308 http.cpp:1045] Creating default 'basic' HTTP authenticator for
realm 'mesos-agent-readonly'
I1031 12:15:33.422183  5308 http.cpp:1045] Creating default 'basic' HTTP authenticator for
realm 'mesos-agent-readwrite'
I1031 12:15:33.423880  5308 slave.cpp:585] Agent resources: [{"name":"cpus","scalar":{"value":2.0},"type":"SCALAR"},{"name":"mem","scalar":{"value":1024.0},"type":"SCALAR"},{"name":"disk","scalar":{"value":1024.0},"type":"SCALAR"},{"name":"ports","ranges":{"range":[{"begin":31000,"end":32000}]},"type":"RANGES"}]
I1031 12:15:33.424129  5308 slave.cpp:593] Agent attributes: [  ]
I1031 12:15:33.424224  5308 slave.cpp:602] Agent hostname: edae2d3a6e8d
I1031 12:15:33.424571  5306 status_update_manager.cpp:177] Pausing sending status updates
I1031 12:15:33.426398  5302 state.cpp:64] Recovering state from '/tmp/Endpoint_SlaveEndpointTest_UnauthorizedRequest_2_Q3mPhn/meta'
I1031 12:15:33.426930  5306 status_update_manager.cpp:203] Recovering status update manager
I1031 12:15:33.427273  5304 containerizer.cpp:662] Recovering containerizer
I1031 12:15:33.429035  5304 provisioner.cpp:416] Provisioner recovery complete
I1031 12:15:33.429594  5304 slave.cpp:6340] Finished recovery
I1031 12:15:33.433156  5305 process.cpp:3938] Handling HTTP event for process 'slave(826)'
with path: '/slave(826)/containers'
I1031 12:15:33.434986  5301 http.cpp:1185] HTTP GET for /slave(826)/containers from 172.17.0.3:42976
I1031 12:15:33.435225  5301 http.cpp:976] Authorizing principal 'test-principal' to GET the
'/containers' endpoint
I1031 12:15:33.438782  5300 slave.cpp:875] Agent terminating
[       OK ] Endpoint/SlaveEndpointTest.UnauthorizedRequest/2 (37 ms)
[ RUN      ] Endpoint/SlaveEndpointTest.NoAuthorizer/0
I1031 12:15:33.451599  5300 containerizer.cpp:301] Using isolation { environment_secret, posix/cpu,
posix/mem, filesystem/posix, network/cni }
W1031 12:15:33.452101  5300 backend.cpp:76] Failed to create 'aufs' backend: AufsBackend requires
root privileges
W1031 12:15:33.452350  5300 backend.cpp:76] Failed to create 'bind' backend: BindBackend requires
root privileges
I1031 12:15:33.452391  5300 provisioner.cpp:255] Using default backend 'copy'
I1031 12:15:33.454232  5300 cluster.cpp:448] Creating default 'local' authorizer
I1031 12:15:33.456488  5302 slave.cpp:254] Mesos agent started on (827)@172.17.0.3:41552
I1031 12:15:33.456514  5302 slave.cpp:255] Flags at startup: --acls="" --appc_simple_discovery_uri_prefix="http://"
--appc_store_dir="/tmp/Endpoint_SlaveEndpointTest_NoAuthorizer_0_LCMB3D/store/appc" --authenticate_http_readonly="true"
--authenticate_http_readwrite="true" --authenticatee="crammd5" --authentication_backoff_factor="1secs"
--authorizer="local" --cgroups_cpu_enable_pids_and_tids_count="false" --cgroups_enable_cfs="false"
--cgroups_hierarchy="/sys/fs/cgroup" --cgroups_limit_swap="false" --cgroups_root="mesos" --container_disk_watch_interval="15secs"
--containerizers="mesos" --credential="/tmp/Endpoint_SlaveEndpointTest_NoAuthorizer_0_LCMB3D/credential"
--default_role="*" --disallow_sharing_agent_pid_namespace="false" --disk_watch_interval="1mins"
--docker="docker" --docker_kill_orphans="true" --docker_registry="https://registry-1.docker.io"
--docker_remove_delay="6hrs" --docker_socket="/var/run/docker.sock" --docker_stop_timeout="0ns"
--docker_store_dir="/tmp/Endpoint_SlaveEndpointTest_NoAuthorizer_0_LCMB3D/store/docker" --docker_volume_checkpoint_dir="/var/run/mesos/isolators/docker/volume"
--enforce_container_disk_quota="false" --executor_registration_timeout="1mins" --executor_reregistration_timeout="2secs"
--executor_shutdown_grace_period="5secs" --fetcher_cache_dir="/tmp/Endpoint_SlaveEndpointTest_NoAuthorizer_0_LCMB3D/fetch"
--fetcher_cache_size="2GB" --frameworks_home="" --gc_delay="1weeks" --gc_disk_headroom="0.1"
--hadoop_home="" --help="false" --hostname_lookup="true" --http_command_executor="false" --http_credentials="/tmp/Endpoint_SlaveEndpointTest_NoAuthorizer_0_LCMB3D/http_credentials"
--http_heartbeat_interval="30secs" --initialize_driver_logging="true" --isolation="posix/cpu,posix/mem"
--launcher="posix" --launcher_dir="/mesos/mesos-1.5.0/_build/src" --logbufsecs="0" --logging_level="INFO"
--max_completed_executors_per_framework="150" --oversubscribed_resources_interval="15secs"
--perf_duration="10secs" --perf_interval="1mins" --port="5051" --qos_correction_interval_min="0ns"
--quiet="false" --recover="reconnect" --recovery_timeout="15mins" --registration_backoff_factor="10ms"
--resources="cpus:2;gpus:0;mem:1024;disk:1024;ports:[31000-32000]" --revocable_cpu_low_priority="true"
--runtime_dir="/tmp/Endpoint_SlaveEndpointTest_NoAuthorizer_0_LCMB3D" --sandbox_directory="/mnt/mesos/sandbox"
--strict="true" --switch_user="true" --systemd_enable_support="true" --systemd_runtime_directory="/run/systemd/system"
--version="false" --work_dir="/tmp/Endpoint_SlaveEndpointTest_NoAuthorizer_0_FapDFA" --zk_session_timeout="10secs"
I1031 12:15:33.457173  5302 credentials.hpp:86] Loading credential for authentication from
'/tmp/Endpoint_SlaveEndpointTest_NoAuthorizer_0_LCMB3D/credential'
I1031 12:15:33.457484  5302 slave.cpp:287] Agent using credential for: test-principal
I1031 12:15:33.457552  5302 credentials.hpp:37] Loading credentials for authentication from
'/tmp/Endpoint_SlaveEndpointTest_NoAuthorizer_0_LCMB3D/http_credentials'
I1031 12:15:33.458209  5302 http.cpp:1045] Creating default 'basic' HTTP authenticator for
realm 'mesos-agent-readonly'
I1031 12:15:33.458597  5302 http.cpp:1045] Creating default 'basic' HTTP authenticator for
realm 'mesos-agent-readwrite'
I1031 12:15:33.460377  5302 slave.cpp:585] Agent resources: [{"name":"cpus","scalar":{"value":2.0},"type":"SCALAR"},{"name":"mem","scalar":{"value":1024.0},"type":"SCALAR"},{"name":"disk","scalar":{"value":1024.0},"type":"SCALAR"},{"name":"ports","ranges":{"range":[{"begin":31000,"end":32000}]},"type":"RANGES"}]
I1031 12:15:33.460757  5302 slave.cpp:593] Agent attributes: [  ]
I1031 12:15:33.460855  5302 slave.cpp:602] Agent hostname: edae2d3a6e8d
I1031 12:15:33.461218  5305 status_update_manager.cpp:177] Pausing sending status updates
I1031 12:15:33.463821  5307 state.cpp:64] Recovering state from '/tmp/Endpoint_SlaveEndpointTest_NoAuthorizer_0_FapDFA/meta'
I1031 12:15:33.464401  5304 status_update_manager.cpp:203] Recovering status update manager
I1031 12:15:33.464788  5304 containerizer.cpp:662] Recovering containerizer
I1031 12:15:33.466979  5305 provisioner.cpp:416] Provisioner recovery complete
I1031 12:15:33.467674  5305 slave.cpp:6340] Finished recovery
I1031 12:15:33.472404  5305 process.cpp:3938] Handling HTTP event for process 'slave(827)'
with path: '/slave(827)/monitor/statistics'
I1031 12:15:33.475175  5308 http.cpp:1185] HTTP GET for /slave(827)/monitor/statistics from
172.17.0.3:42978
I1031 12:15:33.475262  5308 http.cpp:976] Authorizing principal 'test-principal' to GET the
'/monitor/statistics' endpoint
I1031 12:15:33.480919  5300 slave.cpp:875] Agent terminating
[       OK ] Endpoint/SlaveEndpointTest.NoAuthorizer/0 (50 ms)
[ RUN      ] Endpoint/SlaveEndpointTest.NoAuthorizer/1
I1031 12:15:33.503234  5300 containerizer.cpp:301] Using isolation { environment_secret, posix/cpu,
posix/mem, filesystem/posix, network/cni }
W1031 12:15:33.503839  5300 backend.cpp:76] Failed to create 'aufs' backend: AufsBackend requires
root privileges
W1031 12:15:33.504030  5300 backend.cpp:76] Failed to create 'bind' backend: BindBackend requires
root privileges
I1031 12:15:33.504081  5300 provisioner.cpp:255] Using default backend 'copy'
I1031 12:15:33.506352  5300 cluster.cpp:448] Creating default 'local' authorizer
I1031 12:15:33.509300  5305 slave.cpp:254] Mesos agent started on (828)@172.17.0.3:41552
I1031 12:15:33.510157  5305 slave.cpp:255] Flags at startup: --acls="" --appc_simple_discovery_uri_prefix="http://"
--appc_store_dir="/tmp/Endpoint_SlaveEndpointTest_NoAuthorizer_1_Y1Zs5R/store/appc" --authenticate_http_readonly="true"
--authenticate_http_readwrite="true" --authenticatee="crammd5" --authentication_backoff_factor="1secs"
--authorizer="local" --cgroups_cpu_enable_pids_and_tids_count="false" --cgroups_enable_cfs="false"
--cgroups_hierarchy="/sys/fs/cgroup" --cgroups_limit_swap="false" --cgroups_root="mesos" --container_disk_watch_interval="15secs"
--containerizers="mesos" --credential="/tmp/Endpoint_SlaveEndpointTest_NoAuthorizer_1_Y1Zs5R/credential"
--default_role="*" --disallow_sharing_agent_pid_namespace="false" --disk_watch_interval="1mins"
--docker="docker" --docker_kill_orphans="true" --docker_registry="https://registry-1.docker.io"
--docker_remove_delay="6hrs" --docker_socket="/var/run/docker.sock" --docker_stop_timeout="0ns"
--docker_store_dir="/tmp/Endpoint_SlaveEndpointTest_NoAuthorizer_1_Y1Zs5R/store/docker" --docker_volume_checkpoint_dir="/var/run/mesos/isolators/docker/volume"
--enforce_container_disk_quota="false" --executor_registration_timeout="1mins" --executor_reregistration_timeout="2secs"
--executor_shutdown_grace_period="5secs" --fetcher_cache_dir="/tmp/Endpoint_SlaveEndpointTest_NoAuthorizer_1_Y1Zs5R/fetch"
--fetcher_cache_size="2GB" --frameworks_home="" --gc_delay="1weeks" --gc_disk_headroom="0.1"
--hadoop_home="" --help="false" --hostname_lookup="true" --http_command_executor="false" --http_credentials="/tmp/Endpoint_SlaveEndpointTest_NoAuthorizer_1_Y1Zs5R/http_credentials"
--http_heartbeat_interval="30secs" --initialize_driver_logging="true" --isolation="posix/cpu,posix/mem"
--launcher="posix" --launcher_dir="/mesos/mesos-1.5.0/_build/src" --logbufsecs="0" --logging_level="INFO"
--max_completed_executors_per_framework="150" --oversubscribed_resources_interval="15secs"
--perf_duration="10secs" --perf_interval="1mins" --port="5051" --qos_correction_interval_min="0ns"
--quiet="false" --recover="reconnect" --recovery_timeout="15mins" --registration_backoff_factor="10ms"
--resources="cpus:2;gpus:0;mem:1024;disk:1024;ports:[31000-32000]" --revocable_cpu_low_priority="true"
--runtime_dir="/tmp/Endpoint_SlaveEndpointTest_NoAuthorizer_1_Y1Zs5R" --sandbox_directory="/mnt/mesos/sandbox"
--strict="true" --switch_user="true" --systemd_enable_support="true" --systemd_runtime_directory="/run/systemd/system"
--version="false" --work_dir="/tmp/Endpoint_SlaveEndpointTest_NoAuthorizer_1_OqlwyO" --zk_session_timeout="10secs"
I1031 12:15:33.510720  5305 credentials.hpp:86] Loading credential for authentication from
'/tmp/Endpoint_SlaveEndpointTest_NoAuthorizer_1_Y1Zs5R/credential'
I1031 12:15:33.511333  5305 slave.cpp:287] Agent using credential for: test-principal
I1031 12:15:33.511363  5305 credentials.hpp:37] Loading credentials for authentication from
'/tmp/Endpoint_SlaveEndpointTest_NoAuthorizer_1_Y1Zs5R/http_credentials'
I1031 12:15:33.511936  5305 http.cpp:1045] Creating default 'basic' HTTP authenticator for
realm 'mesos-agent-readonly'
I1031 12:15:33.512603  5305 http.cpp:1045] Creating default 'basic' HTTP authenticator for
realm 'mesos-agent-readwrite'
I1031 12:15:33.515120  5305 slave.cpp:585] Agent resources: [{"name":"cpus","scalar":{"value":2.0},"type":"SCALAR"},{"name":"mem","scalar":{"value":1024.0},"type":"SCALAR"},{"name":"disk","scalar":{"value":1024.0},"type":"SCALAR"},{"name":"ports","ranges":{"range":[{"begin":31000,"end":32000}]},"type":"RANGES"}]
I1031 12:15:33.515446  5305 slave.cpp:593] Agent attributes: [  ]
I1031 12:15:33.515633  5305 slave.cpp:602] Agent hostname: edae2d3a6e8d
I1031 12:15:33.516357  5308 status_update_manager.cpp:177] Pausing sending status updates
I1031 12:15:33.518507  5302 state.cpp:64] Recovering state from '/tmp/Endpoint_SlaveEndpointTest_NoAuthorizer_1_OqlwyO/meta'
I1031 12:15:33.532011  5301 status_update_manager.cpp:203] Recovering status update manager
I1031 12:15:33.532536  5303 containerizer.cpp:662] Recovering containerizer
I1031 12:15:33.534590  5307 provisioner.cpp:416] Provisioner recovery complete
I1031 12:15:33.535595  5305 slave.cpp:6340] Finished recovery
I1031 12:15:33.540141  5303 process.cpp:3938] Handling HTTP event for process 'slave(828)'
with path: '/slave(828)/monitor/statistics.json'
I1031 12:15:33.542711  5303 http.cpp:1185] HTTP GET for /slave(828)/monitor/statistics.json
from 172.17.0.3:42980
I1031 12:15:33.543004  5303 http.cpp:976] Authorizing principal 'test-principal' to GET the
'/monitor/statistics.json' endpoint
I1031 12:15:33.548272  5300 slave.cpp:875] Agent terminating
[       OK ] Endpoint/SlaveEndpointTest.NoAuthorizer/1 (59 ms)
[ RUN      ] Endpoint/SlaveEndpointTest.NoAuthorizer/2
I1031 12:15:33.562906  5300 containerizer.cpp:301] Using isolation { environment_secret, posix/cpu,
posix/mem, filesystem/posix, network/cni }
W1031 12:15:33.563616  5300 backend.cpp:76] Failed to create 'aufs' backend: AufsBackend requires
root privileges
W1031 12:15:33.563799  5300 backend.cpp:76] Failed to create 'bind' backend: BindBackend requires
root privileges
I1031 12:15:33.563844  5300 provisioner.cpp:255] Using default backend 'copy'
I1031 12:15:33.566195  5300 cluster.cpp:448] Creating default 'local' authorizer
I1031 12:15:33.568662  5307 slave.cpp:254] Mesos agent started on (829)@172.17.0.3:41552
I1031 12:15:33.568691  5307 slave.cpp:255] Flags at startup: --acls="" --appc_simple_discovery_uri_prefix="http://"
--appc_store_dir="/tmp/Endpoint_SlaveEndpointTest_NoAuthorizer_2_Pq6vO6/store/appc" --authenticate_http_readonly="true"
--authenticate_http_readwrite="true" --authenticatee="crammd5" --authentication_backoff_factor="1secs"
--authorizer="local" --cgroups_cpu_enable_pids_and_tids_count="false" --cgroups_enable_cfs="false"
--cgroups_hierarchy="/sys/fs/cgroup" --cgroups_limit_swap="false" --cgroups_root="mesos" --container_disk_watch_interval="15secs"
--containerizers="mesos" --credential="/tmp/Endpoint_SlaveEndpointTest_NoAuthorizer_2_Pq6vO6/credential"
--default_role="*" --disallow_sharing_agent_pid_namespace="false" --disk_watch_interval="1mins"
--docker="docker" --docker_kill_orphans="true" --docker_registry="https://registry-1.docker.io"
--docker_remove_delay="6hrs" --docker_socket="/var/run/docker.sock" --docker_stop_timeout="0ns"
--docker_store_dir="/tmp/Endpoint_SlaveEndpointTest_NoAuthorizer_2_Pq6vO6/store/docker" --docker_volume_checkpoint_dir="/var/run/mesos/isolators/docker/volume"
--enforce_container_disk_quota="false" --executor_registration_timeout="1mins" --executor_reregistration_timeout="2secs"
--executor_shutdown_grace_period="5secs" --fetcher_cache_dir="/tmp/Endpoint_SlaveEndpointTest_NoAuthorizer_2_Pq6vO6/fetch"
--fetcher_cache_size="2GB" --frameworks_home="" --gc_delay="1weeks" --gc_disk_headroom="0.1"
--hadoop_home="" --help="false" --hostname_lookup="true" --http_command_executor="false" --http_credentials="/tmp/Endpoint_SlaveEndpointTest_NoAuthorizer_2_Pq6vO6/http_credentials"
--http_heartbeat_interval="30secs" --initialize_driver_logging="true" --isolation="posix/cpu,posix/mem"
--launcher="posix" --launcher_dir="/mesos/mesos-1.5.0/_build/src" --logbufsecs="0" --logging_level="INFO"
--max_completed_executors_per_framework="150" --oversubscribed_resources_interval="15secs"
--perf_duration="10secs" --perf_interval="1mins" --port="5051" --qos_correction_interval_min="0ns"
--quiet="false" --recover="reconnect" --recovery_timeout="15mins" --registration_backoff_factor="10ms"
--resources="cpus:2;gpus:0;mem:1024;disk:1024;ports:[31000-32000]" --revocable_cpu_low_priority="true"
--runtime_dir="/tmp/Endpoint_SlaveEndpointTest_NoAuthorizer_2_Pq6vO6" --sandbox_directory="/mnt/mesos/sandbox"
--strict="true" --switch_user="true" --systemd_enable_support="true" --systemd_runtime_directory="/run/systemd/system"
--version="false" --work_dir="/tmp/Endpoint_SlaveEndpointTest_NoAuthorizer_2_QLt962" --zk_session_timeout="10secs"
I1031 12:15:33.569247  5307 credentials.hpp:86] Loading credential for authentication from
'/tmp/Endpoint_SlaveEndpointTest_NoAuthorizer_2_Pq6vO6/credential'
I1031 12:15:33.569634  5307 slave.cpp:287] Agent using credential for: test-principal
I1031 12:15:33.569692  5307 credentials.hpp:37] Loading credentials for authentication from
'/tmp/Endpoint_SlaveEndpointTest_NoAuthorizer_2_Pq6vO6/http_credentials'
I1031 12:15:33.570174  5307 http.cpp:1045] Creating default 'basic' HTTP authenticator for
realm 'mesos-agent-readonly'
I1031 12:15:33.570557  5307 http.cpp:1045] Creating default 'basic' HTTP authenticator for
realm 'mesos-agent-readwrite'
I1031 12:15:33.572367  5307 slave.cpp:585] Agent resources: [{"name":"cpus","scalar":{"value":2.0},"type":"SCALAR"},{"name":"mem","scalar":{"value":1024.0},"type":"SCALAR"},{"name":"disk","scalar":{"value":1024.0},"type":"SCALAR"},{"name":"ports","ranges":{"range":[{"begin":31000,"end":32000}]},"type":"RANGES"}]
I1031 12:15:33.572573  5307 slave.cpp:593] Agent attributes: [  ]
I1031 12:15:33.572592  5307 slave.cpp:602] Agent hostname: edae2d3a6e8d
I1031 12:15:33.572908  5303 status_update_manager.cpp:177] Pausing sending status updates
I1031 12:15:33.575247  5301 state.cpp:64] Recovering state from '/tmp/Endpoint_SlaveEndpointTest_NoAuthorizer_2_QLt962/meta'
I1031 12:15:33.575979  5303 status_update_manager.cpp:203] Recovering status update manager
I1031 12:15:33.576376  5304 containerizer.cpp:662] Recovering containerizer
I1031 12:15:33.578352  5303 provisioner.cpp:416] Provisioner recovery complete
I1031 12:15:33.579033  5304 slave.cpp:6340] Finished recovery
I1031 12:15:33.584028  5304 process.cpp:3938] Handling HTTP event for process 'slave(829)'
with path: '/slave(829)/containers'
I1031 12:15:33.585997  5306 http.cpp:1185] HTTP GET for /slave(829)/containers from 172.17.0.3:42982
I1031 12:15:33.586315  5306 http.cpp:976] Authorizing principal 'test-principal' to GET the
'/containers' endpoint
I1031 12:15:33.592209  5300 slave.cpp:875] Agent terminating
[       OK ] Endpoint/SlaveEndpointTest.NoAuthorizer/2 (44 ms)
[----------] 9 tests from Endpoint/SlaveEndpointTest (495 ms total)

[----------] 2 tests from ContainerizerType/DefaultContainerDNSFlagTest
[ RUN      ] ContainerizerType/DefaultContainerDNSFlagTest.ValidateFlag/0
[       OK ] ContainerizerType/DefaultContainerDNSFlagTest.ValidateFlag/0 (20 ms)
[ RUN      ] ContainerizerType/DefaultContainerDNSFlagTest.ValidateFlag/1
[       OK ] ContainerizerType/DefaultContainerDNSFlagTest.ValidateFlag/1 (11 ms)
[----------] 2 tests from ContainerizerType/DefaultContainerDNSFlagTest (31 ms total)

[----------] Global test environment tear-down
[==========] 1703 tests from 186 test cases ran. (567144 ms total)
[  PASSED  ] 1702 tests.
[  FAILED  ] 1 test, listed below:
[  FAILED  ] ReconciliationTest.RemovalInProgress

 1 FAILED TEST
  YOU HAVE 21 DISABLED TESTS

I1031 12:15:33.691121  5309 process.cpp:1067] Failed to accept socket: future discarded
make[4]: *** [check-local] Error 1
make[4]: Leaving directory `/mesos/mesos-1.5.0/_build/src'
make[3]: *** [check-am] Error 2
make[3]: Leaving directory `/mesos/mesos-1.5.0/_build/src'
make[2]: *** [check] Error 2
make[2]: Leaving directory `/mesos/mesos-1.5.0/_build/src'
make[1]: *** [check-recursive] Error 1
make[1]: Leaving directory `/mesos/mesos-1.5.0/_build'
make: *** [distcheck] Error 1
+ docker rmi mesos-1509437637-17
Untagged: mesos-1509437637-17:latest
Deleted: sha256:3daa651a7da0965d3d265ca7cc3e6e9f560b12a88ea7fbf7ccc453645141ffb6
Deleted: sha256:a1fd64599f455522f15fda2895758c8c957235ecf867f69e6712336f2cfb00e4
Deleted: sha256:7aa01191d1fe8cceca1c2e44ea12e73a99c0c265d3b605e4030693def4421a7f
Deleted: sha256:a2d0d50644da82a7a068599584aaafa12b8ffb5b1595648d6b799d60febde047
Deleted: sha256:2b00ede026f07c7fb92b7ffcd67019791398a201898379a033322dba8a176c26
Deleted: sha256:e952a2e8b9f466a28d1d9cf4af6b9626d8b10f7a0607c5970f3e560156acb86d
Deleted: sha256:f55ac82a526d0effd0f85ced21ecc056ccc5c0ef415cec19182e2ec53c5e5457
Deleted: sha256:aed5aaa899853d10de030493516d03b39f21cac7a94296fa6b29138dacd7081c
Deleted: sha256:fe5729c5dea9a5de8c80c363236c250e7073feb7fc30a07bb081e408cca6f038
Deleted: sha256:739478b32edd80293456f9c79af95d53a5f224df0a8c8687f1ffb71f9d24deef
Deleted: sha256:a0540db694286b879656d883f8bfda082853b23ad09f193576c85f6c8d01f705
Deleted: sha256:5f805d50d608e8ec13a426a6367b2b14b0595be6d9c6022f1ff5fddde395d71e
Deleted: sha256:1ac9bf702830fe4c9dd12174540cf6794c81fcfa4e3d86298a99baa30aa1f345
Deleted: sha256:6556f35893084b467c87d785530122e00ac2f4afd7af289c3cccda1babfe77d2
Deleted: sha256:4325aadeff7e51a936681b8726077d6e1df29e93e4d8a6ca373f54964a567f86
Deleted: sha256:69e2799a14dfb8552f9b77acaa509128b5d18087c3221a6f0ac2b24f04383d4e
Deleted: sha256:1a84f0fedbb723a43ba1a39f6921f253dae0d771d3527f5d3c1ca46cc8154c04
Deleted: sha256:574f19849f6ea0a14da126f3a257f4aebfa15ab3b3b81e131f5ec558dc641887
Deleted: sha256:c9e70f7e4819fa2bc2e1797606b3b3dc15db3e54fa8b3393e2aa70b60996c35e
Deleted: sha256:5976b321f03bb1677c8bb54eb17ad085643459b1f95ccd74beb7e1d3d3900389
Deleted: sha256:556cb509b0b46e022e4d5fc95be46bea35d8839cfe8f0d3bb886f3c41d73e4a8
Deleted: sha256:61919b3f753b0a2839949b8b0b61b332adcc781e29767ae82bb3cec99d85d876
Deleted: sha256:7b702fb699618a1f6b0b2e24ce3b3ccfa6212cb5166d962f5e8ef0aa59b32558
Deleted: sha256:c1a2a7a0d2a346c677488f93bd4aa01942e54f3bbe4dc9f96a94bd37c0005061
Deleted: sha256:7a8702e3564428613c3912532a6d44dfb78f22767520d58ceb3e08ef213c10d4
Deleted: sha256:88844785f306439dcb900abb4c321402648faa516df19d96aaa0aca3e8a29159
Deleted: sha256:a2fd89c996702649b54c714cd81be7cefb1aeda3305cc9eaac4f28fd86ebb6c4
Deleted: sha256:412ec27b89b4db87f17cd61fee9d60d1d7b5278559a5d451aa4680205515c0f8
Deleted: sha256:f543caa7ee4aaa219c4e010e21a85b1faf97f1ef48101f521d1a33fc448836d1
Deleted: sha256:17bfd374e94ed2cb2e838b795fffb9d205aceb5a66ea07a29e6bb036ae7da682
Build step 'Execute shell' marked build as failure


Mime
View raw message