mesos-builds mailing list archives

Site index · List index
Message view « Date » · « Thread »
Top « Date » · « Thread »
From Apache Jenkins Server <jenk...@builds.apache.org>
Subject Build failed in Jenkins: Mesos-Buildbot » cmake,gcc,--verbose --disable-libtool-wrapper --enable-libevent --enable-ssl,GLOG_v=1 MESOS_VERBOSE=1,centos:7,(ubuntu)&&(!ubuntu-us1)&&(!ubuntu-eu2)&&(!qnode3)&&(!H23) #4286
Date Thu, 05 Oct 2017 01:39:21 GMT
See <https://builds.apache.org/job/Mesos-Buildbot/BUILDTOOL=cmake,COMPILER=gcc,CONFIGURATION=--verbose%20--disable-libtool-wrapper%20--enable-libevent%20--enable-ssl,ENVIRONMENT=GLOG_v=1%20MESOS_VERBOSE=1,OS=centos%3A7,label_exp=(ubuntu)&&(!ubuntu-us1)&&(!ubuntu-eu2)&&(!qnode3)&&(!H23)/4286/display/redirect>

------------------------------------------
[...truncated 8.12 MB...]
3: I1005 01:39:17.162145 18138 slave.cpp:6492] Querying resource estimator for oversubscribable
resources
3: I1005 01:39:17.162416 18127 status_update_manager.cpp:177] Pausing sending status updates
3: I1005 01:39:17.162416 18139 slave.cpp:993] New master detected at master@172.17.0.3:36792
3: I1005 01:39:17.162477 18139 slave.cpp:1028] Detecting new master
3: I1005 01:39:17.162652 18139 slave.cpp:6506] Received oversubscribable resources {} from
the resource estimator
3: I1005 01:39:17.164165 18118 slave.cpp:869] Agent terminating
3: I1005 01:39:17.169068 18138 master.cpp:1145] Master terminating
3: [       OK ] SlaveTest.ContainersEndpointNoExecutor (50 ms)
3: [ RUN      ] SlaveTest.ContainersEndpoint
3: I1005 01:39:17.174525 18118 cluster.cpp:162] Creating default 'local' authorizer
3: I1005 01:39:17.177289 18140 master.cpp:445] Master 3554a905-60f7-4d9c-934e-e07c4ecf1b68
(485720b43777) started on 172.17.0.3:36792
3: I1005 01:39:17.177309 18140 master.cpp:447] Flags at startup: --acls="" --agent_ping_timeout="15secs"
--agent_reregister_timeout="10mins" --allocation_interval="1secs" --allocator="HierarchicalDRF"
--authenticate_agents="true" --authenticate_frameworks="true" --authenticate_http_frameworks="true"
--authenticate_http_readonly="true" --authenticate_http_readwrite="true" --authenticators="crammd5"
--authorizers="local" --credentials="/tmp/1xAy5C/credentials" --filter_gpu_resources="true"
--framework_sorter="drf" --help="false" --hostname_lookup="true" --http_authenticators="basic"
--http_framework_authenticators="basic" --initialize_driver_logging="true" --log_auto_initialize="true"
--logbufsecs="0" --logging_level="INFO" --max_agent_ping_timeouts="5" --max_completed_frameworks="50"
--max_completed_tasks_per_framework="1000" --max_unreachable_tasks_per_framework="1000" --port="5050"
--quiet="false" --recovery_agent_removal_limit="100%" --registry="in_memory" --registry_fetch_timeout="1mins"
--registry_gc_interval="15mins" --registry_max_agent_age="2weeks" --registry_max_agent_count="102400"
--registry_store_timeout="100secs" --registry_strict="false" --root_submissions="true" --user_sorter="drf"
--version="false" --webui_dir="/usr/local/share/mesos/webui" --work_dir="/tmp/1xAy5C/master"
--zk_session_timeout="10secs"
3: I1005 01:39:17.177649 18140 master.cpp:496] Master only allowing authenticated frameworks
to register
3: I1005 01:39:17.177656 18140 master.cpp:502] Master only allowing authenticated agents to
register
3: I1005 01:39:17.177660 18140 master.cpp:508] Master only allowing authenticated HTTP frameworks
to register
3: I1005 01:39:17.177665 18140 credentials.hpp:37] Loading credentials for authentication
from '/tmp/1xAy5C/credentials'
3: I1005 01:39:17.177981 18140 master.cpp:552] Using default 'crammd5' authenticator
3: I1005 01:39:17.178150 18140 http.cpp:1045] Creating default 'basic' HTTP authenticator
for realm 'mesos-master-readonly'
3: I1005 01:39:17.178319 18140 http.cpp:1045] Creating default 'basic' HTTP authenticator
for realm 'mesos-master-readwrite'
3: I1005 01:39:17.178483 18140 http.cpp:1045] Creating default 'basic' HTTP authenticator
for realm 'mesos-master-scheduler'
3: I1005 01:39:17.178637 18140 master.cpp:631] Authorization enabled
3: I1005 01:39:17.178820 18131 whitelist_watcher.cpp:77] No whitelist given
3: I1005 01:39:17.178828 18142 hierarchical.cpp:171] Initialized hierarchical allocator process
3: I1005 01:39:17.181572 18123 master.cpp:2198] Elected as the leading master!
3: I1005 01:39:17.181602 18123 master.cpp:1687] Recovering from registrar
3: I1005 01:39:17.181727 18126 registrar.cpp:347] Recovering registrar
3: I1005 01:39:17.182284 18126 registrar.cpp:391] Successfully fetched the registry (0B) in
516864ns
3: I1005 01:39:17.182392 18126 registrar.cpp:495] Applied 1 operations in 32316ns; attempting
to update the registry
3: I1005 01:39:17.182947 18126 registrar.cpp:552] Successfully updated the registry in 497152ns
3: I1005 01:39:17.183079 18126 registrar.cpp:424] Successfully recovered registrar
3: I1005 01:39:17.183440 18120 master.cpp:1791] Recovered 0 agents from the registry (129B);
allowing 10mins for agents to re-register
3: I1005 01:39:17.183467 18133 hierarchical.cpp:209] Skipping recovery of hierarchical allocator:
nothing to recover
3: W1005 01:39:17.188923 18118 process.cpp:3194] Attempted to spawn already running process
files@172.17.0.3:36792
3: I1005 01:39:17.189195 18118 cluster.cpp:448] Creating default 'local' authorizer
3: I1005 01:39:17.191038 18132 slave.cpp:254] Mesos agent started on (178)@172.17.0.3:36792
3: I1005 01:39:17.191056 18132 slave.cpp:255] Flags at startup: --acls="" --appc_simple_discovery_uri_prefix="http://"
--appc_store_dir="/tmp/SlaveTest_ContainersEndpoint_BqTR8V/store/appc" --authenticate_http_executors="true"
--authenticate_http_readonly="true" --authenticate_http_readwrite="true" --authenticatee="crammd5"
--authentication_backoff_factor="1secs" --authorizer="local" --cgroups_cpu_enable_pids_and_tids_count="false"
--cgroups_enable_cfs="false" --cgroups_hierarchy="/sys/fs/cgroup" --cgroups_limit_swap="false"
--cgroups_root="mesos" --container_disk_watch_interval="15secs" --containerizers="mesos" --credential="/tmp/SlaveTest_ContainersEndpoint_BqTR8V/credential"
--default_role="*" --disallow_sharing_agent_pid_namespace="false" --disk_watch_interval="1mins"
--docker="docker" --docker_kill_orphans="true" --docker_registry="https://registry-1.docker.io"
--docker_remove_delay="6hrs" --docker_socket="/var/run/docker.sock" --docker_stop_timeout="0ns"
--docker_store_dir="/tmp/SlaveTest_ContainersEndpoint_BqTR8V/store/docker" --docker_volume_checkpoint_dir="/var/run/mesos/isolators/docker/volume"
--enforce_container_disk_quota="false" --executor_registration_timeout="1mins" --executor_reregistration_timeout="2secs"
--executor_secret_key="/tmp/SlaveTest_ContainersEndpoint_BqTR8V/executor_secret_key" --executor_shutdown_grace_period="5secs"
--fetcher_cache_dir="/tmp/SlaveTest_ContainersEndpoint_BqTR8V/fetch" --fetcher_cache_size="2GB"
--frameworks_home="" --gc_delay="1weeks" --gc_disk_headroom="0.1" --hadoop_home="" --help="false"
--hostname_lookup="true" --http_command_executor="false" --http_credentials="/tmp/SlaveTest_ContainersEndpoint_BqTR8V/http_credentials"
--http_heartbeat_interval="30secs" --initialize_driver_logging="true" --isolation="posix/cpu,posix/mem"
--launcher="posix" --launcher_dir="/mesos/build/src" --logbufsecs="0" --logging_level="INFO"
--max_completed_executors_per_framework="150" --oversubscribed_resources_interval="15secs"
--perf_duration="10secs" --perf_interval="1mins" --port="5051" --qos_correction_interval_min="0ns"
--quiet="false" --recover="reconnect" --recovery_timeout="15mins" --registration_backoff_factor="10ms"
--resources="cpus:2;gpus:0;mem:1024;disk:1024;ports:[31000-32000]" --revocable_cpu_low_priority="true"
--runtime_dir="/tmp/SlaveTest_ContainersEndpoint_BqTR8V" --sandbox_directory="/mnt/mesos/sandbox"
--strict="true" --switch_user="true" --systemd_enable_support="true" --systemd_runtime_directory="/run/systemd/system"
--version="false" --work_dir="/tmp/SlaveTest_ContainersEndpoint_ruCcCM" --zk_session_timeout="10secs"
3: I1005 01:39:17.191437 18132 credentials.hpp:86] Loading credential for authentication from
'/tmp/SlaveTest_ContainersEndpoint_BqTR8V/credential'
3: W1005 01:39:17.191529 18118 process.cpp:3194] Attempted to spawn already running process
version@172.17.0.3:36792
3: I1005 01:39:17.191587 18132 slave.cpp:287] Agent using credential for: test-principal
3: I1005 01:39:17.191608 18132 credentials.hpp:37] Loading credentials for authentication
from '/tmp/SlaveTest_ContainersEndpoint_BqTR8V/http_credentials'
3: I1005 01:39:17.191889 18132 http.cpp:1045] Creating default 'basic' HTTP authenticator
for realm 'mesos-agent-executor'
3: I1005 01:39:17.192016 18132 http.cpp:1066] Creating default 'jwt' HTTP authenticator for
realm 'mesos-agent-executor'
3: I1005 01:39:17.192219 18132 http.cpp:1045] Creating default 'basic' HTTP authenticator
for realm 'mesos-agent-readonly'
3: I1005 01:39:17.192322 18132 http.cpp:1066] Creating default 'jwt' HTTP authenticator for
realm 'mesos-agent-readonly'
3: I1005 01:39:17.192420 18118 sched.cpp:232] Version: 1.5.0
3: I1005 01:39:17.192514 18132 http.cpp:1045] Creating default 'basic' HTTP authenticator
for realm 'mesos-agent-readwrite'
3: I1005 01:39:17.192622 18132 http.cpp:1066] Creating default 'jwt' HTTP authenticator for
realm 'mesos-agent-readwrite'
3: I1005 01:39:17.192929 18129 sched.cpp:336] New master detected at master@172.17.0.3:36792
3: I1005 01:39:17.193023 18129 sched.cpp:396] Authenticating with master master@172.17.0.3:36792
3: I1005 01:39:17.193040 18129 sched.cpp:403] Using default CRAM-MD5 authenticatee
3: I1005 01:39:17.193280 18119 authenticatee.cpp:121] Creating new client SASL connection
3: I1005 01:39:17.193533 18138 master.cpp:7897] Authenticating scheduler-8ddd10cb-45bc-442f-b695-9e04eb7e129a@172.17.0.3:36792
3: I1005 01:39:17.193634 18124 authenticator.cpp:414] Starting authentication session for
crammd5-authenticatee(386)@172.17.0.3:36792
3: I1005 01:39:17.193856 18141 authenticator.cpp:98] Creating new server SASL connection
3: I1005 01:39:17.194046 18136 authenticatee.cpp:213] Received SASL authentication mechanisms:
CRAM-MD5
3: I1005 01:39:17.194068 18136 authenticatee.cpp:239] Attempting to authenticate with mechanism
'CRAM-MD5'
3: I1005 01:39:17.194161 18126 authenticator.cpp:204] Received SASL authentication start
3: I1005 01:39:17.194219 18126 authenticator.cpp:326] Authentication requires more steps
3: I1005 01:39:17.194321 18135 authenticatee.cpp:259] Received SASL authentication step
3: I1005 01:39:17.194136 18132 slave.cpp:585] Agent resources: [{"name":"cpus","scalar":{"value":2.0},"type":"SCALAR"},{"name":"mem","scalar":{"value":1024.0},"type":"SCALAR"},{"name":"disk","scalar":{"value":1024.0},"type":"SCALAR"},{"name":"ports","ranges":{"range":[{"begin":31000,"end":32000}]},"type":"RANGES"}]
3: I1005 01:39:17.194358 18132 slave.cpp:593] Agent attributes: [  ]
3: I1005 01:39:17.194373 18132 slave.cpp:602] Agent hostname: 485720b43777
3: I1005 01:39:17.194459 18125 authenticator.cpp:232] Received SASL authentication step
3: I1005 01:39:17.194491 18125 auxprop.cpp:109] Request to lookup properties for user: 'test-principal'
realm: '485720b43777' server FQDN: '485720b43777' SASL_AUXPROP_VERIFY_AGAINST_HASH: false
SASL_AUXPROP_OVERRIDE: false SASL_AUXPROP_AUTHZID: false 
3: I1005 01:39:17.194499 18137 status_update_manager.cpp:177] Pausing sending status updates
3: I1005 01:39:17.194506 18125 auxprop.cpp:181] Looking up auxiliary property '*userPassword'
3: I1005 01:39:17.194552 18125 auxprop.cpp:181] Looking up auxiliary property '*cmusaslsecretCRAM-MD5'
3: I1005 01:39:17.194589 18125 auxprop.cpp:109] Request to lookup properties for user: 'test-principal'
realm: '485720b43777' server FQDN: '485720b43777' SASL_AUXPROP_VERIFY_AGAINST_HASH: false
SASL_AUXPROP_OVERRIDE: false SASL_AUXPROP_AUTHZID: true 
3: I1005 01:39:17.194607 18125 auxprop.cpp:131] Skipping auxiliary property '*userPassword'
since SASL_AUXPROP_AUTHZID == true
3: I1005 01:39:17.194622 18125 auxprop.cpp:131] Skipping auxiliary property '*cmusaslsecretCRAM-MD5'
since SASL_AUXPROP_AUTHZID == true
3: I1005 01:39:17.194645 18125 authenticator.cpp:318] Authentication success
3: I1005 01:39:17.194733 18127 authenticatee.cpp:299] Authentication success
3: I1005 01:39:17.194839 18130 master.cpp:7927] Successfully authenticated principal 'test-principal'
at scheduler-8ddd10cb-45bc-442f-b695-9e04eb7e129a@172.17.0.3:36792
3: I1005 01:39:17.194847 18131 authenticator.cpp:432] Authentication session cleanup for crammd5-authenticatee(386)@172.17.0.3:36792
3: I1005 01:39:17.195086 18133 sched.cpp:502] Successfully authenticated with master master@172.17.0.3:36792
3: I1005 01:39:17.195104 18133 sched.cpp:820] Sending SUBSCRIBE call to master@172.17.0.3:36792
3: I1005 01:39:17.195219 18133 sched.cpp:853] Will retry registration in 1.67565138secs if
necessary
3: I1005 01:39:17.195369 18134 master.cpp:2929] Received SUBSCRIBE call for framework 'default'
at scheduler-8ddd10cb-45bc-442f-b695-9e04eb7e129a@172.17.0.3:36792
3: I1005 01:39:17.195454 18134 master.cpp:2263] Authorizing framework principal 'test-principal'
to receive offers for roles '{ * }'
3: I1005 01:39:17.195904 18121 master.cpp:3009] Subscribing framework default with checkpointing
disabled and capabilities [ RESERVATION_REFINEMENT ]
3: I1005 01:39:17.196208 18129 state.cpp:64] Recovering state from '/tmp/SlaveTest_ContainersEndpoint_ruCcCM/meta'
3: I1005 01:39:17.196455 18124 status_update_manager.cpp:203] Recovering status update manager
3: I1005 01:39:17.196518 18141 sched.cpp:747] Framework registered with 3554a905-60f7-4d9c-934e-e07c4ecf1b68-0000
3: I1005 01:39:17.196583 18141 sched.cpp:761] Scheduler::registered took 38364ns
3: I1005 01:39:17.196647 18122 hierarchical.cpp:303] Added framework 3554a905-60f7-4d9c-934e-e07c4ecf1b68-0000
3: I1005 01:39:17.196800 18125 slave.cpp:6310] Finished recovery
3: I1005 01:39:17.196818 18122 hierarchical.cpp:1943] No allocations performed
3: I1005 01:39:17.196851 18122 hierarchical.cpp:2033] No inverse offers to send out!
3: I1005 01:39:17.196887 18122 hierarchical.cpp:1486] Performed allocation for 0 agents in
107025ns
3: I1005 01:39:17.197227 18125 slave.cpp:6492] Querying resource estimator for oversubscribable
resources
3: I1005 01:39:17.197422 18120 status_update_manager.cpp:177] Pausing sending status updates
3: I1005 01:39:17.197438 18125 slave.cpp:993] New master detected at master@172.17.0.3:36792
3: I1005 01:39:17.197511 18125 slave.cpp:1028] Detecting new master
3: I1005 01:39:17.197625 18125 slave.cpp:6506] Received oversubscribable resources {} from
the resource estimator
3: I1005 01:39:17.199744 18133 slave.cpp:1055] Authenticating with master master@172.17.0.3:36792
3: I1005 01:39:17.199810 18133 slave.cpp:1064] Using default CRAM-MD5 authenticatee
3: I1005 01:39:17.199993 18134 authenticatee.cpp:121] Creating new client SASL connection
3: I1005 01:39:17.200235 18142 master.cpp:7897] Authenticating slave(178)@172.17.0.3:36792
3: I1005 01:39:17.200373 18123 authenticator.cpp:414] Starting authentication session for
crammd5-authenticatee(387)@172.17.0.3:36792
3: I1005 01:39:17.200584 18139 authenticator.cpp:98] Creating new server SASL connection
3: I1005 01:39:17.200757 18128 authenticatee.cpp:213] Received SASL authentication mechanisms:
CRAM-MD5
3: I1005 01:39:17.200778 18128 authenticatee.cpp:239] Attempting to authenticate with mechanism
'CRAM-MD5'
3: I1005 01:39:17.200868 18132 authenticator.cpp:204] Received SASL authentication start
3: I1005 01:39:17.200918 18132 authenticator.cpp:326] Authentication requires more steps
3: I1005 01:39:17.201009 18119 authenticatee.cpp:259] Received SASL authentication step
3: I1005 01:39:17.201117 18121 authenticator.cpp:232] Received SASL authentication step
3: I1005 01:39:17.201143 18121 auxprop.cpp:109] Request to lookup properties for user: 'test-principal'
realm: '485720b43777' server FQDN: '485720b43777' SASL_AUXPROP_VERIFY_AGAINST_HASH: false
SASL_AUXPROP_OVERRIDE: false SASL_AUXPROP_AUTHZID: false 
3: I1005 01:39:17.201151 18121 auxprop.cpp:181] Looking up auxiliary property '*userPassword'
3: I1005 01:39:17.201174 18121 auxprop.cpp:181] Looking up auxiliary property '*cmusaslsecretCRAM-MD5'
3: I1005 01:39:17.201191 18121 auxprop.cpp:109] Request to lookup properties for user: 'test-principal'
realm: '485720b43777' server FQDN: '485720b43777' SASL_AUXPROP_VERIFY_AGAINST_HASH: false
SASL_AUXPROP_OVERRIDE: false SASL_AUXPROP_AUTHZID: true 
3: I1005 01:39:17.201198 18121 auxprop.cpp:131] Skipping auxiliary property '*userPassword'
since SASL_AUXPROP_AUTHZID == true
3: I1005 01:39:17.201207 18121 auxprop.cpp:131] Skipping auxiliary property '*cmusaslsecretCRAM-MD5'
since SASL_AUXPROP_AUTHZID == true
3: I1005 01:39:17.201222 18121 authenticator.cpp:318] Authentication success
3: I1005 01:39:17.201295 18129 authenticatee.cpp:299] Authentication success
3: I1005 01:39:17.201341 18136 master.cpp:7927] Successfully authenticated principal 'test-principal'
at slave(178)@172.17.0.3:36792
3: I1005 01:39:17.201382 18138 authenticator.cpp:432] Authentication session cleanup for crammd5-authenticatee(387)@172.17.0.3:36792
3: I1005 01:39:17.201553 18126 slave.cpp:1147] Successfully authenticated with master master@172.17.0.3:36792
3: I1005 01:39:17.201751 18126 slave.cpp:1626] Will retry registration in 13.855581ms if necessary
3: I1005 01:39:17.201911 18135 master.cpp:5801] Received register agent message from slave(178)@172.17.0.3:36792
(485720b43777)
3: I1005 01:39:17.202046 18135 master.cpp:3838] Authorizing agent with principal 'test-principal'
3: I1005 01:39:17.202394 18122 master.cpp:5861] Authorized registration of agent at slave(178)@172.17.0.3:36792
(485720b43777)
3: I1005 01:39:17.202488 18122 master.cpp:5954] Registering agent at slave(178)@172.17.0.3:36792
(485720b43777) with id 3554a905-60f7-4d9c-934e-e07c4ecf1b68-S0
3: I1005 01:39:17.202859 18140 registrar.cpp:495] Applied 1 operations in 49169ns; attempting
to update the registry
3: I1005 01:39:17.203497 18140 registrar.cpp:552] Successfully updated the registry in 568064ns
3: I1005 01:39:17.203794 18133 master.cpp:6001] Admitted agent 3554a905-60f7-4d9c-934e-e07c4ecf1b68-S0
at slave(178)@172.17.0.3:36792 (485720b43777)
3: I1005 01:39:17.204273 18142 slave.cpp:4966] Received ping from slave-observer(170)@172.17.0.3:36792
3: I1005 01:39:17.204426 18142 slave.cpp:1193] Registered with master master@172.17.0.3:36792;
given agent ID 3554a905-60f7-4d9c-934e-e07c4ecf1b68-S0
3: I1005 01:39:17.204511 18128 status_update_manager.cpp:184] Resuming sending status updates
3: I1005 01:39:17.204321 18133 master.cpp:6032] Registered agent 3554a905-60f7-4d9c-934e-e07c4ecf1b68-S0
at slave(178)@172.17.0.3:36792 (485720b43777) with [{"name":"cpus","scalar":{"value":2.0},"type":"SCALAR"},{"name":"mem","scalar":{"value":1024.0},"type":"SCALAR"},{"name":"disk","scalar":{"value":1024.0},"type":"SCALAR"},{"name":"ports","ranges":{"range":[{"begin":31000,"end":32000}]},"type":"RANGES"}]
3: I1005 01:39:17.204713 18123 hierarchical.cpp:593] Added agent 3554a905-60f7-4d9c-934e-e07c4ecf1b68-S0
(485720b43777) with cpus:2; mem:1024; disk:1024; ports:[31000-32000] (allocated: {})
3: I1005 01:39:17.204743 18142 slave.cpp:1213] Checkpointing SlaveInfo to '/tmp/SlaveTest_ContainersEndpoint_ruCcCM/meta/slaves/3554a905-60f7-4d9c-934e-e07c4ecf1b68-S0/slave.info'
3: I1005 01:39:17.205082 18142 slave.cpp:1262] Forwarding total oversubscribed resources {}
3: I1005 01:39:17.205225 18132 master.cpp:6796] Received update of agent 3554a905-60f7-4d9c-934e-e07c4ecf1b68-S0
at slave(178)@172.17.0.3:36792 (485720b43777) with total oversubscribed resources {}
3: I1005 01:39:17.205777 18123 hierarchical.cpp:2033] No inverse offers to send out!
3: I1005 01:39:17.205827 18123 hierarchical.cpp:1486] Performed allocation for 1 agents in
968166ns
3: I1005 01:39:17.205977 18123 hierarchical.cpp:660] Agent 3554a905-60f7-4d9c-934e-e07c4ecf1b68-S0
(485720b43777) updated with total resources cpus:2; mem:1024; disk:1024; ports:[31000-32000]
3: I1005 01:39:17.206203 18119 master.cpp:7727] Sending 1 offers to framework 3554a905-60f7-4d9c-934e-e07c4ecf1b68-0000
(default) at scheduler-8ddd10cb-45bc-442f-b695-9e04eb7e129a@172.17.0.3:36792
3: I1005 01:39:17.206638 18121 sched.cpp:917] Scheduler::resourceOffers took 92441ns
3: I1005 01:39:17.208509 18135 master.cpp:9350] Removing offer 3554a905-60f7-4d9c-934e-e07c4ecf1b68-O0
3: I1005 01:39:17.208647 18135 master.cpp:4196] Processing ACCEPT call for offers: [ 3554a905-60f7-4d9c-934e-e07c4ecf1b68-O0
] on agent 3554a905-60f7-4d9c-934e-e07c4ecf1b68-S0 at slave(178)@172.17.0.3:36792 (485720b43777)
for framework 3554a905-60f7-4d9c-934e-e07c4ecf1b68-0000 (default) at scheduler-8ddd10cb-45bc-442f-b695-9e04eb7e129a@172.17.0.3:36792
3: I1005 01:39:17.208735 18135 master.cpp:3565] Authorizing framework principal 'test-principal'
to launch task 1
3: I1005 01:39:17.208966 18135 master.cpp:3565] Authorizing framework principal 'test-principal'
to launch task 2
3: W1005 01:39:17.210621 18120 validation.cpp:1338] Executor 'executor-1' for task '1' uses
less CPUs (None) than the minimum required (0.01). Please update your executor, as this will
be mandatory in future releases.
3: W1005 01:39:17.210651 18120 validation.cpp:1350] Executor 'executor-1' for task '1' uses
less memory (None) than the minimum required (32MB). Please update your executor, as this
will be mandatory in future releases.
3: I1005 01:39:17.211222 18120 master.cpp:10096] Adding task 1 with resources [{"allocation_info":{"role":"*"},"name":"cpus","scalar":{"value":1.0},"type":"SCALAR"},{"allocation_info":{"role":"*"},"name":"mem","scalar":{"value":512.0},"type":"SCALAR"}]
on agent 3554a905-60f7-4d9c-934e-e07c4ecf1b68-S0 at slave(178)@172.17.0.3:36792 (485720b43777)
3: I1005 01:39:17.211730 18120 master.cpp:4879] Launching task 1 of framework 3554a905-60f7-4d9c-934e-e07c4ecf1b68-0000
(default) at scheduler-8ddd10cb-45bc-442f-b695-9e04eb7e129a@172.17.0.3:36792 with resources
[{"allocation_info":{"role":"*"},"name":"cpus","scalar":{"value":1.0},"type":"SCALAR"},{"allocation_info":{"role":"*"},"name":"mem","scalar":{"value":512.0},"type":"SCALAR"}]
on agent 3554a905-60f7-4d9c-934e-e07c4ecf1b68-S0 at slave(178)@172.17.0.3:36792 (485720b43777)
3: I1005 01:39:17.212265 18131 slave.cpp:1747] Got assigned task '1' for framework 3554a905-60f7-4d9c-934e-e07c4ecf1b68-0000
3: W1005 01:39:17.212828 18120 validation.cpp:1338] Executor 'executor-2' for task '2' uses
less CPUs (None) than the minimum required (0.01). Please update your executor, as this will
be mandatory in future releases.
3: W1005 01:39:17.212854 18120 validation.cpp:1350] Executor 'executor-2' for task '2' uses
less memory (None) than the minimum required (32MB). Please update your executor, as this
will be mandatory in future releases.
3: I1005 01:39:17.212877 18131 slave.cpp:2015] Authorizing task '1' for framework 3554a905-60f7-4d9c-934e-e07c4ecf1b68-0000
3: I1005 01:39:17.212923 18131 slave.cpp:6809] Authorizing framework principal 'test-principal'
to launch task 1
3: I1005 01:39:17.213228 18120 master.cpp:10096] Adding task 2 with resources [{"allocation_info":{"role":"*"},"name":"cpus","scalar":{"value":1.0},"type":"SCALAR"},{"allocation_info":{"role":"*"},"name":"mem","scalar":{"value":512.0},"type":"SCALAR"}]
on agent 3554a905-60f7-4d9c-934e-e07c4ecf1b68-S0 at slave(178)@172.17.0.3:36792 (485720b43777)
3: I1005 01:39:17.213547 18139 slave.cpp:2183] Launching task '1' for framework 3554a905-60f7-4d9c-934e-e07c4ecf1b68-0000
3: I1005 01:39:17.213547 18120 master.cpp:4879] Launching task 2 of framework 3554a905-60f7-4d9c-934e-e07c4ecf1b68-0000
(default) at scheduler-8ddd10cb-45bc-442f-b695-9e04eb7e129a@172.17.0.3:36792 with resources
[{"allocation_info":{"role":"*"},"name":"cpus","scalar":{"value":1.0},"type":"SCALAR"},{"allocation_info":{"role":"*"},"name":"mem","scalar":{"value":512.0},"type":"SCALAR"}]
on agent 3554a905-60f7-4d9c-934e-e07c4ecf1b68-S0 at slave(178)@172.17.0.3:36792 (485720b43777)
3: I1005 01:39:17.214094 18139 paths.cpp:594] Trying to chown '/tmp/SlaveTest_ContainersEndpoint_ruCcCM/slaves/3554a905-60f7-4d9c-934e-e07c4ecf1b68-S0/frameworks/3554a905-60f7-4d9c-934e-e07c4ecf1b68-0000/executors/executor-1/runs/8f5dfa83-b448-4b2a-b249-484efbe6793f'
to user 'mesos'
3: I1005 01:39:17.214331 18139 slave.cpp:7271] Launching executor 'executor-1' of framework
3554a905-60f7-4d9c-934e-e07c4ecf1b68-0000 with resources [] in work directory '/tmp/SlaveTest_ContainersEndpoint_ruCcCM/slaves/3554a905-60f7-4d9c-934e-e07c4ecf1b68-S0/frameworks/3554a905-60f7-4d9c-934e-e07c4ecf1b68-0000/executors/executor-1/runs/8f5dfa83-b448-4b2a-b249-484efbe6793f'
3: I1005 01:39:17.215186 18139 slave.cpp:2411] Queued task '1' for executor 'executor-1' of
framework 3554a905-60f7-4d9c-934e-e07c4ecf1b68-0000
3: I1005 01:39:17.215350 18133 hierarchical.cpp:887] Updated allocation of framework 3554a905-60f7-4d9c-934e-e07c4ecf1b68-0000
on agent 3554a905-60f7-4d9c-934e-e07c4ecf1b68-S0 from cpus(allocated: *):2; mem(allocated:
*):1024; disk(allocated: *):1024; ports(allocated: *):[31000-32000] to cpus(allocated: *):2;
mem(allocated: *):1024; disk(allocated: *):1024; ports(allocated: *):[31000-32000]
3: I1005 01:39:17.215414 18139 slave.cpp:1747] Got assigned task '2' for framework 3554a905-60f7-4d9c-934e-e07c4ecf1b68-0000
3: I1005 01:39:17.215854 18139 slave.cpp:944] Successfully attached '/tmp/SlaveTest_ContainersEndpoint_ruCcCM/slaves/3554a905-60f7-4d9c-934e-e07c4ecf1b68-S0/frameworks/3554a905-60f7-4d9c-934e-e07c4ecf1b68-0000/executors/executor-1/runs/8f5dfa83-b448-4b2a-b249-484efbe6793f'
to virtual path '/tmp/SlaveTest_ContainersEndpoint_ruCcCM/slaves/3554a905-60f7-4d9c-934e-e07c4ecf1b68-S0/frameworks/3554a905-60f7-4d9c-934e-e07c4ecf1b68-0000/executors/executor-1/runs/latest'
3: I1005 01:39:17.215896 18139 slave.cpp:944] Successfully attached '/tmp/SlaveTest_ContainersEndpoint_ruCcCM/slaves/3554a905-60f7-4d9c-934e-e07c4ecf1b68-S0/frameworks/3554a905-60f7-4d9c-934e-e07c4ecf1b68-0000/executors/executor-1/runs/8f5dfa83-b448-4b2a-b249-484efbe6793f'
to virtual path '/frameworks/3554a905-60f7-4d9c-934e-e07c4ecf1b68-0000/executors/executor-1/runs/latest'
3: I1005 01:39:17.215925 18139 slave.cpp:944] Successfully attached '/tmp/SlaveTest_ContainersEndpoint_ruCcCM/slaves/3554a905-60f7-4d9c-934e-e07c4ecf1b68-S0/frameworks/3554a905-60f7-4d9c-934e-e07c4ecf1b68-0000/executors/executor-1/runs/8f5dfa83-b448-4b2a-b249-484efbe6793f'
to virtual path '/tmp/SlaveTest_ContainersEndpoint_ruCcCM/slaves/3554a905-60f7-4d9c-934e-e07c4ecf1b68-S0/frameworks/3554a905-60f7-4d9c-934e-e07c4ecf1b68-0000/executors/executor-1/runs/8f5dfa83-b448-4b2a-b249-484efbe6793f'
3: I1005 01:39:17.215986 18133 hierarchical.cpp:1161] Recovered ports(allocated: *):[31000-32000];
disk(allocated: *):1024 (total: cpus:2; mem:1024; disk:1024; ports:[31000-32000], allocated:
cpus(allocated: *):2; mem(allocated: *):1024) on agent 3554a905-60f7-4d9c-934e-e07c4ecf1b68-S0
from framework 3554a905-60f7-4d9c-934e-e07c4ecf1b68-0000
3: I1005 01:39:17.216042 18133 hierarchical.cpp:1207] Framework 3554a905-60f7-4d9c-934e-e07c4ecf1b68-0000
filtered agent 3554a905-60f7-4d9c-934e-e07c4ecf1b68-S0 for 5secs
3: I1005 01:39:17.216156 18139 slave.cpp:2874] Launching container 8f5dfa83-b448-4b2a-b249-484efbe6793f
for executor 'executor-1' of framework 3554a905-60f7-4d9c-934e-e07c4ecf1b68-0000
3: I1005 01:39:17.216485 18139 slave.cpp:2015] Authorizing task '2' for framework 3554a905-60f7-4d9c-934e-e07c4ecf1b68-0000
3: I1005 01:39:17.216528 18139 slave.cpp:6809] Authorizing framework principal 'test-principal'
to launch task 2
3: I1005 01:39:17.217115 18136 slave.cpp:2183] Launching task '2' for framework 3554a905-60f7-4d9c-934e-e07c4ecf1b68-0000
3: I1005 01:39:17.217473 18136 paths.cpp:594] Trying to chown '/tmp/SlaveTest_ContainersEndpoint_ruCcCM/slaves/3554a905-60f7-4d9c-934e-e07c4ecf1b68-S0/frameworks/3554a905-60f7-4d9c-934e-e07c4ecf1b68-0000/executors/executor-2/runs/07f17c38-76ba-47af-accd-d8081ca97307'
to user 'mesos'
3: I1005 01:39:17.217684 18136 slave.cpp:7271] Launching executor 'executor-2' of framework
3554a905-60f7-4d9c-934e-e07c4ecf1b68-0000 with resources [] in work directory '/tmp/SlaveTest_ContainersEndpoint_ruCcCM/slaves/3554a905-60f7-4d9c-934e-e07c4ecf1b68-S0/frameworks/3554a905-60f7-4d9c-934e-e07c4ecf1b68-0000/executors/executor-2/runs/07f17c38-76ba-47af-accd-d8081ca97307'
3: I1005 01:39:17.218358 18136 slave.cpp:2411] Queued task '2' for executor 'executor-2' of
framework 3554a905-60f7-4d9c-934e-e07c4ecf1b68-0000
3: I1005 01:39:17.218425 18136 slave.cpp:944] Successfully attached '/tmp/SlaveTest_ContainersEndpoint_ruCcCM/slaves/3554a905-60f7-4d9c-934e-e07c4ecf1b68-S0/frameworks/3554a905-60f7-4d9c-934e-e07c4ecf1b68-0000/executors/executor-2/runs/07f17c38-76ba-47af-accd-d8081ca97307'
to virtual path '/tmp/SlaveTest_ContainersEndpoint_ruCcCM/slaves/3554a905-60f7-4d9c-934e-e07c4ecf1b68-S0/frameworks/3554a905-60f7-4d9c-934e-e07c4ecf1b68-0000/executors/executor-2/runs/latest'
3: I1005 01:39:17.218467 18136 slave.cpp:944] Successfully attached '/tmp/SlaveTest_ContainersEndpoint_ruCcCM/slaves/3554a905-60f7-4d9c-934e-e07c4ecf1b68-S0/frameworks/3554a905-60f7-4d9c-934e-e07c4ecf1b68-0000/executors/executor-2/runs/07f17c38-76ba-47af-accd-d8081ca97307'
to virtual path '/frameworks/3554a905-60f7-4d9c-934e-e07c4ecf1b68-0000/executors/executor-2/runs/latest'
3: I1005 01:39:17.218497 18136 slave.cpp:944] Successfully attached '/tmp/SlaveTest_ContainersEndpoint_ruCcCM/slaves/3554a905-60f7-4d9c-934e-e07c4ecf1b68-S0/frameworks/3554a905-60f7-4d9c-934e-e07c4ecf1b68-0000/executors/executor-2/runs/07f17c38-76ba-47af-accd-d8081ca97307'
to virtual path '/tmp/SlaveTest_ContainersEndpoint_ruCcCM/slaves/3554a905-60f7-4d9c-934e-e07c4ecf1b68-S0/frameworks/3554a905-60f7-4d9c-934e-e07c4ecf1b68-0000/executors/executor-2/runs/07f17c38-76ba-47af-accd-d8081ca97307'
3: *** Aborted at 1507167557 (unix time) try "date -d @1507167557" if you are using GNU date
***
3: W1005 01:39:17.218974 18132 process.cpp:3194] Attempted to spawn already running process
version@172.17.0.3:36792
3: I1005 01:39:17.219141 18132 exec.cpp:162] Version: 1.5.0
3: PC: @     0x7f2e7208a0ed __GI_getenv
3: I1005 01:39:17.219419 18138 exec.cpp:212] Executor started at: executor(54)@172.17.0.3:36792
with pid 18118
3: *** SIGSEGV (@0x21) received by PID 18118 (TID 0x7f2e63c02700) from PID 33; stack trace:
***
3:     @     0x7f2e762f05e0 (unknown)
3:     @     0x7f2e7208a0ed __GI_getenv
3:     @           0xd85f9b os::getenv()
3:     @     0x7f2e7c862480 mesos::internal::slave::executorEnvironment()
3:     @     0x7f2e7c836aff mesos::internal::slave::Slave::launchExecutor()
3:     @     0x7f2e7c8b8eea _ZZN7process8dispatchIN5mesos8internal5slave5SlaveERK6OptionINS_6FutureINS1_6SecretEEEERKNS1_11FrameworkIDERKNS1_10ExecutorIDERKS5_INS1_8TaskInfoEESB_SE_SH_SL_EEvRKNS_3PIDIT_EEMSN_FvT0_T1_T2_T3_EOT4_OT5_OT6_OT7_ENKUlRS9_RSC_RSF_RSJ_PNS_11ProcessBaseEE_clES15_S16_S17_S18_S1A_
3:     @     0x7f2e7c948461 _ZNSt5_BindIFZN7process8dispatchIN5mesos8internal5slave5SlaveERK6OptionINS0_6FutureINS2_6SecretEEEERKNS2_11FrameworkIDERKNS2_10ExecutorIDERKS6_INS2_8TaskInfoEESC_SF_SI_SM_EEvRKNS0_3PIDIT_EEMSO_FvT0_T1_T2_T3_EOT4_OT5_OT6_OT7_EUlRSA_RSD_RSG_RSK_PNS0_11ProcessBaseEE_SA_SD_SG_SK_St12_PlaceholderILi1EEEE6__callIvIOS1B_EILm0ELm1ELm2ELm3ELm4EEEET_OSt5tupleIIDpT0_EESt12_Index_tupleIIXspT1_EEE
3:     @     0x7f2e7c92e6e4 _ZNSt5_BindIFZN7process8dispatchIN5mesos8internal5slave5SlaveERK6OptionINS0_6FutureINS2_6SecretEEEERKNS2_11FrameworkIDERKNS2_10ExecutorIDERKS6_INS2_8TaskInfoEESC_SF_SI_SM_EEvRKNS0_3PIDIT_EEMSO_FvT0_T1_T2_T3_EOT4_OT5_OT6_OT7_EUlRSA_RSD_RSG_RSK_PNS0_11ProcessBaseEE_SA_SD_SG_SK_St12_PlaceholderILi1EEEEclIIS1B_EvEET0_DpOT_
3:     @     0x7f2e7c90dd0c _ZNSt17_Function_handlerIFvPN7process11ProcessBaseEESt5_BindIFZNS0_8dispatchIN5mesos8internal5slave5SlaveERK6OptionINS0_6FutureINS6_6SecretEEEERKNS6_11FrameworkIDERKNS6_10ExecutorIDERKSA_INS6_8TaskInfoEESG_SJ_SM_SQ_EEvRKNS0_3PIDIT_EEMSS_FvT0_T1_T2_T3_EOT4_OT5_OT6_OT7_EUlRSE_RSH_RSK_RSO_S2_E_SE_SH_SK_SO_St12_PlaceholderILi1EEEEE9_M_invokeERKSt9_Any_dataS2_
3:     @     0x7f2e776cba63 std::function<>::operator()()
3:     @     0x7f2e7769e20b process::ProcessBase::visit()
3:     @     0x7f2e776acbb6 process::DispatchEvent::visit()
3:     @           0xc92f02 process::ProcessBase::serve()
3:     @     0x7f2e7769b549 process::ProcessManager::resume()
3:     @     0x7f2e7769799e _ZZN7process14ProcessManager12init_threadsEvENKUlvE_clEv
3:     @     0x7f2e776aaa44 _ZNSt12_Bind_simpleIFZN7process14ProcessManager12init_threadsEvEUlvE_vEE9_M_invokeIIEEEvSt12_Index_tupleIIXspT_EEE
3:     @     0x7f2e776aa988 _ZNSt12_Bind_simpleIFZN7process14ProcessManager12init_threadsEvEUlvE_vEEclEv
3:     @     0x7f2e776aa912 _ZNSt6thread5_ImplISt12_Bind_simpleIFZN7process14ProcessManager12init_threadsEvEUlvE_vEEE6_M_runEv
3:     @     0x7f2e729e22b0 (unknown)
3:     @     0x7f2e762e8e25 start_thread
3:     @     0x7f2e7214a34d __clone
3/3 Test #3: MesosTests .......................***Exception: SegFault 82.55 sec

67% tests passed, 1 tests failed out of 3

Total Test time (real) = 112.64 sec

The following tests FAILED:
	  3 - MesosTests (SEGFAULT)
Errors while running CTest
make[3]: *** [CMakeFiles/check] Error 8
make[3]: Leaving directory `/mesos/build'
make[2]: *** [CMakeFiles/check.dir/all] Error 2
make[2]: Leaving directory `/mesos/build'
make[1]: *** [CMakeFiles/check.dir/rule] Error 2
make[1]: Leaving directory `/mesos/build'
make: *** [check] Error 2
+ docker rmi mesos-1507165880-30432
Untagged: mesos-1507165880-30432:latest
Deleted: sha256:9c5b97830895cfd27038ddf95fe5d5b55e0bdb5fc71c7bccc73f9ab05104dc52
Deleted: sha256:f260166c9b37e4d31dd7c950bb8ca061c0c8b96f101fa72f32508aced97ec43d
Deleted: sha256:d33f64afd70a65dea990eb48514e53f3e31fca5864d590c0bd95dbcd626a70bf
Deleted: sha256:918d1f123cf43ee26e720c2f965f0e3e35617fb9f62939889beeaac6314a1f95
Deleted: sha256:d492fe7b295338695041a117b474bb032e011a855b2bbdaed91fc832acded978
Deleted: sha256:59de13771d9af21ef1e5b8086ca6705d6d07113ad77e7779f92d21a2800b56cd
Deleted: sha256:982762047ead3b5a2e59cd944d489bf13707f2e6c6843d68f32619b127ea660f
Deleted: sha256:6fe734af3cb9be0fd33c283e3ebbce604b9875591461b56b39e6d6c4e9db9b91
Deleted: sha256:48a3cf7dca653d2e5e832ddb07e7b39da98ebf2ce4412a1c61137e2a1dbb5b20
Deleted: sha256:436a5201872c8d32add1a8c58583ce49fbe9394e8bd4c15fc8b95a108d5658ed
Deleted: sha256:12830d3ea9c9f14fc0b885d6efc09e57ca9a38c74228f9125ef1c04ddb878876
Deleted: sha256:491773d945ae83881efea92a4779d9c3d23e571fd56059286ee4a20f4c5088b2
Deleted: sha256:05bed898fcf55d0f99dffa8df936481c3739fa0f06da22a37e4d6fd8806d9be0
Deleted: sha256:c61b30f35e646ea9bfc90d0d279c0d44d3cdff5daaa7f0478c740531fcc69936
Deleted: sha256:13a8f14ef2a7ff42e1927cc0399c5d178d27d201f055a15ed9a1fb7cee1a4724
Deleted: sha256:0d0c5e07091535e9aef9b3ac0b2ed2b7bb8e52a54284220f9369561bec708c97
Deleted: sha256:83503186348b1295da82d401a8ddd0fd490465e592c1c4273a7d2ce59adf93e9
Deleted: sha256:6b0532abdf503d805c49e0cf3365dc2458af438745f03a92eb8e5d75fafe72cf
Deleted: sha256:1c159ec7883c52fcd1c3561e81aaa887a3936545e0c5f44bd89916f8489c6383
Deleted: sha256:60c6c81544ff9efdaabf9528434e05a04a41d104224d6db9d11f6e8614961508
Deleted: sha256:a7dc926e6f79af9e2c941e79390074c75c47edb42e473926087deda49a9f9aa8
Deleted: sha256:98c27ac87bb9f8addb6f1d728349767496c5527cf1bd6aaf0235009282e503a9
Deleted: sha256:9060014ee79013a61500a446ddf7442a9d977b9790d4e972e8886b3014081044
Deleted: sha256:166d15745c5da886bf934b4789d972c1463c01d3da5766e1047c8293d2042b13
Deleted: sha256:d3c15e2f3c43781be402d69c7b3b20a215c35491844c0356e22f373d5937186d
Deleted: sha256:c9f55ee8435e2923a4f466eaaafb8e68112fa6c1bc3a93c4eb16d1918ebdb89b
Deleted: sha256:ebb29819f70d1f5eaa250fafce04a973232672fb631970d8fff650db6b89df16
Deleted: sha256:4d07249d76aae64d4e662486374a3b62f60a2349f4015d479ebc5f46f507f185
Deleted: sha256:3e47e13d3a0f05622cbfd87fac0a00e08f096ef7fee4d92de5fff65b546481b6
Build step 'Execute shell' marked build as failure

Mime
View raw message