mesos-builds mailing list archives

Site index · List index
Message view « Date » · « Thread »
Top « Date » · « Thread »
From Apache Jenkins Server <jenk...@builds.apache.org>
Subject Build failed in Jenkins: Mesos-Buildbot » autotools,gcc,--verbose --disable-libtool-wrappers --enable-libevent --enable-ssl,GLOG_v=1 MESOS_VERBOSE=1,ubuntu:14.04,(ubuntu)&&(!ubuntu-us1)&&(!ubuntu-eu2)&&(!qnode3)&&(!H23) #4357
Date Mon, 23 Oct 2017 04:45:09 GMT
See <https://builds.apache.org/job/Mesos-Buildbot/BUILDTOOL=autotools,COMPILER=gcc,CONFIGURATION=--verbose%20--disable-libtool-wrappers%20--enable-libevent%20--enable-ssl,ENVIRONMENT=GLOG_v=1%20MESOS_VERBOSE=1,OS=ubuntu%3A14.04,label_exp=(ubuntu)&&(!ubuntu-us1)&&(!ubuntu-eu2)&&(!qnode3)&&(!H23)/4357/display/redirect>

------------------------------------------
[...truncated 2.76 MB...]
as: BFD (GNU Binutils for Ubuntu) 2.24 assertion fail ../../bfd/elf.c:2636
as: BFD (GNU Binutils for Ubuntu) 2.24 assertion fail ../../bfd/elf.c:2636
as: BFD (GNU Binutils for Ubuntu) 2.24 assertion fail ../../bfd/elf.c:2636
as: BFD (GNU Binutils for Ubuntu) 2.24 assertion fail ../../bfd/elf.c:2636
as: BFD (GNU Binutils for Ubuntu) 2.24 assertion fail ../../bfd/elf.c:2636
as: BFD (GNU Binutils for Ubuntu) 2.24 assertion fail ../../bfd/elf.c:2636
as: BFD (GNU Binutils for Ubuntu) 2.24 assertion fail ../../bfd/elf.c:2636
as: BFD (GNU Binutils for Ubuntu) 2.24 assertion fail ../../bfd/elf.c:2636
as: BFD (GNU Binutils for Ubuntu) 2.24 assertion fail ../../bfd/elf.c:2636
as: BFD (GNU Binutils for Ubuntu) 2.24 assertion fail ../../bfd/elf.c:2636
as: BFD (GNU Binutils for Ubuntu) 2.24 assertion fail ../../bfd/elf.c:2636
as: BFD (GNU Binutils for Ubuntu) 2.24 assertion fail ../../bfd/elf.c:2636
as: BFD (GNU Binutils for Ubuntu) 2.24 assertion fail ../../bfd/elf.c:2636
as: BFD (GNU Binutils for Ubuntu) 2.24 assertion fail ../../bfd/elf.c:2636
as: BFD (GNU Binutils for Ubuntu) 2.24 assertion fail ../../bfd/elf.c:2636
as: BFD (GNU Binutils for Ubuntu) 2.24 assertion fail ../../bfd/elf.c:2636
as: BFD (GNU Binutils for Ubuntu) 2.24 assertion fail ../../bfd/elf.c:2636
as: BFD (GNU Binutils for Ubuntu) 2.24 assertion fail ../../bfd/elf.c:2636
as: BFD (GNU Binutils for Ubuntu) 2.24 assertion fail ../../bfd/elf.c:2636
as: BFD (GNU Binutils for Ubuntu) 2.24 assertion fail ../../bfd/elf.c:2636
as: BFD (GNU Binutils for Ubuntu) 2.24 assertion fail ../../bfd/elf.c:2636
as: BFD (GNU Binutils for Ubuntu) 2.24 assertion fail ../../bfd/elf.c:2636
as: BFD (GNU Binutils for Ubuntu) 2.24 assertion fail ../../bfd/elf.c:2636
as: BFD (GNU Binutils for Ubuntu) 2.24 assertion fail ../../bfd/elf.c:2636
as: BFD (GNU Binutils for Ubuntu) 2.24 assertion fail ../../bfd/elf.c:2636
as: BFD (GNU Binutils for Ubuntu) 2.24 assertion fail ../../bfd/elf.c:2636
as: BFD (GNU Binutils for Ubuntu) 2.24 assertion fail ../../bfd/elf.c:2636
as: BFD (GNU Binutils for Ubuntu) 2.24 assertion fail ../../bfd/elf.c:2636
as: BFD (GNU Binutils for Ubuntu) 2.24 assertion fail ../../bfd/elf.c:2636
as: BFD (GNU Binutils for Ubuntu) 2.24 assertion fail ../../bfd/elf.c:2636
as: BFD (GNU Binutils for Ubuntu) 2.24 assertion fail ../../bfd/elf.c:2636
as: BFD (GNU Binutils for Ubuntu) 2.24 assertion fail ../../bfd/elf.c:2636
as: BFD (GNU Binutils for Ubuntu) 2.24 assertion fail ../../bfd/elf.c:2636
as: BFD (GNU Binutils for Ubuntu) 2.24 assertion fail ../../bfd/elf.c:2636
as: BFD (GNU Binutils for Ubuntu) 2.24 assertion fail ../../bfd/elf.c:2636
as: BFD (GNU Binutils for Ubuntu) 2.24 assertion fail ../../bfd/elf.c:2636
as: BFD (GNU Binutils for Ubuntu) 2.24 assertion fail ../../bfd/elf.c:2636
as: BFD (GNU Binutils for Ubuntu) 2.24 assertion fail ../../bfd/elf.c:2636
as: BFD (GNU Binutils for Ubuntu) 2.24 assertion fail ../../bfd/elf.c:2636
as: BFD (GNU Binutils for Ubuntu) 2.24 assertion fail ../../bfd/elf.c:2636
as: BFD (GNU Binutils for Ubuntu) 2.24 assertion fail ../../bfd/elf.c:2636
as: BFD (GNU Binutils for Ubuntu) 2.24 assertion fail ../../bfd/elf.c:2636
as: BFD (GNU Binutils for Ubuntu) 2.24 assertion fail ../../bfd/elf.c:2636
as: BFD (GNU Binutils for Ubuntu) 2.24 assertion fail ../../bfd/elf.c:2636
as: BFD (GNU Binutils for Ubuntu) 2.24 assertion fail ../../bfd/elf.c:2636
as: BFD (GNU Binutils for Ubuntu) 2.24 assertion fail ../../bfd/elf.c:2636
as: BFD (GNU Binutils for Ubuntu) 2.24 assertion fail ../../bfd/elf.c:2636
as: BFD (GNU Binutils for Ubuntu) 2.24 assertion fail ../../bfd/elf.c:2636
as: BFD (GNU Binutils for Ubuntu) 2.24 assertion fail ../../bfd/elf.c:2636
as: BFD (GNU Binutils for Ubuntu) 2.24 assertion fail ../../bfd/elf.c:2636
as: BFD (GNU Binutils for Ubuntu) 2.24 assertion fail ../../bfd/elf.c:2636
as: BFD (GNU Binutils for Ubuntu) 2.24 assertion fail ../../bfd/elf.c:2636
as: BFD (GNU Binutils for Ubuntu) 2.24 assertion fail ../../bfd/elf.c:2636
as: BFD (GNU Binutils for Ubuntu) 2.24 assertion fail ../../bfd/elf.c:2636
as: BFD (GNU Binutils for Ubuntu) 2.24 assertion fail ../../bfd/elf.c:2636
as: BFD (GNU Binutils for Ubuntu) 2.24 assertion fail ../../bfd/elf.c:2636
as: BFD (GNU Binutils for Ubuntu) 2.24 assertion fail ../../bfd/elf.c:2636
as: BFD (GNU Binutils for Ubuntu) 2.24 assertion fail ../../bfd/elf.c:2636
as: BFD (GNU Binutils for Ubuntu) 2.24 assertion fail ../../bfd/elf.c:2636
as: BFD (GNU Binutils for Ubuntu) 2.24 assertion fail ../../bfd/elf.c:2636
as: BFD (GNU Binutils for Ubuntu) 2.24 assertion fail ../../bfd/elf.c:2636
as: BFD (GNU Binutils for Ubuntu) 2.24 assertion fail ../../bfd/elf.c:2636
as: BFD (GNU Binutils for Ubuntu) 2.24 assertion fail ../../bfd/elf.c:2636
as: BFD (GNU Binutils for Ubuntu) 2.24 assertion fail ../../bfd/elf.c:2636
as: BFD (GNU Binutils for Ubuntu) 2.24 assertion fail ../../bfd/elf.c:2636
as: BFD (GNU Binutils for Ubuntu) 2.24 assertion fail ../../bfd/elf.c:2636
as: BFD (GNU Binutils for Ubuntu) 2.24 assertion fail ../../bfd/elf.c:2636
as: BFD (GNU Binutils for Ubuntu) 2.24 assertion fail ../../bfd/elf.c:2636
as: BFD (GNU Binutils for Ubuntu) 2.24 assertion fail ../../bfd/elf.c:2636
as: BFD (GNU Binutils for Ubuntu) 2.24 assertion fail ../../bfd/elf.c:2636
as: BFD (GNU Binutils for Ubuntu) 2.24 assertion fail ../../bfd/elf.c:2636
as: BFD (GNU Binutils for Ubuntu) 2.24 assertion fail ../../bfd/elf.c:2636
as: BFD (GNU Binutils for Ubuntu) 2.24 assertion fail ../../bfd/elf.c:2636
as: BFD (GNU Binutils for Ubuntu) 2.24 assertion fail ../../bfd/elf.c:2636
as: BFD (GNU Binutils for Ubuntu) 2.24 assertion fail ../../bfd/elf.c:2636
as: BFD (GNU Binutils for Ubuntu) 2.24 assertion fail ../../bfd/elf.c:2636
as: BFD (GNU Binutils for Ubuntu) 2.24 assertion fail ../../bfd/elf.c:2636
as: BFD (GNU Binutils for Ubuntu) 2.24 assertion fail ../../bfd/elf.c:2636
as: BFD (GNU Binutils for Ubuntu) 2.24 assertion fail ../../bfd/elf.c:2636
as: BFD (GNU Binutils for Ubuntu) 2.24 assertion fail ../../bfd/elf.c:2636
as: BFD (GNU Binutils for Ubuntu) 2.24 assertion fail ../../bfd/elf.c:2636
as: BFD (GNU Binutils for Ubuntu) 2.24 assertion fail ../../bfd/elf.c:2636
as: BFD (GNU Binutils for Ubuntu) 2.24 assertion fail ../../bfd/elf.c:2636
as: BFD (GNU Binutils for Ubuntu) 2.24 assertion fail ../../bfd/elf.c:2636
as: BFD (GNU Binutils for Ubuntu) 2.24 assertion fail ../../bfd/elf.c:2636
as: BFD (GNU Binutils for Ubuntu) 2.24 assertion fail ../../bfd/elf.c:2636
as: BFD (GNU Binutils for Ubuntu) 2.24 assertion fail ../../bfd/elf.c:2636
as: BFD (GNU Binutils for Ubuntu) 2.24 assertion fail ../../bfd/elf.c:2636
as: BFD (GNU Binutils for Ubuntu) 2.24 assertion fail ../../bfd/elf.c:2636
as: BFD (GNU Binutils for Ubuntu) 2.24 assertion fail ../../bfd/elf.c:2636
as: BFD (GNU Binutils for Ubuntu) 2.24 assertion fail ../../bfd/elf.c:2636
as: BFD (GNU Binutils for Ubuntu) 2.24 assertion fail ../../bfd/elf.c:2636
as: BFD (GNU Binutils for Ubuntu) 2.24 assertion fail ../../bfd/elf.c:2636
as: BFD (GNU Binutils for Ubuntu) 2.24 assertion fail ../../bfd/elf.c:2636
as: BFD (GNU Binutils for Ubuntu) 2.24 assertion fail ../../bfd/elf.c:2636
as: BFD (GNU Binutils for Ubuntu) 2.24 assertion fail ../../bfd/elf.c:2636
as: BFD (GNU Binutils for Ubuntu) 2.24 assertion fail ../../bfd/elf.c:2636
as: BFD (GNU Binutils for Ubuntu) 2.24 assertion fail ../../bfd/elf.c:2636
as: BFD (GNU Binutils for Ubuntu) 2.24 assertion fail ../../bfd/elf.c:2636
as: BFD (GNU Binutils for Ubuntu) 2.24 assertion fail ../../bfd/elf.c:2636
as: BFD (GNU Binutils for Ubuntu) 2.24 assertion fail ../../bfd/elf.c:2636
as: BFD (GNU Binutils for Ubuntu) 2.24 assertion fail ../../bfd/elf.c:2636
as: BFD (GNU Binutils for Ubuntu) 2.24 assertion fail ../../bfd/elf.c:2636
as: BFD (GNU Binutils for Ubuntu) 2.24 assertion fail ../../bfd/elf.c:2636
as: BFD (GNU Binutils for Ubuntu) 2.24 assertion fail ../../bfd/elf.c:2636
as: BFD (GNU Binutils for Ubuntu) 2.24 assertion fail ../../bfd/elf.c:2636
as: BFD (GNU Binutils for Ubuntu) 2.24 assertion fail ../../bfd/elf.c:2636
as: BFD (GNU Binutils for Ubuntu) 2.24 assertion fail ../../bfd/elf.c:2636
as: BFD (GNU Binutils for Ubuntu) 2.24 assertion fail ../../bfd/elf.c:2636
as: BFD (GNU Binutils for Ubuntu) 2.24 assertion fail ../../bfd/elf.c:2636
as: BFD (GNU Binutils for Ubuntu) 2.24 assertion fail ../../bfd/elf.c:2636
as: BFD (GNU Binutils for Ubuntu) 2.24 assertion fail ../../bfd/elf.c:2636
as: BFD (GNU Binutils for Ubuntu) 2.24 assertion fail ../../bfd/elf.c:2636
as: BFD (GNU Binutils for Ubuntu) 2.24 assertion fail ../../bfd/elf.c:2636
as: BFD (GNU Binutils for Ubuntu) 2.24 assertion fail ../../bfd/elf.c:2636
as: BFD (GNU Binutils for Ubuntu) 2.24 assertion fail ../../bfd/elf.c:2636
as: BFD (GNU Binutils for Ubuntu) 2.24 assertion fail ../../bfd/elf.c:2636
as: BFD (GNU Binutils for Ubuntu) 2.24 assertion fail ../../bfd/elf.c:2636
as: BFD (GNU Binutils for Ubuntu) 2.24 assertion fail ../../bfd/elf.c:2636
as: BFD (GNU Binutils for Ubuntu) 2.24 assertion fail ../../bfd/elf.c:2636
as: BFD (GNU Binutils for Ubuntu) 2.24 assertion fail ../../bfd/elf.c:2636
as: BFD (GNU Binutils for Ubuntu) 2.24 assertion fail ../../bfd/elf.c:2636
as: BFD (GNU Binutils for Ubuntu) 2.24 assertion fail ../../bfd/elf.c:2636
as: BFD (GNU Binutils for Ubuntu) 2.24 assertion fail ../../bfd/elf.c:2636
as: BFD (GNU Binutils for Ubuntu) 2.24 assertion fail ../../bfd/elf.c:2636
as: BFD (GNU Binutils for Ubuntu) 2.24 assertion fail ../../bfd/elf.c:2636
as: BFD (GNU Binutils for Ubuntu) 2.24 assertion fail ../../bfd/elf.c:2636
as: BFD (GNU Binutils for Ubuntu) 2.24 assertion fail ../../bfd/elf.c:2636
as: BFD (GNU Binutils for Ubuntu) 2.24 assertion fail ../../bfd/elf.c:2636
as: BFD (GNU Binutils for Ubuntu) 2.24 assertion fail ../../bfd/elf.c:2636
as: BFD (GNU Binutils for Ubuntu) 2.24 assertion fail ../../bfd/elf.c:2636
as: BFD (GNU Binutils for Ubuntu) 2.24 assertion fail ../../bfd/elf.c:2636
as: BFD (GNU Binutils for Ubuntu) 2.24 assertion fail ../../bfd/elf.c:2636
as: BFD (GNU Binutils for Ubuntu) 2.24 assertion fail ../../bfd/elf.c:2636
as: BFD (GNU Binutils for Ubuntu) 2.24 assertion fail ../../bfd/elf.c:2636
as: BFD (GNU Binutils for Ubuntu) 2.24 assertion fail ../../bfd/elf.c:2636
as: BFD (GNU Binutils for Ubuntu) 2.24 assertion fail ../../bfd/elf.c:2636
as: BFD (GNU Binutils for Ubuntu) 2.24 assertion fail ../../bfd/elf.c:2636
as: BFD (GNU Binutils for Ubuntu) 2.24 assertion fail ../../bfd/elf.c:2636
as: BFD (GNU Binutils for Ubuntu) 2.24 assertion fail ../../bfd/elf.c:2636
as: BFD (GNU Binutils for Ubuntu) 2.24 assertion fail ../../bfd/elf.c:2636
as: BFD (GNU Binutils for Ubuntu) 2.24 assertion fail ../../bfd/elf.c:2636
as: BFD (GNU Binutils for Ubuntu) 2.24 assertion fail ../../bfd/elf.c:2636
as: BFD (GNU Binutils for Ubuntu) 2.24 assertion fail ../../bfd/elf.c:2636
as: BFD (GNU Binutils for Ubuntu) 2.24 assertion fail ../../bfd/elf.c:2636
as: BFD (GNU Binutils for Ubuntu) 2.24 assertion fail ../../bfd/elf.c:2636
as: BFD (GNU Binutils for Ubuntu) 2.24 assertion fail ../../bfd/elf.c:2636
as: BFD (GNU Binutils for Ubuntu) 2.24 assertion fail ../../bfd/elf.c:2636
as: BFD (GNU Binutils for Ubuntu) 2.24 assertion fail ../../bfd/elf.c:2636
as: BFD (GNU Binutils for Ubuntu) 2.24 assertion fail ../../bfd/elf.c:2636
as: BFD (GNU Binutils for Ubuntu) 2.24 assertion fail ../../bfd/elf.c:2636
as: BFD (GNU Binutils for Ubuntu) 2.24 assertion fail ../../bfd/elf.c:2636
as: BFD (GNU Binutils for Ubuntu) 2.24 assertion fail ../../bfd/elf.c:2636
as: BFD (GNU Binutils for Ubuntu) 2.24 assertion fail ../../bfd/elf.c:2636
as: BFD (GNU Binutils for Ubuntu) 2.24 assertion fail ../../bfd/elf.c:2636
as: BFD (GNU Binutils for Ubuntu) 2.24 assertion fail ../../bfd/elf.c:2636
as: BFD (GNU Binutils for Ubuntu) 2.24 assertion fail ../../bfd/elf.c:2636
as: BFD (GNU Binutils for Ubuntu) 2.24 assertion fail ../../bfd/elf.c:2636
as: BFD (GNU Binutils for Ubuntu) 2.24 assertion fail ../../bfd/elf.c:2636
as: BFD (GNU Binutils for Ubuntu) 2.24 assertion fail ../../bfd/elf.c:2636
as: BFD (GNU Binutils for Ubuntu) 2.24 assertion fail ../../bfd/elf.c:2636
as: BFD (GNU Binutils for Ubuntu) 2.24 assertion fail ../../bfd/elf.c:2636
as: BFD (GNU Binutils for Ubuntu) 2.24 assertion fail ../../bfd/elf.c:2636
as: BFD (GNU Binutils for Ubuntu) 2.24 assertion fail ../../bfd/elf.c:2636
as: BFD (GNU Binutils for Ubuntu) 2.24 assertion fail ../../bfd/elf.c:2636
as: BFD (GNU Binutils for Ubuntu) 2.24 assertion fail ../../bfd/elf.c:2636
as: BFD (GNU Binutils for Ubuntu) 2.24 assertion fail ../../bfd/elf.c:2636
as: BFD (GNU Binutils for Ubuntu) 2.24 assertion fail ../../bfd/elf.c:2636
as: BFD (GNU Binutils for Ubuntu) 2.24 assertion fail ../../bfd/elf.c:2636
as: BFD (GNU Binutils for Ubuntu) 2.24 assertion fail ../../bfd/elf.c:2636
as: BFD (GNU Binutils for Ubuntu) 2.24 assertion fail ../../bfd/elf.c:2636
as: BFD (GNU Binutils for Ubuntu) 2.24 assertion fail ../../bfd/elf.c:2636
as: BFD (GNU Binutils for Ubuntu) 2.24 assertion fail ../../bfd/elf.c:2636
as: BFD (GNU Binutils for Ubuntu) 2.24 assertion fail ../../bfd/elf.c:2636
as: BFD (GNU Binutils for Ubuntu) 2.24 assertion fail ../../bfd/elf.c:2636
as: BFD (GNU Binutils for Ubuntu) 2.24 assertion fail ../../bfd/elf.c:2636
as: BFD (GNU Binutils for Ubuntu) 2.24 assertion fail ../../bfd/elf.c:2636
as: BFD (GNU Binutils for Ubuntu) 2.24 assertion fail ../../bfd/elf.c:2636
as: BFD (GNU Binutils for Ubuntu) 2.24 assertion fail ../../bfd/elf.c:2636
as: BFD (GNU Binutils for Ubuntu) 2.24 assertion fail ../../bfd/elf.c:2636
as: BFD (GNU Binutils for Ubuntu) 2.24 assertion fail ../../bfd/elf.c:2636
as: BFD (GNU Binutils for Ubuntu) 2.24 assertion fail ../../bfd/elf.c:2636
as: BFD (GNU Binutils for Ubuntu) 2.24 assertion fail ../../bfd/elf.c:2636
as: BFD (GNU Binutils for Ubuntu) 2.24 assertion fail ../../bfd/elf.c:2636
as: BFD (GNU Binutils for Ubuntu) 2.24 assertion fail ../../bfd/elf.c:2636
as: BFD (GNU Binutils for Ubuntu) 2.24 assertion fail ../../bfd/elf.c:2636
as: BFD (GNU Binutils for Ubuntu) 2.24 assertion fail ../../bfd/elf.c:2636
as: BFD (GNU Binutils for Ubuntu) 2.24 assertion fail ../../bfd/elf.c:2636
as: BFD (GNU Binutils for Ubuntu) 2.24 assertion fail ../../bfd/elf.c:2636
as: BFD (GNU Binutils for Ubuntu) 2.24 assertion fail ../../bfd/elf.c:2636
as: BFD (GNU Binutils for Ubuntu) 2.24 assertion fail ../../bfd/elf.c:2636
as: BFD (GNU Binutils for Ubuntu) 2.24 assertion fail ../../bfd/elf.c:2636
as: BFD (GNU Binutils for Ubuntu) 2.24 assertion fail ../../bfd/elf.c:2636
as: BFD (GNU Binutils for Ubuntu) 2.24 assertion fail ../../bfd/elf.c:2636
as: BFD (GNU Binutils for Ubuntu) 2.24 assertion fail ../../bfd/elf.c:2636
as: BFD (GNU Binutils for Ubuntu) 2.24 assertion fail ../../bfd/elf.c:2636
as: BFD (GNU Binutils for Ubuntu) 2.24 assertion fail ../../bfd/elf.c:2636
as: BFD (GNU Binutils for Ubuntu) 2.24 assertion fail ../../bfd/elf.c:2636
/tmp/ccjmQdRg.s: Fatal error: can't close cli/mesos_execute-execute.o: No space left on device
make[3]: *** [cli/mesos_execute-execute.o] Error 1
make[3]: *** Waiting for unfinished jobs....
../../src/launcher/executor.cpp:1295:1: fatal error: error writing to /tmp/ccDBeKFB.s: No
space left on device
 }
 ^
compilation terminated.
../../src/launcher/default_executor.cpp:1576:1: fatal error: error writing to /tmp/ccKIRLK3.s:
No space left on device
 }
 ^
compilation terminated.
ar: .libs/libmesos_no_3rdparty.a: No space left on device
make[3]: *** [libmesos_no_3rdparty.la] Error 1
make[3]: *** [launcher/mesos_fetcher-fetcher.o] Error 1
The bug is not reproducible, so it is likely a hardware or OS problem.
make[3]: *** [launcher/mesos_executor-executor.o] Error 1
The bug is not reproducible, so it is likely a hardware or OS problem.
make[3]: *** [launcher/mesos_default_executor-default_executor.o] Error 1
make[3]: Leaving directory `/mesos/mesos-1.4.1/_build/src'
make[2]: *** [all] Error 2
make[2]: Leaving directory `/mesos/mesos-1.4.1/_build/src'
make[1]: *** [all-recursive] Error 1
make[1]: Leaving directory `/mesos/mesos-1.4.1/_build'
make: *** [distcheck] Error 1
+ docker rmi mesos-1508732023-11204
Untagged: mesos-1508732023-11204:latest
Deleted: sha256:f60ba3dffa4efa22afe6b69ea0ad9c79c43504477dc9aa54be54cee7407d34a8
Deleted: sha256:1093bef167001909577b608182ececc4b187c20362250de4e94c9c57105a60fa
Deleted: sha256:c256c0898f5a13b62defd43a92fd4f3481856cb873af18c48801ae66ee29d434
Deleted: sha256:15a5f511b7c813be095a35a660c16add054aa954fd9ab3e3e89a5784804da6e4
Deleted: sha256:7ae7a9f36393a0f15dffc488e5e70bb715f0f02cf88854452e5aa9b67da58fcd
Deleted: sha256:2339384a11be64ac29a6dc2f3c92e0d0cc41092534a84b61b6711d4053192c01
Deleted: sha256:68c0be0ade2eecda0a59e11e0b10c89bf43c07f938a66a33296c615eb15157ab
Deleted: sha256:4e03dfb7d84d5335cc8b7019ea6a5827083fc1e6392c8a5ea1378b18e56d3cf4
Deleted: sha256:0c6da14eab5da2b3780fd4799f667ac0d6c417d64298fbadaf86f3e091b4bb7b
Deleted: sha256:2a35cc9e9b48903581f0885c6fd9ce53ef4882227481fc36e213dccf25a1d390
Deleted: sha256:0b484c54331964f99a21213168da6fd06d0083f1c806898a56b32fdbc0adccc2
Deleted: sha256:1e4601d67e1a83701e17038fb07ca4af736d3088830981b451d3005370602f69
Deleted: sha256:8521157cc9d6fb3c40c932a44444d00a2cedd04cee2eeb8735f1800713c12893
Deleted: sha256:ff119cf487a94764361d097e082c5854a962ee01ae49cf42c5f89a8791eb908f
Deleted: sha256:b0fc1cc66cb3f751fdfc4f3fc561fbfd0b10e2dfb5aa1ca69f974dee33148334
Deleted: sha256:2c5d544d07220e7686ac3617101ff8ee8ca227416da2ab798c207a67e0535d00
Deleted: sha256:c886b3bd2005373ed4603a4552c25dc5ae97dab6535d2840fb7661db5c5c72a7
Deleted: sha256:1b1b4f42e245851e61f269f68f9972ec64177f6385181c61843d66f3854cac82
Deleted: sha256:528be11b6d48a81692d65be907781b7e00d9950d64002c7d541a5580b34b4b6f
Deleted: sha256:a39edc1afcfdb691cbea56da7309fb68d8b76cb7731cad5dc4ef31ae05e19a07
Deleted: sha256:db92b7b8ac48e12676ba4003164c78ba49dff6c42db674f9c692911a509d80b9
Deleted: sha256:0ae72b07a5f82e11a7ff44f6779ca58623d24d37a057774a62ce3bd6aed27128
Deleted: sha256:5e0e2f15faa5241701cd2301c516c9d85802413f6874140855648f12a16da11d
Deleted: sha256:ef6b27933858997db8fa3d30f8f290f54e564cd370bcda66c199f008f7fa7d05
Build step 'Execute shell' marked build as failure

Mime
View raw message