mesos-builds mailing list archives

Site index · List index
Message view « Date » · « Thread »
Top « Date » · « Thread »
From Apache Jenkins Server <jenk...@builds.apache.org>
Subject Build failed in Jenkins: Mesos-Buildbot » autotools,clang,--verbose --disable-libtool-wrappers --enable-libevent --enable-ssl,GLOG_v=1 MESOS_VERBOSE=1,ubuntu:14.04,(ubuntu)&&(!ubuntu-us1)&&(!ubuntu-eu2)&&(!qnode3)&&(!H23) #4293
Date Fri, 06 Oct 2017 09:07:59 GMT
See <https://builds.apache.org/job/Mesos-Buildbot/BUILDTOOL=autotools,COMPILER=clang,CONFIGURATION=--verbose%20--disable-libtool-wrappers%20--enable-libevent%20--enable-ssl,ENVIRONMENT=GLOG_v=1%20MESOS_VERBOSE=1,OS=ubuntu%3A14.04,label_exp=(ubuntu)&&(!ubuntu-us1)&&(!ubuntu-eu2)&&(!qnode3)&&(!H23)/4293/display/redirect>

------------------------------------------
[...truncated 33.63 MB...]
I1006 09:07:53.817546 16894 slave.cpp:254] Mesos agent started on (829)@172.17.0.2:43524
I1006 09:07:53.817631 16894 slave.cpp:255] Flags at startup: --acls="" --appc_simple_discovery_uri_prefix="http://"
--appc_store_dir="/tmp/Endpoint_SlaveEndpointTest_UnauthorizedRequest_0_3XouXI/store/appc"
--authenticate_http_executors="true" --authenticate_http_readonly="true" --authenticate_http_readwrite="true"
--authenticatee="crammd5" --authentication_backoff_factor="1secs" --authorizer="local" --cgroups_cpu_enable_pids_and_tids_count="false"
--cgroups_enable_cfs="false" --cgroups_hierarchy="/sys/fs/cgroup" --cgroups_limit_swap="false"
--cgroups_root="mesos" --container_disk_watch_interval="15secs" --containerizers="mesos" --credential="/tmp/Endpoint_SlaveEndpointTest_UnauthorizedRequest_0_3XouXI/credential"
--default_role="*" --disallow_sharing_agent_pid_namespace="false" --disk_watch_interval="1mins"
--docker="docker" --docker_kill_orphans="true" --docker_registry="https://registry-1.docker.io"
--docker_remove_delay="6hrs" --docker_socket="/var/run/docker.sock" --docker_stop_timeout="0ns"
--docker_store_dir="/tmp/Endpoint_SlaveEndpointTest_UnauthorizedRequest_0_3XouXI/store/docker"
--docker_volume_checkpoint_dir="/var/run/mesos/isolators/docker/volume" --enforce_container_disk_quota="false"
--executor_registration_timeout="1mins" --executor_reregistration_timeout="2secs" --executor_secret_key="/tmp/Endpoint_SlaveEndpointTest_UnauthorizedRequest_0_3XouXI/executor_secret_key"
--executor_shutdown_grace_period="5secs" --fetcher_cache_dir="/tmp/Endpoint_SlaveEndpointTest_UnauthorizedRequest_0_3XouXI/fetch"
--fetcher_cache_size="2GB" --frameworks_home="" --gc_delay="1weeks" --gc_disk_headroom="0.1"
--hadoop_home="" --help="false" --hostname_lookup="true" --http_command_executor="false" --http_credentials="/tmp/Endpoint_SlaveEndpointTest_UnauthorizedRequest_0_3XouXI/http_credentials"
--http_heartbeat_interval="30secs" --initialize_driver_logging="true" --isolation="posix/cpu,posix/mem"
--launcher="posix" --launcher_dir="/mesos/mesos-1.5.0/_build/src" --logbufsecs="0" --logging_level="INFO"
--max_completed_executors_per_framework="150" --oversubscribed_resources_interval="15secs"
--perf_duration="10secs" --perf_interval="1mins" --port="5051" --qos_correction_interval_min="0ns"
--quiet="false" --recover="reconnect" --recovery_timeout="15mins" --registration_backoff_factor="10ms"
--resources="cpus:2;gpus:0;mem:1024;disk:1024;ports:[31000-32000]" --revocable_cpu_low_priority="true"
--runtime_dir="/tmp/Endpoint_SlaveEndpointTest_UnauthorizedRequest_0_3XouXI" --sandbox_directory="/mnt/mesos/sandbox"
--strict="true" --switch_user="true" --systemd_enable_support="true" --systemd_runtime_directory="/run/systemd/system"
--version="false" --work_dir="/tmp/Endpoint_SlaveEndpointTest_UnauthorizedRequest_0_PZPqGb"
--zk_session_timeout="10secs"
I1006 09:07:53.818199 16894 credentials.hpp:86] Loading credential for authentication from
'/tmp/Endpoint_SlaveEndpointTest_UnauthorizedRequest_0_3XouXI/credential'
I1006 09:07:53.818518 16894 slave.cpp:287] Agent using credential for: test-principal
I1006 09:07:53.818547 16894 credentials.hpp:37] Loading credentials for authentication from
'/tmp/Endpoint_SlaveEndpointTest_UnauthorizedRequest_0_3XouXI/http_credentials'
I1006 09:07:53.818889 16894 http.cpp:1045] Creating default 'basic' HTTP authenticator for
realm 'mesos-agent-executor'
I1006 09:07:53.819074 16894 http.cpp:1066] Creating default 'jwt' HTTP authenticator for realm
'mesos-agent-executor'
I1006 09:07:53.819350 16894 http.cpp:1045] Creating default 'basic' HTTP authenticator for
realm 'mesos-agent-readonly'
I1006 09:07:53.819455 16894 http.cpp:1066] Creating default 'jwt' HTTP authenticator for realm
'mesos-agent-readonly'
I1006 09:07:53.819644 16894 http.cpp:1045] Creating default 'basic' HTTP authenticator for
realm 'mesos-agent-readwrite'
I1006 09:07:53.819757 16894 http.cpp:1066] Creating default 'jwt' HTTP authenticator for realm
'mesos-agent-readwrite'
I1006 09:07:53.821393 16894 slave.cpp:585] Agent resources: [{"name":"cpus","scalar":{"value":2.0},"type":"SCALAR"},{"name":"mem","scalar":{"value":1024.0},"type":"SCALAR"},{"name":"disk","scalar":{"value":1024.0},"type":"SCALAR"},{"name":"ports","ranges":{"range":[{"begin":31000,"end":32000}]},"type":"RANGES"}]
I1006 09:07:53.821719 16894 slave.cpp:593] Agent attributes: [  ]
I1006 09:07:53.821768 16894 slave.cpp:602] Agent hostname: 35eec220f329
I1006 09:07:53.822149 16891 status_update_manager.cpp:177] Pausing sending status updates
I1006 09:07:53.824594 16875 state.cpp:64] Recovering state from '/tmp/Endpoint_SlaveEndpointTest_UnauthorizedRequest_0_PZPqGb/meta'
I1006 09:07:53.826905 16887 status_update_manager.cpp:203] Recovering status update manager
I1006 09:07:53.827172 16885 containerizer.cpp:648] Recovering containerizer
I1006 09:07:53.828920 16883 provisioner.cpp:416] Provisioner recovery complete
I1006 09:07:53.829358 16877 slave.cpp:6326] Finished recovery
I1006 09:07:53.830076 16877 slave.cpp:6512] Querying resource estimator for oversubscribable
resources
I1006 09:07:53.830435 16894 slave.cpp:6526] Received oversubscribable resources {} from the
resource estimator
I1006 09:07:53.833254 16889 process.cpp:3929] Handling HTTP event for process 'slave(829)'
with path: '/slave(829)/monitor/statistics'
I1006 09:07:53.835374 16876 http.cpp:1185] HTTP GET for /slave(829)/monitor/statistics from
172.17.0.2:53524
I1006 09:07:53.835484 16876 http.cpp:976] Authorizing principal 'test-principal' to GET the
'/monitor/statistics' endpoint
I1006 09:07:53.838498 16882 slave.cpp:869] Agent terminating
[       OK ] Endpoint/SlaveEndpointTest.UnauthorizedRequest/0 (68 ms)
[ RUN      ] Endpoint/SlaveEndpointTest.UnauthorizedRequest/1
I1006 09:07:53.882130  6683 containerizer.cpp:292] Using isolation { environment_secret, posix/cpu,
posix/mem, filesystem/posix, network/cni }
W1006 09:07:53.882843  6683 backend.cpp:76] Failed to create 'aufs' backend: AufsBackend requires
root privileges
W1006 09:07:53.882967  6683 backend.cpp:76] Failed to create 'bind' backend: BindBackend requires
root privileges
I1006 09:07:53.883005  6683 provisioner.cpp:255] Using default backend 'copy'
I1006 09:07:53.887300 16878 slave.cpp:254] Mesos agent started on (830)@172.17.0.2:43524
I1006 09:07:53.887370 16878 slave.cpp:255] Flags at startup: --acls="" --appc_simple_discovery_uri_prefix="http://"
--appc_store_dir="/tmp/Endpoint_SlaveEndpointTest_UnauthorizedRequest_1_wtB5AS/store/appc"
--authenticate_http_executors="true" --authenticate_http_readonly="true" --authenticate_http_readwrite="true"
--authenticatee="crammd5" --authentication_backoff_factor="1secs" --authorizer="local" --cgroups_cpu_enable_pids_and_tids_count="false"
--cgroups_enable_cfs="false" --cgroups_hierarchy="/sys/fs/cgroup" --cgroups_limit_swap="false"
--cgroups_root="mesos" --container_disk_watch_interval="15secs" --containerizers="mesos" --credential="/tmp/Endpoint_SlaveEndpointTest_UnauthorizedRequest_1_wtB5AS/credential"
--default_role="*" --disallow_sharing_agent_pid_namespace="false" --disk_watch_interval="1mins"
--docker="docker" --docker_kill_orphans="true" --docker_registry="https://registry-1.docker.io"
--docker_remove_delay="6hrs" --docker_socket="/var/run/docker.sock" --docker_stop_timeout="0ns"
--docker_store_dir="/tmp/Endpoint_SlaveEndpointTest_UnauthorizedRequest_1_wtB5AS/store/docker"
--docker_volume_checkpoint_dir="/var/run/mesos/isolators/docker/volume" --enforce_container_disk_quota="false"
--executor_registration_timeout="1mins" --executor_reregistration_timeout="2secs" --executor_secret_key="/tmp/Endpoint_SlaveEndpointTest_UnauthorizedRequest_1_wtB5AS/executor_secret_key"
--executor_shutdown_grace_period="5secs" --fetcher_cache_dir="/tmp/Endpoint_SlaveEndpointTest_UnauthorizedRequest_1_wtB5AS/fetch"
--fetcher_cache_size="2GB" --frameworks_home="" --gc_delay="1weeks" --gc_disk_headroom="0.1"
--hadoop_home="" --help="false" --hostname_lookup="true" --http_command_executor="false" --http_credentials="/tmp/Endpoint_SlaveEndpointTest_UnauthorizedRequest_1_wtB5AS/http_credentials"
--http_heartbeat_interval="30secs" --initialize_driver_logging="true" --isolation="posix/cpu,posix/mem"
--launcher="posix" --launcher_dir="/mesos/mesos-1.5.0/_build/src" --logbufsecs="0" --logging_level="INFO"
--max_completed_executors_per_framework="150" --oversubscribed_resources_interval="15secs"
--perf_duration="10secs" --perf_interval="1mins" --port="5051" --qos_correction_interval_min="0ns"
--quiet="false" --recover="reconnect" --recovery_timeout="15mins" --registration_backoff_factor="10ms"
--resources="cpus:2;gpus:0;mem:1024;disk:1024;ports:[31000-32000]" --revocable_cpu_low_priority="true"
--runtime_dir="/tmp/Endpoint_SlaveEndpointTest_UnauthorizedRequest_1_wtB5AS" --sandbox_directory="/mnt/mesos/sandbox"
--strict="true" --switch_user="true" --systemd_enable_support="true" --systemd_runtime_directory="/run/systemd/system"
--version="false" --work_dir="/tmp/Endpoint_SlaveEndpointTest_UnauthorizedRequest_1_QPeL9k"
--zk_session_timeout="10secs"
I1006 09:07:53.887943 16878 credentials.hpp:86] Loading credential for authentication from
'/tmp/Endpoint_SlaveEndpointTest_UnauthorizedRequest_1_wtB5AS/credential'
I1006 09:07:53.888182 16878 slave.cpp:287] Agent using credential for: test-principal
I1006 09:07:53.888204 16878 credentials.hpp:37] Loading credentials for authentication from
'/tmp/Endpoint_SlaveEndpointTest_UnauthorizedRequest_1_wtB5AS/http_credentials'
I1006 09:07:53.888537 16878 http.cpp:1045] Creating default 'basic' HTTP authenticator for
realm 'mesos-agent-executor'
I1006 09:07:53.888738 16878 http.cpp:1066] Creating default 'jwt' HTTP authenticator for realm
'mesos-agent-executor'
I1006 09:07:53.888978 16878 http.cpp:1045] Creating default 'basic' HTTP authenticator for
realm 'mesos-agent-readonly'
I1006 09:07:53.889072 16878 http.cpp:1066] Creating default 'jwt' HTTP authenticator for realm
'mesos-agent-readonly'
I1006 09:07:53.889245 16878 http.cpp:1045] Creating default 'basic' HTTP authenticator for
realm 'mesos-agent-readwrite'
I1006 09:07:53.889341 16878 http.cpp:1066] Creating default 'jwt' HTTP authenticator for realm
'mesos-agent-readwrite'
I1006 09:07:53.891402 16878 slave.cpp:585] Agent resources: [{"name":"cpus","scalar":{"value":2.0},"type":"SCALAR"},{"name":"mem","scalar":{"value":1024.0},"type":"SCALAR"},{"name":"disk","scalar":{"value":1024.0},"type":"SCALAR"},{"name":"ports","ranges":{"range":[{"begin":31000,"end":32000}]},"type":"RANGES"}]
I1006 09:07:53.891805 16878 slave.cpp:593] Agent attributes: [  ]
I1006 09:07:53.891883 16878 slave.cpp:602] Agent hostname: 35eec220f329
I1006 09:07:53.892144 16889 status_update_manager.cpp:177] Pausing sending status updates
I1006 09:07:53.894326 16878 state.cpp:64] Recovering state from '/tmp/Endpoint_SlaveEndpointTest_UnauthorizedRequest_1_QPeL9k/meta'
I1006 09:07:53.894789 16875 status_update_manager.cpp:203] Recovering status update manager
I1006 09:07:53.895057 16877 containerizer.cpp:648] Recovering containerizer
I1006 09:07:53.896960 16893 provisioner.cpp:416] Provisioner recovery complete
I1006 09:07:53.897450 16893 slave.cpp:6326] Finished recovery
I1006 09:07:53.898026 16893 slave.cpp:6512] Querying resource estimator for oversubscribable
resources
I1006 09:07:53.898254 16878 slave.cpp:6526] Received oversubscribable resources {} from the
resource estimator
I1006 09:07:53.901820 16884 process.cpp:3929] Handling HTTP event for process 'slave(830)'
with path: '/slave(830)/monitor/statistics.json'
I1006 09:07:53.903964 16890 http.cpp:1185] HTTP GET for /slave(830)/monitor/statistics.json
from 172.17.0.2:53526
I1006 09:07:53.904070 16890 http.cpp:976] Authorizing principal 'test-principal' to GET the
'/monitor/statistics.json' endpoint
I1006 09:07:53.905874 16886 slave.cpp:869] Agent terminating
[       OK ] Endpoint/SlaveEndpointTest.UnauthorizedRequest/1 (45 ms)
[ RUN      ] Endpoint/SlaveEndpointTest.UnauthorizedRequest/2
I1006 09:07:53.926913  6683 containerizer.cpp:292] Using isolation { environment_secret, posix/cpu,
posix/mem, filesystem/posix, network/cni }
W1006 09:07:53.927623  6683 backend.cpp:76] Failed to create 'aufs' backend: AufsBackend requires
root privileges
W1006 09:07:53.927747  6683 backend.cpp:76] Failed to create 'bind' backend: BindBackend requires
root privileges
I1006 09:07:53.927785  6683 provisioner.cpp:255] Using default backend 'copy'
I1006 09:07:53.931699 16887 slave.cpp:254] Mesos agent started on (831)@172.17.0.2:43524
I1006 09:07:53.931741 16887 slave.cpp:255] Flags at startup: --acls="" --appc_simple_discovery_uri_prefix="http://"
--appc_store_dir="/tmp/Endpoint_SlaveEndpointTest_UnauthorizedRequest_2_Hq0RI2/store/appc"
--authenticate_http_executors="true" --authenticate_http_readonly="true" --authenticate_http_readwrite="true"
--authenticatee="crammd5" --authentication_backoff_factor="1secs" --authorizer="local" --cgroups_cpu_enable_pids_and_tids_count="false"
--cgroups_enable_cfs="false" --cgroups_hierarchy="/sys/fs/cgroup" --cgroups_limit_swap="false"
--cgroups_root="mesos" --container_disk_watch_interval="15secs" --containerizers="mesos" --credential="/tmp/Endpoint_SlaveEndpointTest_UnauthorizedRequest_2_Hq0RI2/credential"
--default_role="*" --disallow_sharing_agent_pid_namespace="false" --disk_watch_interval="1mins"
--docker="docker" --docker_kill_orphans="true" --docker_registry="https://registry-1.docker.io"
--docker_remove_delay="6hrs" --docker_socket="/var/run/docker.sock" --docker_stop_timeout="0ns"
--docker_store_dir="/tmp/Endpoint_SlaveEndpointTest_UnauthorizedRequest_2_Hq0RI2/store/docker"
--docker_volume_checkpoint_dir="/var/run/mesos/isolators/docker/volume" --enforce_container_disk_quota="false"
--executor_registration_timeout="1mins" --executor_reregistration_timeout="2secs" --executor_secret_key="/tmp/Endpoint_SlaveEndpointTest_UnauthorizedRequest_2_Hq0RI2/executor_secret_key"
--executor_shutdown_grace_period="5secs" --fetcher_cache_dir="/tmp/Endpoint_SlaveEndpointTest_UnauthorizedRequest_2_Hq0RI2/fetch"
--fetcher_cache_size="2GB" --frameworks_home="" --gc_delay="1weeks" --gc_disk_headroom="0.1"
--hadoop_home="" --help="false" --hostname_lookup="true" --http_command_executor="false" --http_credentials="/tmp/Endpoint_SlaveEndpointTest_UnauthorizedRequest_2_Hq0RI2/http_credentials"
--http_heartbeat_interval="30secs" --initialize_driver_logging="true" --isolation="posix/cpu,posix/mem"
--launcher="posix" --launcher_dir="/mesos/mesos-1.5.0/_build/src" --logbufsecs="0" --logging_level="INFO"
--max_completed_executors_per_framework="150" --oversubscribed_resources_interval="15secs"
--perf_duration="10secs" --perf_interval="1mins" --port="5051" --qos_correction_interval_min="0ns"
--quiet="false" --recover="reconnect" --recovery_timeout="15mins" --registration_backoff_factor="10ms"
--resources="cpus:2;gpus:0;mem:1024;disk:1024;ports:[31000-32000]" --revocable_cpu_low_priority="true"
--runtime_dir="/tmp/Endpoint_SlaveEndpointTest_UnauthorizedRequest_2_Hq0RI2" --sandbox_directory="/mnt/mesos/sandbox"
--strict="true" --switch_user="true" --systemd_enable_support="true" --systemd_runtime_directory="/run/systemd/system"
--version="false" --work_dir="/tmp/Endpoint_SlaveEndpointTest_UnauthorizedRequest_2_G8CSav"
--zk_session_timeout="10secs"
I1006 09:07:53.932102 16887 credentials.hpp:86] Loading credential for authentication from
'/tmp/Endpoint_SlaveEndpointTest_UnauthorizedRequest_2_Hq0RI2/credential'
I1006 09:07:53.932291 16887 slave.cpp:287] Agent using credential for: test-principal
I1006 09:07:53.932317 16887 credentials.hpp:37] Loading credentials for authentication from
'/tmp/Endpoint_SlaveEndpointTest_UnauthorizedRequest_2_Hq0RI2/http_credentials'
I1006 09:07:53.932660 16887 http.cpp:1045] Creating default 'basic' HTTP authenticator for
realm 'mesos-agent-executor'
I1006 09:07:53.932818 16887 http.cpp:1066] Creating default 'jwt' HTTP authenticator for realm
'mesos-agent-executor'
I1006 09:07:53.933065 16887 http.cpp:1045] Creating default 'basic' HTTP authenticator for
realm 'mesos-agent-readonly'
I1006 09:07:53.933171 16887 http.cpp:1066] Creating default 'jwt' HTTP authenticator for realm
'mesos-agent-readonly'
I1006 09:07:53.933367 16887 http.cpp:1045] Creating default 'basic' HTTP authenticator for
realm 'mesos-agent-readwrite'
I1006 09:07:53.933470 16887 http.cpp:1066] Creating default 'jwt' HTTP authenticator for realm
'mesos-agent-readwrite'
I1006 09:07:53.935322 16887 slave.cpp:585] Agent resources: [{"name":"cpus","scalar":{"value":2.0},"type":"SCALAR"},{"name":"mem","scalar":{"value":1024.0},"type":"SCALAR"},{"name":"disk","scalar":{"value":1024.0},"type":"SCALAR"},{"name":"ports","ranges":{"range":[{"begin":31000,"end":32000}]},"type":"RANGES"}]
I1006 09:07:53.935632 16887 slave.cpp:593] Agent attributes: [  ]
I1006 09:07:53.935649 16887 slave.cpp:602] Agent hostname: 35eec220f329
I1006 09:07:53.935869 16874 status_update_manager.cpp:177] Pausing sending status updates
I1006 09:07:53.937790 16882 state.cpp:64] Recovering state from '/tmp/Endpoint_SlaveEndpointTest_UnauthorizedRequest_2_G8CSav/meta'
I1006 09:07:53.938347 16882 status_update_manager.cpp:203] Recovering status update manager
I1006 09:07:53.938570 16876 containerizer.cpp:648] Recovering containerizer
I1006 09:07:53.940158 16888 provisioner.cpp:416] Provisioner recovery complete
I1006 09:07:53.940528 16874 slave.cpp:6326] Finished recovery
I1006 09:07:53.941210 16874 slave.cpp:6512] Querying resource estimator for oversubscribable
resources
I1006 09:07:53.941473 16891 slave.cpp:6526] Received oversubscribable resources {} from the
resource estimator
I1006 09:07:53.945185 16892 process.cpp:3929] Handling HTTP event for process 'slave(831)'
with path: '/slave(831)/containers'
I1006 09:07:53.948166 16889 http.cpp:1185] HTTP GET for /slave(831)/containers from 172.17.0.2:53528
I1006 09:07:53.948320 16889 http.cpp:976] Authorizing principal 'test-principal' to GET the
'/containers' endpoint
I1006 09:07:53.952090  6683 slave.cpp:869] Agent terminating
[       OK ] Endpoint/SlaveEndpointTest.UnauthorizedRequest/2 (44 ms)
[ RUN      ] Endpoint/SlaveEndpointTest.NoAuthorizer/0
I1006 09:07:53.972246  6683 containerizer.cpp:292] Using isolation { environment_secret, posix/cpu,
posix/mem, filesystem/posix, network/cni }
W1006 09:07:53.972903  6683 backend.cpp:76] Failed to create 'aufs' backend: AufsBackend requires
root privileges
W1006 09:07:53.973023  6683 backend.cpp:76] Failed to create 'bind' backend: BindBackend requires
root privileges
I1006 09:07:53.973063  6683 provisioner.cpp:255] Using default backend 'copy'
I1006 09:07:53.974951  6683 cluster.cpp:448] Creating default 'local' authorizer
I1006 09:07:53.977181 16879 slave.cpp:254] Mesos agent started on (832)@172.17.0.2:43524
I1006 09:07:53.977280 16879 slave.cpp:255] Flags at startup: --acls="" --appc_simple_discovery_uri_prefix="http://"
--appc_store_dir="/tmp/Endpoint_SlaveEndpointTest_NoAuthorizer_0_sjn7gd/store/appc" --authenticate_http_executors="true"
--authenticate_http_readonly="true" --authenticate_http_readwrite="true" --authenticatee="crammd5"
--authentication_backoff_factor="1secs" --authorizer="local" --cgroups_cpu_enable_pids_and_tids_count="false"
--cgroups_enable_cfs="false" --cgroups_hierarchy="/sys/fs/cgroup" --cgroups_limit_swap="false"
--cgroups_root="mesos" --container_disk_watch_interval="15secs" --containerizers="mesos" --credential="/tmp/Endpoint_SlaveEndpointTest_NoAuthorizer_0_sjn7gd/credential"
--default_role="*" --disallow_sharing_agent_pid_namespace="false" --disk_watch_interval="1mins"
--docker="docker" --docker_kill_orphans="true" --docker_registry="https://registry-1.docker.io"
--docker_remove_delay="6hrs" --docker_socket="/var/run/docker.sock" --docker_stop_timeout="0ns"
--docker_store_dir="/tmp/Endpoint_SlaveEndpointTest_NoAuthorizer_0_sjn7gd/store/docker" --docker_volume_checkpoint_dir="/var/run/mesos/isolators/docker/volume"
--enforce_container_disk_quota="false" --executor_registration_timeout="1mins" --executor_reregistration_timeout="2secs"
--executor_secret_key="/tmp/Endpoint_SlaveEndpointTest_NoAuthorizer_0_sjn7gd/executor_secret_key"
--executor_shutdown_grace_period="5secs" --fetcher_cache_dir="/tmp/Endpoint_SlaveEndpointTest_NoAuthorizer_0_sjn7gd/fetch"
--fetcher_cache_size="2GB" --frameworks_home="" --gc_delay="1weeks" --gc_disk_headroom="0.1"
--hadoop_home="" --help="false" --hostname_lookup="true" --http_command_executor="false" --http_credentials="/tmp/Endpoint_SlaveEndpointTest_NoAuthorizer_0_sjn7gd/http_credentials"
--http_heartbeat_interval="30secs" --initialize_driver_logging="true" --isolation="posix/cpu,posix/mem"
--launcher="posix" --launcher_dir="/mesos/mesos-1.5.0/_build/src" --logbufsecs="0" --logging_level="INFO"
--max_completed_executors_per_framework="150" --oversubscribed_resources_interval="15secs"
--perf_duration="10secs" --perf_interval="1mins" --port="5051" --qos_correction_interval_min="0ns"
--quiet="false" --recover="reconnect" --recovery_timeout="15mins" --registration_backoff_factor="10ms"
--resources="cpus:2;gpus:0;mem:1024;disk:1024;ports:[31000-32000]" --revocable_cpu_low_priority="true"
--runtime_dir="/tmp/Endpoint_SlaveEndpointTest_NoAuthorizer_0_sjn7gd" --sandbox_directory="/mnt/mesos/sandbox"
--strict="true" --switch_user="true" --systemd_enable_support="true" --systemd_runtime_directory="/run/systemd/system"
--version="false" --work_dir="/tmp/Endpoint_SlaveEndpointTest_NoAuthorizer_0_6g0qCF" --zk_session_timeout="10secs"
I1006 09:07:53.977905 16879 credentials.hpp:86] Loading credential for authentication from
'/tmp/Endpoint_SlaveEndpointTest_NoAuthorizer_0_sjn7gd/credential'
I1006 09:07:53.978147 16879 slave.cpp:287] Agent using credential for: test-principal
I1006 09:07:53.978168 16879 credentials.hpp:37] Loading credentials for authentication from
'/tmp/Endpoint_SlaveEndpointTest_NoAuthorizer_0_sjn7gd/http_credentials'
I1006 09:07:53.978533 16879 http.cpp:1045] Creating default 'basic' HTTP authenticator for
realm 'mesos-agent-executor'
I1006 09:07:53.978790 16879 http.cpp:1066] Creating default 'jwt' HTTP authenticator for realm
'mesos-agent-executor'
I1006 09:07:53.979074 16879 http.cpp:1045] Creating default 'basic' HTTP authenticator for
realm 'mesos-agent-readonly'
I1006 09:07:53.979176 16879 http.cpp:1066] Creating default 'jwt' HTTP authenticator for realm
'mesos-agent-readonly'
I1006 09:07:53.979363 16879 http.cpp:1045] Creating default 'basic' HTTP authenticator for
realm 'mesos-agent-readwrite'
I1006 09:07:53.979462 16879 http.cpp:1066] Creating default 'jwt' HTTP authenticator for realm
'mesos-agent-readwrite'
I1006 09:07:53.981812 16879 slave.cpp:585] Agent resources: [{"name":"cpus","scalar":{"value":2.0},"type":"SCALAR"},{"name":"mem","scalar":{"value":1024.0},"type":"SCALAR"},{"name":"disk","scalar":{"value":1024.0},"type":"SCALAR"},{"name":"ports","ranges":{"range":[{"begin":31000,"end":32000}]},"type":"RANGES"}]
I1006 09:07:53.982393 16879 slave.cpp:593] Agent attributes: [  ]
I1006 09:07:53.982483 16879 slave.cpp:602] Agent hostname: 35eec220f329
I1006 09:07:53.982895 16892 status_update_manager.cpp:177] Pausing sending status updates
I1006 09:07:53.985160 16888 state.cpp:64] Recovering state from '/tmp/Endpoint_SlaveEndpointTest_NoAuthorizer_0_6g0qCF/meta'
I1006 09:07:53.985589 16888 status_update_manager.cpp:203] Recovering status update manager
I1006 09:07:53.985791 16894 containerizer.cpp:648] Recovering containerizer
I1006 09:07:53.987916 16891 provisioner.cpp:416] Provisioner recovery complete
I1006 09:07:53.988473 16885 slave.cpp:6326] Finished recovery
I1006 09:07:53.989032 16885 slave.cpp:6512] Querying resource estimator for oversubscribable
resources
I1006 09:07:53.989322 16885 slave.cpp:6526] Received oversubscribable resources {} from the
resource estimator
I1006 09:07:53.992548 16887 process.cpp:3929] Handling HTTP event for process 'slave(832)'
with path: '/slave(832)/monitor/statistics'
I1006 09:07:53.994660 16892 http.cpp:1185] HTTP GET for /slave(832)/monitor/statistics from
172.17.0.2:53532
I1006 09:07:53.994799 16892 http.cpp:976] Authorizing principal 'test-principal' to GET the
'/monitor/statistics' endpoint
I1006 09:07:53.998922  6683 slave.cpp:869] Agent terminating
[       OK ] Endpoint/SlaveEndpointTest.NoAuthorizer/0 (39 ms)
[ RUN      ] Endpoint/SlaveEndpointTest.NoAuthorizer/1
I1006 09:07:54.010541  6683 containerizer.cpp:292] Using isolation { environment_secret, posix/cpu,
posix/mem, filesystem/posix, network/cni }
W1006 09:07:54.011183  6683 backend.cpp:76] Failed to create 'aufs' backend: AufsBackend requires
root privileges
W1006 09:07:54.011302  6683 backend.cpp:76] Failed to create 'bind' backend: BindBackend requires
root privileges
I1006 09:07:54.011340  6683 provisioner.cpp:255] Using default backend 'copy'
I1006 09:07:54.013269  6683 cluster.cpp:448] Creating default 'local' authorizer
I1006 09:07:54.015559 16874 slave.cpp:254] Mesos agent started on (833)@172.17.0.2:43524
I1006 09:07:54.015641 16874 slave.cpp:255] Flags at startup: --acls="" --appc_simple_discovery_uri_prefix="http://"
--appc_store_dir="/tmp/Endpoint_SlaveEndpointTest_NoAuthorizer_1_CUUVdo/store/appc" --authenticate_http_executors="true"
--authenticate_http_readonly="true" --authenticate_http_readwrite="true" --authenticatee="crammd5"
--authentication_backoff_factor="1secs" --authorizer="local" --cgroups_cpu_enable_pids_and_tids_count="false"
--cgroups_enable_cfs="false" --cgroups_hierarchy="/sys/fs/cgroup" --cgroups_limit_swap="false"
--cgroups_root="mesos" --container_disk_watch_interval="15secs" --containerizers="mesos" --credential="/tmp/Endpoint_SlaveEndpointTest_NoAuthorizer_1_CUUVdo/credential"
--default_role="*" --disallow_sharing_agent_pid_namespace="false" --disk_watch_interval="1mins"
--docker="docker" --docker_kill_orphans="true" --docker_registry="https://registry-1.docker.io"
--docker_remove_delay="6hrs" --docker_socket="/var/run/docker.sock" --docker_stop_timeout="0ns"
--docker_store_dir="/tmp/Endpoint_SlaveEndpointTest_NoAuthorizer_1_CUUVdo/store/docker" --docker_volume_checkpoint_dir="/var/run/mesos/isolators/docker/volume"
--enforce_container_disk_quota="false" --executor_registration_timeout="1mins" --executor_reregistration_timeout="2secs"
--executor_secret_key="/tmp/Endpoint_SlaveEndpointTest_NoAuthorizer_1_CUUVdo/executor_secret_key"
--executor_shutdown_grace_period="5secs" --fetcher_cache_dir="/tmp/Endpoint_SlaveEndpointTest_NoAuthorizer_1_CUUVdo/fetch"
--fetcher_cache_size="2GB" --frameworks_home="" --gc_delay="1weeks" --gc_disk_headroom="0.1"
--hadoop_home="" --help="false" --hostname_lookup="true" --http_command_executor="false" --http_credentials="/tmp/Endpoint_SlaveEndpointTest_NoAuthorizer_1_CUUVdo/http_credentials"
--http_heartbeat_interval="30secs" --initialize_driver_logging="true" --isolation="posix/cpu,posix/mem"
--launcher="posix" --launcher_dir="/mesos/mesos-1.5.0/_build/src" --logbufsecs="0" --logging_level="INFO"
--max_completed_executors_per_framework="150" --oversubscribed_resources_interval="15secs"
--perf_duration="10secs" --perf_interval="1mins" --port="5051" --qos_correction_interval_min="0ns"
--quiet="false" --recover="reconnect" --recovery_timeout="15mins" --registration_backoff_factor="10ms"
--resources="cpus:2;gpus:0;mem:1024;disk:1024;ports:[31000-32000]" --revocable_cpu_low_priority="true"
--runtime_dir="/tmp/Endpoint_SlaveEndpointTest_NoAuthorizer_1_CUUVdo" --sandbox_directory="/mnt/mesos/sandbox"
--strict="true" --switch_user="true" --systemd_enable_support="true" --systemd_runtime_directory="/run/systemd/system"
--version="false" --work_dir="/tmp/Endpoint_SlaveEndpointTest_NoAuthorizer_1_pO3stQ" --zk_session_timeout="10secs"
I1006 09:07:54.016393 16874 credentials.hpp:86] Loading credential for authentication from
'/tmp/Endpoint_SlaveEndpointTest_NoAuthorizer_1_CUUVdo/credential'
I1006 09:07:54.016626 16874 slave.cpp:287] Agent using credential for: test-principal
I1006 09:07:54.016649 16874 credentials.hpp:37] Loading credentials for authentication from
'/tmp/Endpoint_SlaveEndpointTest_NoAuthorizer_1_CUUVdo/http_credentials'
I1006 09:07:54.016932 16874 http.cpp:1045] Creating default 'basic' HTTP authenticator for
realm 'mesos-agent-executor'
I1006 09:07:54.017148 16874 http.cpp:1066] Creating default 'jwt' HTTP authenticator for realm
'mesos-agent-executor'
I1006 09:07:54.017379 16874 http.cpp:1045] Creating default 'basic' HTTP authenticator for
realm 'mesos-agent-readonly'
I1006 09:07:54.017498 16874 http.cpp:1066] Creating default 'jwt' HTTP authenticator for realm
'mesos-agent-readonly'
I1006 09:07:54.017673 16874 http.cpp:1045] Creating default 'basic' HTTP authenticator for
realm 'mesos-agent-readwrite'
I1006 09:07:54.017771 16874 http.cpp:1066] Creating default 'jwt' HTTP authenticator for realm
'mesos-agent-readwrite'
I1006 09:07:54.019270 16874 slave.cpp:585] Agent resources: [{"name":"cpus","scalar":{"value":2.0},"type":"SCALAR"},{"name":"mem","scalar":{"value":1024.0},"type":"SCALAR"},{"name":"disk","scalar":{"value":1024.0},"type":"SCALAR"},{"name":"ports","ranges":{"range":[{"begin":31000,"end":32000}]},"type":"RANGES"}]
I1006 09:07:54.019517 16874 slave.cpp:593] Agent attributes: [  ]
I1006 09:07:54.019541 16874 slave.cpp:602] Agent hostname: 35eec220f329
I1006 09:07:54.019704 16883 status_update_manager.cpp:177] Pausing sending status updates
I1006 09:07:54.021353 16890 state.cpp:64] Recovering state from '/tmp/Endpoint_SlaveEndpointTest_NoAuthorizer_1_pO3stQ/meta'
I1006 09:07:54.021687 16893 status_update_manager.cpp:203] Recovering status update manager
I1006 09:07:54.021924 16887 containerizer.cpp:648] Recovering containerizer
I1006 09:07:54.023315 16873 provisioner.cpp:416] Provisioner recovery complete
I1006 09:07:54.023741 16884 slave.cpp:6326] Finished recovery
I1006 09:07:54.024387 16884 slave.cpp:6512] Querying resource estimator for oversubscribable
resources
I1006 09:07:54.024616 16875 slave.cpp:6526] Received oversubscribable resources {} from the
resource estimator
I1006 09:07:54.027334 16882 process.cpp:3929] Handling HTTP event for process 'slave(833)'
with path: '/slave(833)/monitor/statistics.json'
I1006 09:07:54.029387 16886 http.cpp:1185] HTTP GET for /slave(833)/monitor/statistics.json
from 172.17.0.2:53534
I1006 09:07:54.029500 16886 http.cpp:976] Authorizing principal 'test-principal' to GET the
'/monitor/statistics.json' endpoint
I1006 09:07:54.033280 16884 slave.cpp:869] Agent terminating
[       OK ] Endpoint/SlaveEndpointTest.NoAuthorizer/1 (34 ms)
[ RUN      ] Endpoint/SlaveEndpointTest.NoAuthorizer/2
I1006 09:07:54.046115  6683 containerizer.cpp:292] Using isolation { environment_secret, posix/cpu,
posix/mem, filesystem/posix, network/cni }
W1006 09:07:54.046754  6683 backend.cpp:76] Failed to create 'aufs' backend: AufsBackend requires
root privileges
W1006 09:07:54.046869  6683 backend.cpp:76] Failed to create 'bind' backend: BindBackend requires
root privileges
I1006 09:07:54.046906  6683 provisioner.cpp:255] Using default backend 'copy'
I1006 09:07:54.048671  6683 cluster.cpp:448] Creating default 'local' authorizer
I1006 09:07:54.050678 16886 slave.cpp:254] Mesos agent started on (834)@172.17.0.2:43524
I1006 09:07:54.050768 16886 slave.cpp:255] Flags at startup: --acls="" --appc_simple_discovery_uri_prefix="http://"
--appc_store_dir="/tmp/Endpoint_SlaveEndpointTest_NoAuthorizer_2_r5dJvz/store/appc" --authenticate_http_executors="true"
--authenticate_http_readonly="true" --authenticate_http_readwrite="true" --authenticatee="crammd5"
--authentication_backoff_factor="1secs" --authorizer="local" --cgroups_cpu_enable_pids_and_tids_count="false"
--cgroups_enable_cfs="false" --cgroups_hierarchy="/sys/fs/cgroup" --cgroups_limit_swap="false"
--cgroups_root="mesos" --container_disk_watch_interval="15secs" --containerizers="mesos" --credential="/tmp/Endpoint_SlaveEndpointTest_NoAuthorizer_2_r5dJvz/credential"
--default_role="*" --disallow_sharing_agent_pid_namespace="false" --disk_watch_interval="1mins"
--docker="docker" --docker_kill_orphans="true" --docker_registry="https://registry-1.docker.io"
--docker_remove_delay="6hrs" --docker_socket="/var/run/docker.sock" --docker_stop_timeout="0ns"
--docker_store_dir="/tmp/Endpoint_SlaveEndpointTest_NoAuthorizer_2_r5dJvz/store/docker" --docker_volume_checkpoint_dir="/var/run/mesos/isolators/docker/volume"
--enforce_container_disk_quota="false" --executor_registration_timeout="1mins" --executor_reregistration_timeout="2secs"
--executor_secret_key="/tmp/Endpoint_SlaveEndpointTest_NoAuthorizer_2_r5dJvz/executor_secret_key"
--executor_shutdown_grace_period="5secs" --fetcher_cache_dir="/tmp/Endpoint_SlaveEndpointTest_NoAuthorizer_2_r5dJvz/fetch"
--fetcher_cache_size="2GB" --frameworks_home="" --gc_delay="1weeks" --gc_disk_headroom="0.1"
--hadoop_home="" --help="false" --hostname_lookup="true" --http_command_executor="false" --http_credentials="/tmp/Endpoint_SlaveEndpointTest_NoAuthorizer_2_r5dJvz/http_credentials"
--http_heartbeat_interval="30secs" --initialize_driver_logging="true" --isolation="posix/cpu,posix/mem"
--launcher="posix" --launcher_dir="/mesos/mesos-1.5.0/_build/src" --logbufsecs="0" --logging_level="INFO"
--max_completed_executors_per_framework="150" --oversubscribed_resources_interval="15secs"
--perf_duration="10secs" --perf_interval="1mins" --port="5051" --qos_correction_interval_min="0ns"
--quiet="false" --recover="reconnect" --recovery_timeout="15mins" --registration_backoff_factor="10ms"
--resources="cpus:2;gpus:0;mem:1024;disk:1024;ports:[31000-32000]" --revocable_cpu_low_priority="true"
--runtime_dir="/tmp/Endpoint_SlaveEndpointTest_NoAuthorizer_2_r5dJvz" --sandbox_directory="/mnt/mesos/sandbox"
--strict="true" --switch_user="true" --systemd_enable_support="true" --systemd_runtime_directory="/run/systemd/system"
--version="false" --work_dir="/tmp/Endpoint_SlaveEndpointTest_NoAuthorizer_2_nhNZF1" --zk_session_timeout="10secs"
I1006 09:07:54.051371 16886 credentials.hpp:86] Loading credential for authentication from
'/tmp/Endpoint_SlaveEndpointTest_NoAuthorizer_2_r5dJvz/credential'
I1006 09:07:54.051587 16886 slave.cpp:287] Agent using credential for: test-principal
I1006 09:07:54.051606 16886 credentials.hpp:37] Loading credentials for authentication from
'/tmp/Endpoint_SlaveEndpointTest_NoAuthorizer_2_r5dJvz/http_credentials'
I1006 09:07:54.051928 16886 http.cpp:1045] Creating default 'basic' HTTP authenticator for
realm 'mesos-agent-executor'
I1006 09:07:54.052145 16886 http.cpp:1066] Creating default 'jwt' HTTP authenticator for realm
'mesos-agent-executor'
I1006 09:07:54.052389 16886 http.cpp:1045] Creating default 'basic' HTTP authenticator for
realm 'mesos-agent-readonly'
I1006 09:07:54.052479 16886 http.cpp:1066] Creating default 'jwt' HTTP authenticator for realm
'mesos-agent-readonly'
I1006 09:07:54.052670 16886 http.cpp:1045] Creating default 'basic' HTTP authenticator for
realm 'mesos-agent-readwrite'
I1006 09:07:54.052758 16886 http.cpp:1066] Creating default 'jwt' HTTP authenticator for realm
'mesos-agent-readwrite'
I1006 09:07:54.054172 16886 slave.cpp:585] Agent resources: [{"name":"cpus","scalar":{"value":2.0},"type":"SCALAR"},{"name":"mem","scalar":{"value":1024.0},"type":"SCALAR"},{"name":"disk","scalar":{"value":1024.0},"type":"SCALAR"},{"name":"ports","ranges":{"range":[{"begin":31000,"end":32000}]},"type":"RANGES"}]
I1006 09:07:54.054543 16886 slave.cpp:593] Agent attributes: [  ]
I1006 09:07:54.054615 16886 slave.cpp:602] Agent hostname: 35eec220f329
I1006 09:07:54.054803 16884 status_update_manager.cpp:177] Pausing sending status updates
I1006 09:07:54.056840 16886 state.cpp:64] Recovering state from '/tmp/Endpoint_SlaveEndpointTest_NoAuthorizer_2_nhNZF1/meta'
I1006 09:07:54.057314 16886 status_update_manager.cpp:203] Recovering status update manager
I1006 09:07:54.057556 16886 containerizer.cpp:648] Recovering containerizer
I1006 09:07:54.058946 16877 provisioner.cpp:416] Provisioner recovery complete
I1006 09:07:54.059257 16880 slave.cpp:6326] Finished recovery
I1006 09:07:54.059919 16880 slave.cpp:6512] Querying resource estimator for oversubscribable
resources
I1006 09:07:54.060195 16882 slave.cpp:6526] Received oversubscribable resources {} from the
resource estimator
I1006 09:07:54.062790 16883 process.cpp:3929] Handling HTTP event for process 'slave(834)'
with path: '/slave(834)/containers'
I1006 09:07:54.064774 16887 http.cpp:1185] HTTP GET for /slave(834)/containers from 172.17.0.2:53536
I1006 09:07:54.064882 16887 http.cpp:976] Authorizing principal 'test-principal' to GET the
'/containers' endpoint
I1006 09:07:54.068131 16882 slave.cpp:869] Agent terminating
[       OK ] Endpoint/SlaveEndpointTest.NoAuthorizer/2 (34 ms)
[----------] 9 tests from Endpoint/SlaveEndpointTest (364 ms total)

[----------] 2 tests from ContainerizerType/DefaultContainerDNSFlagTest
[ RUN      ] ContainerizerType/DefaultContainerDNSFlagTest.ValidateFlag/0
[       OK ] ContainerizerType/DefaultContainerDNSFlagTest.ValidateFlag/0 (10 ms)
[ RUN      ] ContainerizerType/DefaultContainerDNSFlagTest.ValidateFlag/1
[       OK ] ContainerizerType/DefaultContainerDNSFlagTest.ValidateFlag/1 (9 ms)
[----------] 2 tests from ContainerizerType/DefaultContainerDNSFlagTest (19 ms total)

[----------] Global test environment tear-down
[==========] 1696 tests from 187 test cases ran. (469060 ms total)
[  PASSED  ] 1695 tests.
[  FAILED  ] 1 test, listed below:
[  FAILED  ] SlaveTest.RegisteredAgentReregisterAfterFailover

 1 FAILED TEST
  YOU HAVE 21 DISABLED TESTS

I1006 09:07:54.159175 16895 process.cpp:1068] Failed to accept socket: future discarded
make[4]: *** [check-local] Error 1
make[4]: Leaving directory `/mesos/mesos-1.5.0/_build/src'
make[3]: *** [check-am] Error 2
make[3]: Leaving directory `/mesos/mesos-1.5.0/_build/src'
make[2]: *** [check] Error 2
make[2]: Leaving directory `/mesos/mesos-1.5.0/_build/src'
make[1]: *** [check-recursive] Error 1
make[1]: Leaving directory `/mesos/mesos-1.5.0/_build'
make: *** [distcheck] Error 1
+ docker rmi mesos-1507277732-22166
Untagged: mesos-1507277732-22166:latest
Deleted: sha256:c61f3a11ef21336c44472ccf38d16ab099735e5ccaa51f63ac5fd4d929715482
Deleted: sha256:351946cd2e7a84a5d9c1d9a717d26f435cc6b8b0e614b1e44b7fee2564245aa8
Deleted: sha256:e341a37f614eea5b49c54dfa323c8d2a57d726bf40960ffcf93865bca2bc7779
Deleted: sha256:cc5bbab4c466f0eddb99486a59a6f5e511fabf8c9e78428701386e5397a7db9b
Deleted: sha256:bb3d1e483b7bf9ec8409993b122c7d391fe3eac8c95302976abafef9c98219e5
Deleted: sha256:88e4398989d214c7b73d695cffa50b021c468dcd0c3dea5d800ecde7ea37df23
Deleted: sha256:584ed2ba957ff004f05031a07a5401447e85344817ea10bf1064a6ce545717d2
Deleted: sha256:2d8b6b031845b8062c0ff89d0ff9a58a3b11e97e56daa54f7bd501913fe2c0f3
Deleted: sha256:4c43ca648a439a76f5aca168e12468ef26eb45db7a0c555f09154d5fcdbcd78f
Deleted: sha256:bdc2f8089468d2e79bd0e3a5bee3c7672c3df01f1470b2b43b4749299860de99
Deleted: sha256:0aaec6d9057a037cc547ba386c5026bdfef76dd238f91398e64adc576b5501ab
Deleted: sha256:3cc96db3a91dd819e9b46f0827de1a699d7196dec19dc06365321ed4a64ae626
Deleted: sha256:9328b027778a2b00ac77dc6025f02b9400801bde798ba62c3a4e23b3bb742832
Deleted: sha256:9790c1d1bb03542cd04beb6778981a28eaccbb265f5aa5a2954740a4de17052d
Deleted: sha256:fcf0e29e05a1a8176ed4a8a66d3a59ce4984ed521c0c7b7b09833b161c7daefd
Deleted: sha256:16d9b0e24c731d25fc51409979cab7e3e4289a33cfde82eb3fe0d711b5624210
Deleted: sha256:8c902bb4c0899585f68d64592d0e83cde5c7016668025907ca26abd7b4730cb7
Deleted: sha256:c40328d12cc1ad2d187e67b8df7dd1147fe8341e51796cc3a192b1f74fa23f65
Deleted: sha256:aded20f3b13eb51ebb95cf07ac38b3005faf9b7292472819d57fa56f839ac0f5
Deleted: sha256:a38ae44c8509d8e90ea4d04832bad3c13c0aa681da80db6486d0a4cec0273d2f
Deleted: sha256:a06b00900177a6d57ed9c28697e1758d9cfeb9eb4e4c600109c90fcbe3d63a04
Deleted: sha256:8a8c19d2acda251e147f51d23897ee8baf8aae413619ec2595dbd808f59909f0
Deleted: sha256:0473751370cacedb0118a56e22b67447cf3a6e693fa8c1ccc2bad944010b28f6
Deleted: sha256:2f12449cd66c92de3100d8d87679e8abb8986283991df96a2a297bf04c1d3714
Deleted: sha256:a57c0ac55e59c4d36483960509b2bd11e1db3f6374912cbfacf80aabe511f72d
Deleted: sha256:945507f41576449aba7e6d2ceddf885e1799d7428000db52fd33cc4bc2b67fe9
Deleted: sha256:5ebe416ce51e9c734c4e24475c4d13c2932577e9c759a2d796022416a06f28fe
Deleted: sha256:183bc3439f09538a42574e2d2bf9e7074945a8658f013e9f97c11aea5d6cbe91
Build step 'Execute shell' marked build as failure

Mime
View raw message