mesos-builds mailing list archives

Site index · List index
Message view « Date » · « Thread »
Top « Date » · « Thread »
From Apache Jenkins Server <jenk...@builds.apache.org>
Subject Build failed in Jenkins: Mesos-Reviewbot #19840
Date Wed, 18 Oct 2017 21:41:00 GMT
See <https://builds.apache.org/job/Mesos-Reviewbot/19840/display/redirect?page=changes>

Changes:

[alexr] Fixed flakyness in 'SlaveTest.ExecutorShutdownGracePeriod'.

[alexr] Removed a stray trailing parenthesis from a validation error.

[alexr] Send TASK_STARTING from the built-in executors.

[alexr] Fix unit tests that were broken by the additional TASK_STARTING update.

------------------------------------------
[...truncated 31.89 MB...]
I1018 21:32:41.420493  5690 http.cpp:976] Authorizing principal 'test-principal' to GET the
'/monitor/statistics.json' endpoint
I1018 21:32:41.425030  5669 slave.cpp:869] Agent terminating
[       OK ] Endpoint/SlaveEndpointTest.AuthorizedRequest/1 (35 ms)
[ RUN      ] Endpoint/SlaveEndpointTest.AuthorizedRequest/2
I1018 21:32:41.439285  5669 containerizer.cpp:292] Using isolation { environment_secret, posix/cpu,
posix/mem, filesystem/posix, network/cni }
W1018 21:32:41.439842  5669 backend.cpp:76] Failed to create 'aufs' backend: AufsBackend requires
root privileges
W1018 21:32:41.439968  5669 backend.cpp:76] Failed to create 'bind' backend: BindBackend requires
root privileges
I1018 21:32:41.439999  5669 provisioner.cpp:255] Using default backend 'copy'
I1018 21:32:41.444025  5693 slave.cpp:254] Mesos agent started on (822)@172.17.0.2:40911
I1018 21:32:41.444054  5693 slave.cpp:255] Flags at startup: --acls="" --appc_simple_discovery_uri_prefix="http://"
--appc_store_dir="/tmp/Endpoint_SlaveEndpointTest_AuthorizedRequest_2_6Rw2r6/store/appc" --authenticate_http_readonly="true"
--authenticate_http_readwrite="true" --authenticatee="crammd5" --authentication_backoff_factor="1secs"
--authorizer="local" --cgroups_cpu_enable_pids_and_tids_count="false" --cgroups_enable_cfs="false"
--cgroups_hierarchy="/sys/fs/cgroup" --cgroups_limit_swap="false" --cgroups_root="mesos" --container_disk_watch_interval="15secs"
--containerizers="mesos" --credential="/tmp/Endpoint_SlaveEndpointTest_AuthorizedRequest_2_6Rw2r6/credential"
--default_role="*" --disallow_sharing_agent_pid_namespace="false" --disk_watch_interval="1mins"
--docker="docker" --docker_kill_orphans="true" --docker_registry="https://registry-1.docker.io"
--docker_remove_delay="6hrs" --docker_socket="/var/run/docker.sock" --docker_stop_timeout="0ns"
--docker_store_dir="/tmp/Endpoint_SlaveEndpointTest_AuthorizedRequest_2_6Rw2r6/store/docker"
--docker_volume_checkpoint_dir="/var/run/mesos/isolators/docker/volume" --enforce_container_disk_quota="false"
--executor_registration_timeout="1mins" --executor_reregistration_timeout="2secs" --executor_shutdown_grace_period="5secs"
--fetcher_cache_dir="/tmp/Endpoint_SlaveEndpointTest_AuthorizedRequest_2_6Rw2r6/fetch" --fetcher_cache_size="2GB"
--frameworks_home="" --gc_delay="1weeks" --gc_disk_headroom="0.1" --hadoop_home="" --help="false"
--hostname_lookup="true" --http_command_executor="false" --http_credentials="/tmp/Endpoint_SlaveEndpointTest_AuthorizedRequest_2_6Rw2r6/http_credentials"
--http_heartbeat_interval="30secs" --initialize_driver_logging="true" --isolation="posix/cpu,posix/mem"
--launcher="posix" --launcher_dir="/mesos/mesos-1.5.0/_build/src" --logbufsecs="0" --logging_level="INFO"
--max_completed_executors_per_framework="150" --oversubscribed_resources_interval="15secs"
--perf_duration="10secs" --perf_interval="1mins" --port="5051" --qos_correction_interval_min="0ns"
--quiet="false" --recover="reconnect" --recovery_timeout="15mins" --registration_backoff_factor="10ms"
--resources="cpus:2;gpus:0;mem:1024;disk:1024;ports:[31000-32000]" --revocable_cpu_low_priority="true"
--runtime_dir="/tmp/Endpoint_SlaveEndpointTest_AuthorizedRequest_2_6Rw2r6" --sandbox_directory="/mnt/mesos/sandbox"
--strict="true" --switch_user="true" --systemd_enable_support="true" --systemd_runtime_directory="/run/systemd/system"
--version="false" --work_dir="/tmp/Endpoint_SlaveEndpointTest_AuthorizedRequest_2_BpNjmu"
--zk_session_timeout="10secs"
I1018 21:32:41.444605  5693 credentials.hpp:86] Loading credential for authentication from
'/tmp/Endpoint_SlaveEndpointTest_AuthorizedRequest_2_6Rw2r6/credential'
I1018 21:32:41.444770  5693 slave.cpp:287] Agent using credential for: test-principal
I1018 21:32:41.444793  5693 credentials.hpp:37] Loading credentials for authentication from
'/tmp/Endpoint_SlaveEndpointTest_AuthorizedRequest_2_6Rw2r6/http_credentials'
I1018 21:32:41.445128  5693 http.cpp:1045] Creating default 'basic' HTTP authenticator for
realm 'mesos-agent-readonly'
I1018 21:32:41.445328  5693 http.cpp:1045] Creating default 'basic' HTTP authenticator for
realm 'mesos-agent-readwrite'
I1018 21:32:41.447021  5693 slave.cpp:585] Agent resources: [{"name":"cpus","scalar":{"value":2.0},"type":"SCALAR"},{"name":"mem","scalar":{"value":1024.0},"type":"SCALAR"},{"name":"disk","scalar":{"value":1024.0},"type":"SCALAR"},{"name":"ports","ranges":{"range":[{"begin":31000,"end":32000}]},"type":"RANGES"}]
I1018 21:32:41.447242  5693 slave.cpp:593] Agent attributes: [  ]
I1018 21:32:41.447254  5693 slave.cpp:602] Agent hostname: 5a0aa383eb7a
I1018 21:32:41.447453  5670 status_update_manager.cpp:177] Pausing sending status updates
I1018 21:32:41.448766  5684 state.cpp:64] Recovering state from '/tmp/Endpoint_SlaveEndpointTest_AuthorizedRequest_2_BpNjmu/meta'
I1018 21:32:41.449117  5688 status_update_manager.cpp:203] Recovering status update manager
I1018 21:32:41.449486  5682 containerizer.cpp:649] Recovering containerizer
I1018 21:32:41.451179  5681 provisioner.cpp:416] Provisioner recovery complete
I1018 21:32:41.451532  5685 slave.cpp:6310] Finished recovery
I1018 21:32:41.455844  5674 process.cpp:3929] Handling HTTP event for process 'slave(822)'
with path: '/slave(822)/containers'
I1018 21:32:41.457706  5675 http.cpp:1185] HTTP GET for /slave(822)/containers from 172.17.0.2:54882
I1018 21:32:41.457803  5675 http.cpp:976] Authorizing principal 'test-principal' to GET the
'/containers' endpoint
I1018 21:32:41.462314  5685 slave.cpp:869] Agent terminating
[       OK ] Endpoint/SlaveEndpointTest.AuthorizedRequest/2 (35 ms)
[ RUN      ] Endpoint/SlaveEndpointTest.UnauthorizedRequest/0
I1018 21:32:41.475136  5669 containerizer.cpp:292] Using isolation { environment_secret, posix/cpu,
posix/mem, filesystem/posix, network/cni }
W1018 21:32:41.475724  5669 backend.cpp:76] Failed to create 'aufs' backend: AufsBackend requires
root privileges
W1018 21:32:41.475862  5669 backend.cpp:76] Failed to create 'bind' backend: BindBackend requires
root privileges
I1018 21:32:41.475903  5669 provisioner.cpp:255] Using default backend 'copy'
I1018 21:32:41.479924  5681 slave.cpp:254] Mesos agent started on (823)@172.17.0.2:40911
I1018 21:32:41.479953  5681 slave.cpp:255] Flags at startup: --acls="" --appc_simple_discovery_uri_prefix="http://"
--appc_store_dir="/tmp/Endpoint_SlaveEndpointTest_UnauthorizedRequest_0_klqI6y/store/appc"
--authenticate_http_readonly="true" --authenticate_http_readwrite="true" --authenticatee="crammd5"
--authentication_backoff_factor="1secs" --authorizer="local" --cgroups_cpu_enable_pids_and_tids_count="false"
--cgroups_enable_cfs="false" --cgroups_hierarchy="/sys/fs/cgroup" --cgroups_limit_swap="false"
--cgroups_root="mesos" --container_disk_watch_interval="15secs" --containerizers="mesos" --credential="/tmp/Endpoint_SlaveEndpointTest_UnauthorizedRequest_0_klqI6y/credential"
--default_role="*" --disallow_sharing_agent_pid_namespace="false" --disk_watch_interval="1mins"
--docker="docker" --docker_kill_orphans="true" --docker_registry="https://registry-1.docker.io"
--docker_remove_delay="6hrs" --docker_socket="/var/run/docker.sock" --docker_stop_timeout="0ns"
--docker_store_dir="/tmp/Endpoint_SlaveEndpointTest_UnauthorizedRequest_0_klqI6y/store/docker"
--docker_volume_checkpoint_dir="/var/run/mesos/isolators/docker/volume" --enforce_container_disk_quota="false"
--executor_registration_timeout="1mins" --executor_reregistration_timeout="2secs" --executor_shutdown_grace_period="5secs"
--fetcher_cache_dir="/tmp/Endpoint_SlaveEndpointTest_UnauthorizedRequest_0_klqI6y/fetch" --fetcher_cache_size="2GB"
--frameworks_home="" --gc_delay="1weeks" --gc_disk_headroom="0.1" --hadoop_home="" --help="false"
--hostname_lookup="true" --http_command_executor="false" --http_credentials="/tmp/Endpoint_SlaveEndpointTest_UnauthorizedRequest_0_klqI6y/http_credentials"
--http_heartbeat_interval="30secs" --initialize_driver_logging="true" --isolation="posix/cpu,posix/mem"
--launcher="posix" --launcher_dir="/mesos/mesos-1.5.0/_build/src" --logbufsecs="0" --logging_level="INFO"
--max_completed_executors_per_framework="150" --oversubscribed_resources_interval="15secs"
--perf_duration="10secs" --perf_interval="1mins" --port="5051" --qos_correction_interval_min="0ns"
--quiet="false" --recover="reconnect" --recovery_timeout="15mins" --registration_backoff_factor="10ms"
--resources="cpus:2;gpus:0;mem:1024;disk:1024;ports:[31000-32000]" --revocable_cpu_low_priority="true"
--runtime_dir="/tmp/Endpoint_SlaveEndpointTest_UnauthorizedRequest_0_klqI6y" --sandbox_directory="/mnt/mesos/sandbox"
--strict="true" --switch_user="true" --systemd_enable_support="true" --systemd_runtime_directory="/run/systemd/system"
--version="false" --work_dir="/tmp/Endpoint_SlaveEndpointTest_UnauthorizedRequest_0_nFdHVW"
--zk_session_timeout="10secs"
I1018 21:32:41.480331  5681 credentials.hpp:86] Loading credential for authentication from
'/tmp/Endpoint_SlaveEndpointTest_UnauthorizedRequest_0_klqI6y/credential'
I1018 21:32:41.480496  5681 slave.cpp:287] Agent using credential for: test-principal
I1018 21:32:41.480537  5681 credentials.hpp:37] Loading credentials for authentication from
'/tmp/Endpoint_SlaveEndpointTest_UnauthorizedRequest_0_klqI6y/http_credentials'
I1018 21:32:41.480799  5681 http.cpp:1045] Creating default 'basic' HTTP authenticator for
realm 'mesos-agent-readonly'
I1018 21:32:41.480979  5681 http.cpp:1045] Creating default 'basic' HTTP authenticator for
realm 'mesos-agent-readwrite'
I1018 21:32:41.482803  5681 slave.cpp:585] Agent resources: [{"name":"cpus","scalar":{"value":2.0},"type":"SCALAR"},{"name":"mem","scalar":{"value":1024.0},"type":"SCALAR"},{"name":"disk","scalar":{"value":1024.0},"type":"SCALAR"},{"name":"ports","ranges":{"range":[{"begin":31000,"end":32000}]},"type":"RANGES"}]
I1018 21:32:41.483220  5681 slave.cpp:593] Agent attributes: [  ]
I1018 21:32:41.483247  5681 slave.cpp:602] Agent hostname: 5a0aa383eb7a
I1018 21:32:41.483517  5688 status_update_manager.cpp:177] Pausing sending status updates
I1018 21:32:41.485673  5679 state.cpp:64] Recovering state from '/tmp/Endpoint_SlaveEndpointTest_UnauthorizedRequest_0_nFdHVW/meta'
I1018 21:32:41.486049  5679 status_update_manager.cpp:203] Recovering status update manager
I1018 21:32:41.486274  5691 containerizer.cpp:649] Recovering containerizer
I1018 21:32:41.488106  5683 provisioner.cpp:416] Provisioner recovery complete
I1018 21:32:41.488602  5689 slave.cpp:6310] Finished recovery
I1018 21:32:41.492856  5672 process.cpp:3929] Handling HTTP event for process 'slave(823)'
with path: '/slave(823)/monitor/statistics'
I1018 21:32:41.494345  5686 http.cpp:1185] HTTP GET for /slave(823)/monitor/statistics from
172.17.0.2:54884
I1018 21:32:41.494488  5686 http.cpp:976] Authorizing principal 'test-principal' to GET the
'/monitor/statistics' endpoint
I1018 21:32:41.497894  5669 slave.cpp:869] Agent terminating
[       OK ] Endpoint/SlaveEndpointTest.UnauthorizedRequest/0 (35 ms)
[ RUN      ] Endpoint/SlaveEndpointTest.UnauthorizedRequest/1
I1018 21:32:41.510576  5669 containerizer.cpp:292] Using isolation { environment_secret, posix/cpu,
posix/mem, filesystem/posix, network/cni }
W1018 21:32:41.511209  5669 backend.cpp:76] Failed to create 'aufs' backend: AufsBackend requires
root privileges
W1018 21:32:41.511358  5669 backend.cpp:76] Failed to create 'bind' backend: BindBackend requires
root privileges
I1018 21:32:41.511404  5669 provisioner.cpp:255] Using default backend 'copy'
I1018 21:32:41.515557  5683 slave.cpp:254] Mesos agent started on (824)@172.17.0.2:40911
I1018 21:32:41.515592  5683 slave.cpp:255] Flags at startup: --acls="" --appc_simple_discovery_uri_prefix="http://"
--appc_store_dir="/tmp/Endpoint_SlaveEndpointTest_UnauthorizedRequest_1_eEHN61/store/appc"
--authenticate_http_readonly="true" --authenticate_http_readwrite="true" --authenticatee="crammd5"
--authentication_backoff_factor="1secs" --authorizer="local" --cgroups_cpu_enable_pids_and_tids_count="false"
--cgroups_enable_cfs="false" --cgroups_hierarchy="/sys/fs/cgroup" --cgroups_limit_swap="false"
--cgroups_root="mesos" --container_disk_watch_interval="15secs" --containerizers="mesos" --credential="/tmp/Endpoint_SlaveEndpointTest_UnauthorizedRequest_1_eEHN61/credential"
--default_role="*" --disallow_sharing_agent_pid_namespace="false" --disk_watch_interval="1mins"
--docker="docker" --docker_kill_orphans="true" --docker_registry="https://registry-1.docker.io"
--docker_remove_delay="6hrs" --docker_socket="/var/run/docker.sock" --docker_stop_timeout="0ns"
--docker_store_dir="/tmp/Endpoint_SlaveEndpointTest_UnauthorizedRequest_1_eEHN61/store/docker"
--docker_volume_checkpoint_dir="/var/run/mesos/isolators/docker/volume" --enforce_container_disk_quota="false"
--executor_registration_timeout="1mins" --executor_reregistration_timeout="2secs" --executor_shutdown_grace_period="5secs"
--fetcher_cache_dir="/tmp/Endpoint_SlaveEndpointTest_UnauthorizedRequest_1_eEHN61/fetch" --fetcher_cache_size="2GB"
--frameworks_home="" --gc_delay="1weeks" --gc_disk_headroom="0.1" --hadoop_home="" --help="false"
--hostname_lookup="true" --http_command_executor="false" --http_credentials="/tmp/Endpoint_SlaveEndpointTest_UnauthorizedRequest_1_eEHN61/http_credentials"
--http_heartbeat_interval="30secs" --initialize_driver_logging="true" --isolation="posix/cpu,posix/mem"
--launcher="posix" --launcher_dir="/mesos/mesos-1.5.0/_build/src" --logbufsecs="0" --logging_level="INFO"
--max_completed_executors_per_framework="150" --oversubscribed_resources_interval="15secs"
--perf_duration="10secs" --perf_interval="1mins" --port="5051" --qos_correction_interval_min="0ns"
--quiet="false" --recover="reconnect" --recovery_timeout="15mins" --registration_backoff_factor="10ms"
--resources="cpus:2;gpus:0;mem:1024;disk:1024;ports:[31000-32000]" --revocable_cpu_low_priority="true"
--runtime_dir="/tmp/Endpoint_SlaveEndpointTest_UnauthorizedRequest_1_eEHN61" --sandbox_directory="/mnt/mesos/sandbox"
--strict="true" --switch_user="true" --systemd_enable_support="true" --systemd_runtime_directory="/run/systemd/system"
--version="false" --work_dir="/tmp/Endpoint_SlaveEndpointTest_UnauthorizedRequest_1_tkAvQp"
--zk_session_timeout="10secs"
I1018 21:32:41.516132  5683 credentials.hpp:86] Loading credential for authentication from
'/tmp/Endpoint_SlaveEndpointTest_UnauthorizedRequest_1_eEHN61/credential'
I1018 21:32:41.516353  5683 slave.cpp:287] Agent using credential for: test-principal
I1018 21:32:41.516384  5683 credentials.hpp:37] Loading credentials for authentication from
'/tmp/Endpoint_SlaveEndpointTest_UnauthorizedRequest_1_eEHN61/http_credentials'
I1018 21:32:41.516685  5683 http.cpp:1045] Creating default 'basic' HTTP authenticator for
realm 'mesos-agent-readonly'
I1018 21:32:41.516927  5683 http.cpp:1045] Creating default 'basic' HTTP authenticator for
realm 'mesos-agent-readwrite'
I1018 21:32:41.518761  5683 slave.cpp:585] Agent resources: [{"name":"cpus","scalar":{"value":2.0},"type":"SCALAR"},{"name":"mem","scalar":{"value":1024.0},"type":"SCALAR"},{"name":"disk","scalar":{"value":1024.0},"type":"SCALAR"},{"name":"ports","ranges":{"range":[{"begin":31000,"end":32000}]},"type":"RANGES"}]
I1018 21:32:41.519026  5683 slave.cpp:593] Agent attributes: [  ]
I1018 21:32:41.519042  5683 slave.cpp:602] Agent hostname: 5a0aa383eb7a
I1018 21:32:41.519193  5690 status_update_manager.cpp:177] Pausing sending status updates
I1018 21:32:41.520938  5681 state.cpp:64] Recovering state from '/tmp/Endpoint_SlaveEndpointTest_UnauthorizedRequest_1_tkAvQp/meta'
I1018 21:32:41.521369  5688 status_update_manager.cpp:203] Recovering status update manager
I1018 21:32:41.521574  5688 containerizer.cpp:649] Recovering containerizer
I1018 21:32:41.523089  5678 provisioner.cpp:416] Provisioner recovery complete
I1018 21:32:41.523561  5690 slave.cpp:6310] Finished recovery
I1018 21:32:41.527309  5679 process.cpp:3929] Handling HTTP event for process 'slave(824)'
with path: '/slave(824)/monitor/statistics.json'
I1018 21:32:41.528769  5676 http.cpp:1185] HTTP GET for /slave(824)/monitor/statistics.json
from 172.17.0.2:54890
I1018 21:32:41.528851  5676 http.cpp:976] Authorizing principal 'test-principal' to GET the
'/monitor/statistics.json' endpoint
I1018 21:32:41.531399  5669 slave.cpp:869] Agent terminating
[       OK ] Endpoint/SlaveEndpointTest.UnauthorizedRequest/1 (33 ms)
[ RUN      ] Endpoint/SlaveEndpointTest.UnauthorizedRequest/2
I1018 21:32:41.543226  5669 containerizer.cpp:292] Using isolation { environment_secret, posix/cpu,
posix/mem, filesystem/posix, network/cni }
W1018 21:32:41.543756  5669 backend.cpp:76] Failed to create 'aufs' backend: AufsBackend requires
root privileges
W1018 21:32:41.543881  5669 backend.cpp:76] Failed to create 'bind' backend: BindBackend requires
root privileges
I1018 21:32:41.543916  5669 provisioner.cpp:255] Using default backend 'copy'
I1018 21:32:41.548176  5690 slave.cpp:254] Mesos agent started on (825)@172.17.0.2:40911
I1018 21:32:41.548203  5690 slave.cpp:255] Flags at startup: --acls="" --appc_simple_discovery_uri_prefix="http://"
--appc_store_dir="/tmp/Endpoint_SlaveEndpointTest_UnauthorizedRequest_2_Y26Tqv/store/appc"
--authenticate_http_readonly="true" --authenticate_http_readwrite="true" --authenticatee="crammd5"
--authentication_backoff_factor="1secs" --authorizer="local" --cgroups_cpu_enable_pids_and_tids_count="false"
--cgroups_enable_cfs="false" --cgroups_hierarchy="/sys/fs/cgroup" --cgroups_limit_swap="false"
--cgroups_root="mesos" --container_disk_watch_interval="15secs" --containerizers="mesos" --credential="/tmp/Endpoint_SlaveEndpointTest_UnauthorizedRequest_2_Y26Tqv/credential"
--default_role="*" --disallow_sharing_agent_pid_namespace="false" --disk_watch_interval="1mins"
--docker="docker" --docker_kill_orphans="true" --docker_registry="https://registry-1.docker.io"
--docker_remove_delay="6hrs" --docker_socket="/var/run/docker.sock" --docker_stop_timeout="0ns"
--docker_store_dir="/tmp/Endpoint_SlaveEndpointTest_UnauthorizedRequest_2_Y26Tqv/store/docker"
--docker_volume_checkpoint_dir="/var/run/mesos/isolators/docker/volume" --enforce_container_disk_quota="false"
--executor_registration_timeout="1mins" --executor_reregistration_timeout="2secs" --executor_shutdown_grace_period="5secs"
--fetcher_cache_dir="/tmp/Endpoint_SlaveEndpointTest_UnauthorizedRequest_2_Y26Tqv/fetch" --fetcher_cache_size="2GB"
--frameworks_home="" --gc_delay="1weeks" --gc_disk_headroom="0.1" --hadoop_home="" --help="false"
--hostname_lookup="true" --http_command_executor="false" --http_credentials="/tmp/Endpoint_SlaveEndpointTest_UnauthorizedRequest_2_Y26Tqv/http_credentials"
--http_heartbeat_interval="30secs" --initialize_driver_logging="true" --isolation="posix/cpu,posix/mem"
--launcher="posix" --launcher_dir="/mesos/mesos-1.5.0/_build/src" --logbufsecs="0" --logging_level="INFO"
--max_completed_executors_per_framework="150" --oversubscribed_resources_interval="15secs"
--perf_duration="10secs" --perf_interval="1mins" --port="5051" --qos_correction_interval_min="0ns"
--quiet="false" --recover="reconnect" --recovery_timeout="15mins" --registration_backoff_factor="10ms"
--resources="cpus:2;gpus:0;mem:1024;disk:1024;ports:[31000-32000]" --revocable_cpu_low_priority="true"
--runtime_dir="/tmp/Endpoint_SlaveEndpointTest_UnauthorizedRequest_2_Y26Tqv" --sandbox_directory="/mnt/mesos/sandbox"
--strict="true" --switch_user="true" --systemd_enable_support="true" --systemd_runtime_directory="/run/systemd/system"
--version="false" --work_dir="/tmp/Endpoint_SlaveEndpointTest_UnauthorizedRequest_2_HjZF5S"
--zk_session_timeout="10secs"
I1018 21:32:41.548554  5690 credentials.hpp:86] Loading credential for authentication from
'/tmp/Endpoint_SlaveEndpointTest_UnauthorizedRequest_2_Y26Tqv/credential'
I1018 21:32:41.548719  5690 slave.cpp:287] Agent using credential for: test-principal
I1018 21:32:41.548740  5690 credentials.hpp:37] Loading credentials for authentication from
'/tmp/Endpoint_SlaveEndpointTest_UnauthorizedRequest_2_Y26Tqv/http_credentials'
I1018 21:32:41.549031  5690 http.cpp:1045] Creating default 'basic' HTTP authenticator for
realm 'mesos-agent-readonly'
I1018 21:32:41.549176  5690 http.cpp:1045] Creating default 'basic' HTTP authenticator for
realm 'mesos-agent-readwrite'
I1018 21:32:41.550644  5690 slave.cpp:585] Agent resources: [{"name":"cpus","scalar":{"value":2.0},"type":"SCALAR"},{"name":"mem","scalar":{"value":1024.0},"type":"SCALAR"},{"name":"disk","scalar":{"value":1024.0},"type":"SCALAR"},{"name":"ports","ranges":{"range":[{"begin":31000,"end":32000}]},"type":"RANGES"}]
I1018 21:32:41.550871  5690 slave.cpp:593] Agent attributes: [  ]
I1018 21:32:41.550884  5690 slave.cpp:602] Agent hostname: 5a0aa383eb7a
I1018 21:32:41.551017  5689 status_update_manager.cpp:177] Pausing sending status updates
I1018 21:32:41.552603  5674 state.cpp:64] Recovering state from '/tmp/Endpoint_SlaveEndpointTest_UnauthorizedRequest_2_HjZF5S/meta'
I1018 21:32:41.552968  5674 status_update_manager.cpp:203] Recovering status update manager
I1018 21:32:41.553277  5677 containerizer.cpp:649] Recovering containerizer
I1018 21:32:41.554936  5687 provisioner.cpp:416] Provisioner recovery complete
I1018 21:32:41.555446  5689 slave.cpp:6310] Finished recovery
I1018 21:32:41.558481  5677 process.cpp:3929] Handling HTTP event for process 'slave(825)'
with path: '/slave(825)/containers'
I1018 21:32:41.559973  5692 http.cpp:1185] HTTP GET for /slave(825)/containers from 172.17.0.2:54892
I1018 21:32:41.560047  5692 http.cpp:976] Authorizing principal 'test-principal' to GET the
'/containers' endpoint
I1018 21:32:41.562296  5669 slave.cpp:869] Agent terminating
[       OK ] Endpoint/SlaveEndpointTest.UnauthorizedRequest/2 (32 ms)
[ RUN      ] Endpoint/SlaveEndpointTest.NoAuthorizer/0
I1018 21:32:41.579524  5669 containerizer.cpp:292] Using isolation { environment_secret, posix/cpu,
posix/mem, filesystem/posix, network/cni }
W1018 21:32:41.580184  5669 backend.cpp:76] Failed to create 'aufs' backend: AufsBackend requires
root privileges
W1018 21:32:41.580323  5669 backend.cpp:76] Failed to create 'bind' backend: BindBackend requires
root privileges
I1018 21:32:41.580373  5669 provisioner.cpp:255] Using default backend 'copy'
I1018 21:32:41.582651  5669 cluster.cpp:448] Creating default 'local' authorizer
I1018 21:32:41.585505  5675 slave.cpp:254] Mesos agent started on (826)@172.17.0.2:40911
I1018 21:32:41.585532  5675 slave.cpp:255] Flags at startup: --acls="" --appc_simple_discovery_uri_prefix="http://"
--appc_store_dir="/tmp/Endpoint_SlaveEndpointTest_NoAuthorizer_0_MycJ4Y/store/appc" --authenticate_http_readonly="true"
--authenticate_http_readwrite="true" --authenticatee="crammd5" --authentication_backoff_factor="1secs"
--authorizer="local" --cgroups_cpu_enable_pids_and_tids_count="false" --cgroups_enable_cfs="false"
--cgroups_hierarchy="/sys/fs/cgroup" --cgroups_limit_swap="false" --cgroups_root="mesos" --container_disk_watch_interval="15secs"
--containerizers="mesos" --credential="/tmp/Endpoint_SlaveEndpointTest_NoAuthorizer_0_MycJ4Y/credential"
--default_role="*" --disallow_sharing_agent_pid_namespace="false" --disk_watch_interval="1mins"
--docker="docker" --docker_kill_orphans="true" --docker_registry="https://registry-1.docker.io"
--docker_remove_delay="6hrs" --docker_socket="/var/run/docker.sock" --docker_stop_timeout="0ns"
--docker_store_dir="/tmp/Endpoint_SlaveEndpointTest_NoAuthorizer_0_MycJ4Y/store/docker" --docker_volume_checkpoint_dir="/var/run/mesos/isolators/docker/volume"
--enforce_container_disk_quota="false" --executor_registration_timeout="1mins" --executor_reregistration_timeout="2secs"
--executor_shutdown_grace_period="5secs" --fetcher_cache_dir="/tmp/Endpoint_SlaveEndpointTest_NoAuthorizer_0_MycJ4Y/fetch"
--fetcher_cache_size="2GB" --frameworks_home="" --gc_delay="1weeks" --gc_disk_headroom="0.1"
--hadoop_home="" --help="false" --hostname_lookup="true" --http_command_executor="false" --http_credentials="/tmp/Endpoint_SlaveEndpointTest_NoAuthorizer_0_MycJ4Y/http_credentials"
--http_heartbeat_interval="30secs" --initialize_driver_logging="true" --isolation="posix/cpu,posix/mem"
--launcher="posix" --launcher_dir="/mesos/mesos-1.5.0/_build/src" --logbufsecs="0" --logging_level="INFO"
--max_completed_executors_per_framework="150" --oversubscribed_resources_interval="15secs"
--perf_duration="10secs" --perf_interval="1mins" --port="5051" --qos_correction_interval_min="0ns"
--quiet="false" --recover="reconnect" --recovery_timeout="15mins" --registration_backoff_factor="10ms"
--resources="cpus:2;gpus:0;mem:1024;disk:1024;ports:[31000-32000]" --revocable_cpu_low_priority="true"
--runtime_dir="/tmp/Endpoint_SlaveEndpointTest_NoAuthorizer_0_MycJ4Y" --sandbox_directory="/mnt/mesos/sandbox"
--strict="true" --switch_user="true" --systemd_enable_support="true" --systemd_runtime_directory="/run/systemd/system"
--version="false" --work_dir="/tmp/Endpoint_SlaveEndpointTest_NoAuthorizer_0_HzerEm" --zk_session_timeout="10secs"
I1018 21:32:41.585999  5675 credentials.hpp:86] Loading credential for authentication from
'/tmp/Endpoint_SlaveEndpointTest_NoAuthorizer_0_MycJ4Y/credential'
I1018 21:32:41.586210  5675 slave.cpp:287] Agent using credential for: test-principal
I1018 21:32:41.586235  5675 credentials.hpp:37] Loading credentials for authentication from
'/tmp/Endpoint_SlaveEndpointTest_NoAuthorizer_0_MycJ4Y/http_credentials'
I1018 21:32:41.586577  5675 http.cpp:1045] Creating default 'basic' HTTP authenticator for
realm 'mesos-agent-readonly'
I1018 21:32:41.586815  5675 http.cpp:1045] Creating default 'basic' HTTP authenticator for
realm 'mesos-agent-readwrite'
I1018 21:32:41.588759  5675 slave.cpp:585] Agent resources: [{"name":"cpus","scalar":{"value":2.0},"type":"SCALAR"},{"name":"mem","scalar":{"value":1024.0},"type":"SCALAR"},{"name":"disk","scalar":{"value":1024.0},"type":"SCALAR"},{"name":"ports","ranges":{"range":[{"begin":31000,"end":32000}]},"type":"RANGES"}]
I1018 21:32:41.589212  5675 slave.cpp:593] Agent attributes: [  ]
I1018 21:32:41.589236  5675 slave.cpp:602] Agent hostname: 5a0aa383eb7a
I1018 21:32:41.589447  5673 status_update_manager.cpp:177] Pausing sending status updates
I1018 21:32:41.591425  5682 state.cpp:64] Recovering state from '/tmp/Endpoint_SlaveEndpointTest_NoAuthorizer_0_HzerEm/meta'
I1018 21:32:41.591812  5682 status_update_manager.cpp:203] Recovering status update manager
I1018 21:32:41.592082  5682 containerizer.cpp:649] Recovering containerizer
I1018 21:32:41.593552  5681 provisioner.cpp:416] Provisioner recovery complete
I1018 21:32:41.594000  5689 slave.cpp:6310] Finished recovery
I1018 21:32:41.597204  5674 process.cpp:3929] Handling HTTP event for process 'slave(826)'
with path: '/slave(826)/monitor/statistics'
I1018 21:32:41.598546  5691 http.cpp:1185] HTTP GET for /slave(826)/monitor/statistics from
172.17.0.2:54894
I1018 21:32:41.598675  5691 http.cpp:976] Authorizing principal 'test-principal' to GET the
'/monitor/statistics' endpoint
I1018 21:32:41.603564  5669 slave.cpp:869] Agent terminating
[       OK ] Endpoint/SlaveEndpointTest.NoAuthorizer/0 (38 ms)
[ RUN      ] Endpoint/SlaveEndpointTest.NoAuthorizer/1
I1018 21:32:41.616169  5669 containerizer.cpp:292] Using isolation { environment_secret, posix/cpu,
posix/mem, filesystem/posix, network/cni }
W1018 21:32:41.616724  5669 backend.cpp:76] Failed to create 'aufs' backend: AufsBackend requires
root privileges
W1018 21:32:41.616843  5669 backend.cpp:76] Failed to create 'bind' backend: BindBackend requires
root privileges
I1018 21:32:41.616884  5669 provisioner.cpp:255] Using default backend 'copy'
I1018 21:32:41.618762  5669 cluster.cpp:448] Creating default 'local' authorizer
I1018 21:32:41.620820  5688 slave.cpp:254] Mesos agent started on (827)@172.17.0.2:40911
I1018 21:32:41.620851  5688 slave.cpp:255] Flags at startup: --acls="" --appc_simple_discovery_uri_prefix="http://"
--appc_store_dir="/tmp/Endpoint_SlaveEndpointTest_NoAuthorizer_1_SDuz5s/store/appc" --authenticate_http_readonly="true"
--authenticate_http_readwrite="true" --authenticatee="crammd5" --authentication_backoff_factor="1secs"
--authorizer="local" --cgroups_cpu_enable_pids_and_tids_count="false" --cgroups_enable_cfs="false"
--cgroups_hierarchy="/sys/fs/cgroup" --cgroups_limit_swap="false" --cgroups_root="mesos" --container_disk_watch_interval="15secs"
--containerizers="mesos" --credential="/tmp/Endpoint_SlaveEndpointTest_NoAuthorizer_1_SDuz5s/credential"
--default_role="*" --disallow_sharing_agent_pid_namespace="false" --disk_watch_interval="1mins"
--docker="docker" --docker_kill_orphans="true" --docker_registry="https://registry-1.docker.io"
--docker_remove_delay="6hrs" --docker_socket="/var/run/docker.sock" --docker_stop_timeout="0ns"
--docker_store_dir="/tmp/Endpoint_SlaveEndpointTest_NoAuthorizer_1_SDuz5s/store/docker" --docker_volume_checkpoint_dir="/var/run/mesos/isolators/docker/volume"
--enforce_container_disk_quota="false" --executor_registration_timeout="1mins" --executor_reregistration_timeout="2secs"
--executor_shutdown_grace_period="5secs" --fetcher_cache_dir="/tmp/Endpoint_SlaveEndpointTest_NoAuthorizer_1_SDuz5s/fetch"
--fetcher_cache_size="2GB" --frameworks_home="" --gc_delay="1weeks" --gc_disk_headroom="0.1"
--hadoop_home="" --help="false" --hostname_lookup="true" --http_command_executor="false" --http_credentials="/tmp/Endpoint_SlaveEndpointTest_NoAuthorizer_1_SDuz5s/http_credentials"
--http_heartbeat_interval="30secs" --initialize_driver_logging="true" --isolation="posix/cpu,posix/mem"
--launcher="posix" --launcher_dir="/mesos/mesos-1.5.0/_build/src" --logbufsecs="0" --logging_level="INFO"
--max_completed_executors_per_framework="150" --oversubscribed_resources_interval="15secs"
--perf_duration="10secs" --perf_interval="1mins" --port="5051" --qos_correction_interval_min="0ns"
--quiet="false" --recover="reconnect" --recovery_timeout="15mins" --registration_backoff_factor="10ms"
--resources="cpus:2;gpus:0;mem:1024;disk:1024;ports:[31000-32000]" --revocable_cpu_low_priority="true"
--runtime_dir="/tmp/Endpoint_SlaveEndpointTest_NoAuthorizer_1_SDuz5s" --sandbox_directory="/mnt/mesos/sandbox"
--strict="true" --switch_user="true" --systemd_enable_support="true" --systemd_runtime_directory="/run/systemd/system"
--version="false" --work_dir="/tmp/Endpoint_SlaveEndpointTest_NoAuthorizer_1_l1WzzQ" --zk_session_timeout="10secs"
I1018 21:32:41.621362  5688 credentials.hpp:86] Loading credential for authentication from
'/tmp/Endpoint_SlaveEndpointTest_NoAuthorizer_1_SDuz5s/credential'
I1018 21:32:41.621528  5688 slave.cpp:287] Agent using credential for: test-principal
I1018 21:32:41.621552  5688 credentials.hpp:37] Loading credentials for authentication from
'/tmp/Endpoint_SlaveEndpointTest_NoAuthorizer_1_SDuz5s/http_credentials'
I1018 21:32:41.621799  5688 http.cpp:1045] Creating default 'basic' HTTP authenticator for
realm 'mesos-agent-readonly'
I1018 21:32:41.621958  5688 http.cpp:1045] Creating default 'basic' HTTP authenticator for
realm 'mesos-agent-readwrite'
I1018 21:32:41.623481  5688 slave.cpp:585] Agent resources: [{"name":"cpus","scalar":{"value":2.0},"type":"SCALAR"},{"name":"mem","scalar":{"value":1024.0},"type":"SCALAR"},{"name":"disk","scalar":{"value":1024.0},"type":"SCALAR"},{"name":"ports","ranges":{"range":[{"begin":31000,"end":32000}]},"type":"RANGES"}]
I1018 21:32:41.623719  5688 slave.cpp:593] Agent attributes: [  ]
I1018 21:32:41.623731  5688 slave.cpp:602] Agent hostname: 5a0aa383eb7a
I1018 21:32:41.623886  5672 status_update_manager.cpp:177] Pausing sending status updates
I1018 21:32:41.625301  5675 state.cpp:64] Recovering state from '/tmp/Endpoint_SlaveEndpointTest_NoAuthorizer_1_l1WzzQ/meta'
I1018 21:32:41.625756  5690 status_update_manager.cpp:203] Recovering status update manager
I1018 21:32:41.626011  5690 containerizer.cpp:649] Recovering containerizer
I1018 21:32:41.627842  5686 provisioner.cpp:416] Provisioner recovery complete
I1018 21:32:41.628337  5681 slave.cpp:6310] Finished recovery
I1018 21:32:41.631913  5678 process.cpp:3929] Handling HTTP event for process 'slave(827)'
with path: '/slave(827)/monitor/statistics.json'
I1018 21:32:41.633224  5691 http.cpp:1185] HTTP GET for /slave(827)/monitor/statistics.json
from 172.17.0.2:54900
I1018 21:32:41.633301  5691 http.cpp:976] Authorizing principal 'test-principal' to GET the
'/monitor/statistics.json' endpoint
I1018 21:32:41.637506  5669 slave.cpp:869] Agent terminating
[       OK ] Endpoint/SlaveEndpointTest.NoAuthorizer/1 (33 ms)
[ RUN      ] Endpoint/SlaveEndpointTest.NoAuthorizer/2
I1018 21:32:41.649189  5669 containerizer.cpp:292] Using isolation { environment_secret, posix/cpu,
posix/mem, filesystem/posix, network/cni }
W1018 21:32:41.649731  5669 backend.cpp:76] Failed to create 'aufs' backend: AufsBackend requires
root privileges
W1018 21:32:41.649839  5669 backend.cpp:76] Failed to create 'bind' backend: BindBackend requires
root privileges
I1018 21:32:41.649871  5669 provisioner.cpp:255] Using default backend 'copy'
I1018 21:32:41.651623  5669 cluster.cpp:448] Creating default 'local' authorizer
I1018 21:32:41.653767  5679 slave.cpp:254] Mesos agent started on (828)@172.17.0.2:40911
I1018 21:32:41.653794  5679 slave.cpp:255] Flags at startup: --acls="" --appc_simple_discovery_uri_prefix="http://"
--appc_store_dir="/tmp/Endpoint_SlaveEndpointTest_NoAuthorizer_2_cbctqX/store/appc" --authenticate_http_readonly="true"
--authenticate_http_readwrite="true" --authenticatee="crammd5" --authentication_backoff_factor="1secs"
--authorizer="local" --cgroups_cpu_enable_pids_and_tids_count="false" --cgroups_enable_cfs="false"
--cgroups_hierarchy="/sys/fs/cgroup" --cgroups_limit_swap="false" --cgroups_root="mesos" --container_disk_watch_interval="15secs"
--containerizers="mesos" --credential="/tmp/Endpoint_SlaveEndpointTest_NoAuthorizer_2_cbctqX/credential"
--default_role="*" --disallow_sharing_agent_pid_namespace="false" --disk_watch_interval="1mins"
--docker="docker" --docker_kill_orphans="true" --docker_registry="https://registry-1.docker.io"
--docker_remove_delay="6hrs" --docker_socket="/var/run/docker.sock" --docker_stop_timeout="0ns"
--docker_store_dir="/tmp/Endpoint_SlaveEndpointTest_NoAuthorizer_2_cbctqX/store/docker" --docker_volume_checkpoint_dir="/var/run/mesos/isolators/docker/volume"
--enforce_container_disk_quota="false" --executor_registration_timeout="1mins" --executor_reregistration_timeout="2secs"
--executor_shutdown_grace_period="5secs" --fetcher_cache_dir="/tmp/Endpoint_SlaveEndpointTest_NoAuthorizer_2_cbctqX/fetch"
--fetcher_cache_size="2GB" --frameworks_home="" --gc_delay="1weeks" --gc_disk_headroom="0.1"
--hadoop_home="" --help="false" --hostname_lookup="true" --http_command_executor="false" --http_credentials="/tmp/Endpoint_SlaveEndpointTest_NoAuthorizer_2_cbctqX/http_credentials"
--http_heartbeat_interval="30secs" --initialize_driver_logging="true" --isolation="posix/cpu,posix/mem"
--launcher="posix" --launcher_dir="/mesos/mesos-1.5.0/_build/src" --logbufsecs="0" --logging_level="INFO"
--max_completed_executors_per_framework="150" --oversubscribed_resources_interval="15secs"
--perf_duration="10secs" --perf_interval="1mins" --port="5051" --qos_correction_interval_min="0ns"
--quiet="false" --recover="reconnect" --recovery_timeout="15mins" --registration_backoff_factor="10ms"
--resources="cpus:2;gpus:0;mem:1024;disk:1024;ports:[31000-32000]" --revocable_cpu_low_priority="true"
--runtime_dir="/tmp/Endpoint_SlaveEndpointTest_NoAuthorizer_2_cbctqX" --sandbox_directory="/mnt/mesos/sandbox"
--strict="true" --switch_user="true" --systemd_enable_support="true" --systemd_runtime_directory="/run/systemd/system"
--version="false" --work_dir="/tmp/Endpoint_SlaveEndpointTest_NoAuthorizer_2_p0iwPk" --zk_session_timeout="10secs"
I1018 21:32:41.654145  5679 credentials.hpp:86] Loading credential for authentication from
'/tmp/Endpoint_SlaveEndpointTest_NoAuthorizer_2_cbctqX/credential'
I1018 21:32:41.654311  5679 slave.cpp:287] Agent using credential for: test-principal
I1018 21:32:41.654333  5679 credentials.hpp:37] Loading credentials for authentication from
'/tmp/Endpoint_SlaveEndpointTest_NoAuthorizer_2_cbctqX/http_credentials'
I1018 21:32:41.654558  5679 http.cpp:1045] Creating default 'basic' HTTP authenticator for
realm 'mesos-agent-readonly'
I1018 21:32:41.654713  5679 http.cpp:1045] Creating default 'basic' HTTP authenticator for
realm 'mesos-agent-readwrite'
I1018 21:32:41.656100  5679 slave.cpp:585] Agent resources: [{"name":"cpus","scalar":{"value":2.0},"type":"SCALAR"},{"name":"mem","scalar":{"value":1024.0},"type":"SCALAR"},{"name":"disk","scalar":{"value":1024.0},"type":"SCALAR"},{"name":"ports","ranges":{"range":[{"begin":31000,"end":32000}]},"type":"RANGES"}]
I1018 21:32:41.656322  5679 slave.cpp:593] Agent attributes: [  ]
I1018 21:32:41.656335  5679 slave.cpp:602] Agent hostname: 5a0aa383eb7a
I1018 21:32:41.656486  5685 status_update_manager.cpp:177] Pausing sending status updates
I1018 21:32:41.658404  5689 state.cpp:64] Recovering state from '/tmp/Endpoint_SlaveEndpointTest_NoAuthorizer_2_p0iwPk/meta'
I1018 21:32:41.658691  5673 status_update_manager.cpp:203] Recovering status update manager
I1018 21:32:41.658987  5674 containerizer.cpp:649] Recovering containerizer
I1018 21:32:41.660428  5677 provisioner.cpp:416] Provisioner recovery complete
I1018 21:32:41.660943  5682 slave.cpp:6310] Finished recovery
I1018 21:32:41.664755  5684 process.cpp:3929] Handling HTTP event for process 'slave(828)'
with path: '/slave(828)/containers'
I1018 21:32:41.665954  5676 http.cpp:1185] HTTP GET for /slave(828)/containers from 172.17.0.2:54902
I1018 21:32:41.666019  5676 http.cpp:976] Authorizing principal 'test-principal' to GET the
'/containers' endpoint
I1018 21:32:41.670791  5669 slave.cpp:869] Agent terminating
[       OK ] Endpoint/SlaveEndpointTest.NoAuthorizer/2 (32 ms)
[----------] 9 tests from Endpoint/SlaveEndpointTest (320 ms total)

[----------] 2 tests from ContainerizerType/DefaultContainerDNSFlagTest
[ RUN      ] ContainerizerType/DefaultContainerDNSFlagTest.ValidateFlag/0
[       OK ] ContainerizerType/DefaultContainerDNSFlagTest.ValidateFlag/0 (9 ms)
[ RUN      ] ContainerizerType/DefaultContainerDNSFlagTest.ValidateFlag/1
[       OK ] ContainerizerType/DefaultContainerDNSFlagTest.ValidateFlag/1 (9 ms)
[----------] 2 tests from ContainerizerType/DefaultContainerDNSFlagTest (18 ms total)

[----------] Global test environment tear-down
[==========] 1696 tests from 185 test cases ran. (1003373 ms total)
[  PASSED  ] 1693 tests.
[  FAILED  ] 3 tests, listed below:
[  FAILED  ] SlaveTest.RunTaskGroup
[  FAILED  ] ContentType/ExecutorHttpApiTest.DefaultAccept/0, where GetParam() = application/x-protobuf
[  FAILED  ] DiskResource/PersistentVolumeTest.SharedPersistentVolumeMultipleTasks/0, where
GetParam() = 0

 3 FAILED TESTS
  YOU HAVE 21 DISABLED TESTS

I1018 21:32:41.758373  5694 process.cpp:1068] Failed to accept socket: future discarded
make[4]: *** [check-local] Error 1
make[4]: Leaving directory `/mesos/mesos-1.5.0/_build/src'
make[3]: *** [check-am] Error 2
make[3]: Leaving directory `/mesos/mesos-1.5.0/_build/src'
make[2]: *** [check] Error 2
make[2]: Leaving directory `/mesos/mesos-1.5.0/_build/src'
make[1]: *** [check-recursive] Error 1
make[1]: Leaving directory `/mesos/mesos-1.5.0/_build'
make: *** [distcheck] Error 1
+ docker rmi mesos-1508358741-9267
Untagged: mesos-1508358741-9267:latest
Deleted: sha256:5afbe1655aba7af6bf10507fe8d147d69fa3edccda35dc72983837e16d58b25f
Deleted: sha256:10488a50a32a980574bd083d118c01697f6e311bda2bfb4e204ccbe12808f0db
Deleted: sha256:5bf67ae646823205d449084411ecc4105ef82419e210e85c304f1740efb3c610
Deleted: sha256:ac364cd2fcf2aaee25f99fccd0eef0785d3fdb9c79cb309eeaf8e5e50d2cc2c7
Deleted: sha256:11cbda6d2182dad76155a00ec7e5f6c38be5a5fe2fa436e84a4cc21ab6bcc519
Deleted: sha256:e545b2f45d6377ad5a2621a22062766fab9437ec993538e465ea74c422ce64d7
Deleted: sha256:515bf7f3674c4a3258411f76cfa5359590bb1cfcc53a48b2a5a9ac1ab2886552
Deleted: sha256:b49471fe058a2d9f258bbe935ab7de5761a9e11c2984b6d43000ba17d2e7a1a8
Deleted: sha256:3e738835d059115a948496a59d18353f143bee738148930e5b295f872ebe2d97
Deleted: sha256:bfd5c5a1be86c62e6fa8c1c36c3dc7482415bf6603db8ddfb2ed8cfcb880b2a6
Deleted: sha256:0a55de666247e8f1757cdf34dff7c55a255af8d3e210984fa65ff6da55b44b62
Deleted: sha256:6738604e64cd8d6f2c622604e77c94f86c6ea6d2768cb381fbc2ad887a617c61
Deleted: sha256:6eb9b4d6f0551e2f653dc4978ffa8d51e6c8feaeef83a7f297acb8e987c3f9fe
Deleted: sha256:0b396272fa29f123e93f396ca7477f4a3862e8abed7a0449f94110c01cc7559d
Deleted: sha256:a211bf5db074c7f62f7657b5049d6ab656ff3b0ea3bc3bd96d03946d5364a270
Deleted: sha256:dce18ff0727dc8a0a43c628cf33da0d85dd68293e160c0a7289fc3638cc5a926
Deleted: sha256:4f8e786478d4983611bb1e99e627843009c43c6ef8833c023e21404bbb344100
Deleted: sha256:bad0229ab553eb5158ed16f37a270c150f79df39104688f09385c8ae3f4f004a
Deleted: sha256:58102c799341c3079eaa03111f4f348a9972c212331d20e0602e23b3ad679386
Deleted: sha256:dde9723bbf1cc6fad3c8b42036c965924efdc65a528d26c4fa449705a4f7427c
Deleted: sha256:574380a0358f228524e83b6e4259b1666d385513b8ba78b09ace9458e4586559
Deleted: sha256:d1d27c2f9b1b428f203a92721db8a030395cfcd60d42829530b6b2826de18630
Deleted: sha256:3200ef7a50a0e7e6b14db79c484015250a1ef531b6d3816363cf0073be0c478c
Deleted: sha256:193b8c1d5cf4457800d0f9294a9ab0b0f825f56fe994d47c3924b1ed60dd519f
Deleted: sha256:b0da2f01a81108f3ca40139570f72ab980d04fa22608569c026e72884a5568ae
Deleted: sha256:fd68048bf62d0252ffca66e2515f316788e3a46224816514fede486484b9e271
Deleted: sha256:a52f72fc8e663e065aabf9075c9982488c9f5c8401075d6da11d9a6b1bbce2bf
Deleted: sha256:7eb7ef1c834b7c184ef9d0938451708260ec3ba9b26c620659c1185df3f0d708
Build step 'Execute shell' marked build as failure


Mime
View raw message