mesos-builds mailing list archives

Site index · List index
Message view « Date » · « Thread »
Top « Date » · « Thread »
From Apache Jenkins Server <jenk...@builds.apache.org>
Subject Build failed in Jenkins: Mesos-Buildbot » autotools,clang,--verbose --disable-libtool-wrappers --enable-libevent --enable-ssl,GLOG_v=1 MESOS_VERBOSE=1,ubuntu:14.04,(ubuntu)&&(!ubuntu-us1)&&(!ubuntu-eu2)&&(!qnode3)&&(!H23) #4302
Date Tue, 10 Oct 2017 19:36:58 GMT
See <https://builds.apache.org/job/Mesos-Buildbot/BUILDTOOL=autotools,COMPILER=clang,CONFIGURATION=--verbose%20--disable-libtool-wrappers%20--enable-libevent%20--enable-ssl,ENVIRONMENT=GLOG_v=1%20MESOS_VERBOSE=1,OS=ubuntu%3A14.04,label_exp=(ubuntu)&&(!ubuntu-us1)&&(!ubuntu-eu2)&&(!qnode3)&&(!H23)/4302/display/redirect?page=changes>

Changes:

[alexr] Reverted 2af9a5b07dc80151154264e974d03f56a1c25838.

------------------------------------------
[...truncated 33.30 MB...]
I1010 19:35:53.072487 16894 slave.cpp:254] Mesos agent started on (828)@172.17.0.2:45193
I1010 19:35:53.072533 16894 slave.cpp:255] Flags at startup: --acls="" --appc_simple_discovery_uri_prefix="http://"
--appc_store_dir="/tmp/Endpoint_SlaveEndpointTest_UnauthorizedRequest_0_HSf99g/store/appc"
--authenticate_http_executors="true" --authenticate_http_readonly="true" --authenticate_http_readwrite="true"
--authenticatee="crammd5" --authentication_backoff_factor="1secs" --authorizer="local" --cgroups_cpu_enable_pids_and_tids_count="false"
--cgroups_enable_cfs="false" --cgroups_hierarchy="/sys/fs/cgroup" --cgroups_limit_swap="false"
--cgroups_root="mesos" --container_disk_watch_interval="15secs" --containerizers="mesos" --credential="/tmp/Endpoint_SlaveEndpointTest_UnauthorizedRequest_0_HSf99g/credential"
--default_role="*" --disallow_sharing_agent_pid_namespace="false" --disk_watch_interval="1mins"
--docker="docker" --docker_kill_orphans="true" --docker_registry="https://registry-1.docker.io"
--docker_remove_delay="6hrs" --docker_socket="/var/run/docker.sock" --docker_stop_timeout="0ns"
--docker_store_dir="/tmp/Endpoint_SlaveEndpointTest_UnauthorizedRequest_0_HSf99g/store/docker"
--docker_volume_checkpoint_dir="/var/run/mesos/isolators/docker/volume" --enforce_container_disk_quota="false"
--executor_registration_timeout="1mins" --executor_reregistration_timeout="2secs" --executor_secret_key="/tmp/Endpoint_SlaveEndpointTest_UnauthorizedRequest_0_HSf99g/executor_secret_key"
--executor_shutdown_grace_period="5secs" --fetcher_cache_dir="/tmp/Endpoint_SlaveEndpointTest_UnauthorizedRequest_0_HSf99g/fetch"
--fetcher_cache_size="2GB" --frameworks_home="" --gc_delay="1weeks" --gc_disk_headroom="0.1"
--hadoop_home="" --help="false" --hostname_lookup="true" --http_command_executor="false" --http_credentials="/tmp/Endpoint_SlaveEndpointTest_UnauthorizedRequest_0_HSf99g/http_credentials"
--http_heartbeat_interval="30secs" --initialize_driver_logging="true" --isolation="posix/cpu,posix/mem"
--launcher="posix" --launcher_dir="/mesos/mesos-1.5.0/_build/src" --logbufsecs="0" --logging_level="INFO"
--max_completed_executors_per_framework="150" --oversubscribed_resources_interval="15secs"
--perf_duration="10secs" --perf_interval="1mins" --port="5051" --qos_correction_interval_min="0ns"
--quiet="false" --recover="reconnect" --recovery_timeout="15mins" --registration_backoff_factor="10ms"
--resources="cpus:2;gpus:0;mem:1024;disk:1024;ports:[31000-32000]" --revocable_cpu_low_priority="true"
--runtime_dir="/tmp/Endpoint_SlaveEndpointTest_UnauthorizedRequest_0_HSf99g" --sandbox_directory="/mnt/mesos/sandbox"
--strict="true" --switch_user="true" --systemd_enable_support="true" --systemd_runtime_directory="/run/systemd/system"
--version="false" --work_dir="/tmp/Endpoint_SlaveEndpointTest_UnauthorizedRequest_0_zqzsLu"
--zk_session_timeout="10secs"
I1010 19:35:53.072962 16894 credentials.hpp:86] Loading credential for authentication from
'/tmp/Endpoint_SlaveEndpointTest_UnauthorizedRequest_0_HSf99g/credential'
I1010 19:35:53.073190 16894 slave.cpp:287] Agent using credential for: test-principal
I1010 19:35:53.073213 16894 credentials.hpp:37] Loading credentials for authentication from
'/tmp/Endpoint_SlaveEndpointTest_UnauthorizedRequest_0_HSf99g/http_credentials'
I1010 19:35:53.073520 16894 http.cpp:1045] Creating default 'basic' HTTP authenticator for
realm 'mesos-agent-executor'
I1010 19:35:53.073668 16894 http.cpp:1066] Creating default 'jwt' HTTP authenticator for realm
'mesos-agent-executor'
I1010 19:35:53.073904 16894 http.cpp:1045] Creating default 'basic' HTTP authenticator for
realm 'mesos-agent-readonly'
I1010 19:35:53.074004 16894 http.cpp:1066] Creating default 'jwt' HTTP authenticator for realm
'mesos-agent-readonly'
I1010 19:35:53.074167 16894 http.cpp:1045] Creating default 'basic' HTTP authenticator for
realm 'mesos-agent-readwrite'
I1010 19:35:53.074254 16894 http.cpp:1066] Creating default 'jwt' HTTP authenticator for realm
'mesos-agent-readwrite'
I1010 19:35:53.075634 16894 slave.cpp:585] Agent resources: [{"name":"cpus","scalar":{"value":2.0},"type":"SCALAR"},{"name":"mem","scalar":{"value":1024.0},"type":"SCALAR"},{"name":"disk","scalar":{"value":1024.0},"type":"SCALAR"},{"name":"ports","ranges":{"range":[{"begin":31000,"end":32000}]},"type":"RANGES"}]
I1010 19:35:53.075837 16894 slave.cpp:593] Agent attributes: [  ]
I1010 19:35:53.075852 16894 slave.cpp:602] Agent hostname: a20089648f1a
I1010 19:35:53.076012 16907 status_update_manager.cpp:177] Pausing sending status updates
I1010 19:35:53.077502 16895 state.cpp:64] Recovering state from '/tmp/Endpoint_SlaveEndpointTest_UnauthorizedRequest_0_zqzsLu/meta'
I1010 19:35:53.077811 16892 status_update_manager.cpp:203] Recovering status update manager
I1010 19:35:53.077970 16890 containerizer.cpp:648] Recovering containerizer
I1010 19:35:53.079108 16909 provisioner.cpp:416] Provisioner recovery complete
I1010 19:35:53.079376 16907 slave.cpp:6310] Finished recovery
I1010 19:35:53.079841 16907 slave.cpp:6492] Querying resource estimator for oversubscribable
resources
I1010 19:35:53.080047 16908 slave.cpp:6506] Received oversubscribable resources {} from the
resource estimator
I1010 19:35:53.082140 16893 process.cpp:3929] Handling HTTP event for process 'slave(828)'
with path: '/slave(828)/monitor/statistics'
I1010 19:35:53.083695 16901 http.cpp:1185] HTTP GET for /slave(828)/monitor/statistics from
172.17.0.2:46696
I1010 19:35:53.083763 16901 http.cpp:976] Authorizing principal 'test-principal' to GET the
'/monitor/statistics' endpoint
I1010 19:35:53.085294 16889 slave.cpp:869] Agent terminating
[       OK ] Endpoint/SlaveEndpointTest.UnauthorizedRequest/0 (28 ms)
[ RUN      ] Endpoint/SlaveEndpointTest.UnauthorizedRequest/1
I1010 19:35:53.095413  6686 containerizer.cpp:292] Using isolation { environment_secret, posix/cpu,
posix/mem, filesystem/posix, network/cni }
W1010 19:35:53.095840  6686 backend.cpp:76] Failed to create 'aufs' backend: AufsBackend requires
root privileges
W1010 19:35:53.095944  6686 backend.cpp:76] Failed to create 'bind' backend: BindBackend requires
root privileges
I1010 19:35:53.095976  6686 provisioner.cpp:255] Using default backend 'copy'
I1010 19:35:53.098975 16894 slave.cpp:254] Mesos agent started on (829)@172.17.0.2:45193
I1010 19:35:53.099006 16894 slave.cpp:255] Flags at startup: --acls="" --appc_simple_discovery_uri_prefix="http://"
--appc_store_dir="/tmp/Endpoint_SlaveEndpointTest_UnauthorizedRequest_1_rZcjZo/store/appc"
--authenticate_http_executors="true" --authenticate_http_readonly="true" --authenticate_http_readwrite="true"
--authenticatee="crammd5" --authentication_backoff_factor="1secs" --authorizer="local" --cgroups_cpu_enable_pids_and_tids_count="false"
--cgroups_enable_cfs="false" --cgroups_hierarchy="/sys/fs/cgroup" --cgroups_limit_swap="false"
--cgroups_root="mesos" --container_disk_watch_interval="15secs" --containerizers="mesos" --credential="/tmp/Endpoint_SlaveEndpointTest_UnauthorizedRequest_1_rZcjZo/credential"
--default_role="*" --disallow_sharing_agent_pid_namespace="false" --disk_watch_interval="1mins"
--docker="docker" --docker_kill_orphans="true" --docker_registry="https://registry-1.docker.io"
--docker_remove_delay="6hrs" --docker_socket="/var/run/docker.sock" --docker_stop_timeout="0ns"
--docker_store_dir="/tmp/Endpoint_SlaveEndpointTest_UnauthorizedRequest_1_rZcjZo/store/docker"
--docker_volume_checkpoint_dir="/var/run/mesos/isolators/docker/volume" --enforce_container_disk_quota="false"
--executor_registration_timeout="1mins" --executor_reregistration_timeout="2secs" --executor_secret_key="/tmp/Endpoint_SlaveEndpointTest_UnauthorizedRequest_1_rZcjZo/executor_secret_key"
--executor_shutdown_grace_period="5secs" --fetcher_cache_dir="/tmp/Endpoint_SlaveEndpointTest_UnauthorizedRequest_1_rZcjZo/fetch"
--fetcher_cache_size="2GB" --frameworks_home="" --gc_delay="1weeks" --gc_disk_headroom="0.1"
--hadoop_home="" --help="false" --hostname_lookup="true" --http_command_executor="false" --http_credentials="/tmp/Endpoint_SlaveEndpointTest_UnauthorizedRequest_1_rZcjZo/http_credentials"
--http_heartbeat_interval="30secs" --initialize_driver_logging="true" --isolation="posix/cpu,posix/mem"
--launcher="posix" --launcher_dir="/mesos/mesos-1.5.0/_build/src" --logbufsecs="0" --logging_level="INFO"
--max_completed_executors_per_framework="150" --oversubscribed_resources_interval="15secs"
--perf_duration="10secs" --perf_interval="1mins" --port="5051" --qos_correction_interval_min="0ns"
--quiet="false" --recover="reconnect" --recovery_timeout="15mins" --registration_backoff_factor="10ms"
--resources="cpus:2;gpus:0;mem:1024;disk:1024;ports:[31000-32000]" --revocable_cpu_low_priority="true"
--runtime_dir="/tmp/Endpoint_SlaveEndpointTest_UnauthorizedRequest_1_rZcjZo" --sandbox_directory="/mnt/mesos/sandbox"
--strict="true" --switch_user="true" --systemd_enable_support="true" --systemd_runtime_directory="/run/systemd/system"
--version="false" --work_dir="/tmp/Endpoint_SlaveEndpointTest_UnauthorizedRequest_1_csIrwC"
--zk_session_timeout="10secs"
I1010 19:35:53.099339 16894 credentials.hpp:86] Loading credential for authentication from
'/tmp/Endpoint_SlaveEndpointTest_UnauthorizedRequest_1_rZcjZo/credential'
I1010 19:35:53.099465 16894 slave.cpp:287] Agent using credential for: test-principal
I1010 19:35:53.099486 16894 credentials.hpp:37] Loading credentials for authentication from
'/tmp/Endpoint_SlaveEndpointTest_UnauthorizedRequest_1_rZcjZo/http_credentials'
I1010 19:35:53.099741 16894 http.cpp:1045] Creating default 'basic' HTTP authenticator for
realm 'mesos-agent-executor'
I1010 19:35:53.099848 16894 http.cpp:1066] Creating default 'jwt' HTTP authenticator for realm
'mesos-agent-executor'
I1010 19:35:53.100020 16894 http.cpp:1045] Creating default 'basic' HTTP authenticator for
realm 'mesos-agent-readonly'
I1010 19:35:53.100108 16894 http.cpp:1066] Creating default 'jwt' HTTP authenticator for realm
'mesos-agent-readonly'
I1010 19:35:53.100275 16894 http.cpp:1045] Creating default 'basic' HTTP authenticator for
realm 'mesos-agent-readwrite'
I1010 19:35:53.100361 16894 http.cpp:1066] Creating default 'jwt' HTTP authenticator for realm
'mesos-agent-readwrite'
I1010 19:35:53.101609 16894 slave.cpp:585] Agent resources: [{"name":"cpus","scalar":{"value":2.0},"type":"SCALAR"},{"name":"mem","scalar":{"value":1024.0},"type":"SCALAR"},{"name":"disk","scalar":{"value":1024.0},"type":"SCALAR"},{"name":"ports","ranges":{"range":[{"begin":31000,"end":32000}]},"type":"RANGES"}]
I1010 19:35:53.101799 16894 slave.cpp:593] Agent attributes: [  ]
I1010 19:35:53.101812 16894 slave.cpp:602] Agent hostname: a20089648f1a
I1010 19:35:53.101943 16895 status_update_manager.cpp:177] Pausing sending status updates
I1010 19:35:53.103286 16910 state.cpp:64] Recovering state from '/tmp/Endpoint_SlaveEndpointTest_UnauthorizedRequest_1_csIrwC/meta'
I1010 19:35:53.103502 16888 status_update_manager.cpp:203] Recovering status update manager
I1010 19:35:53.103652 16907 containerizer.cpp:648] Recovering containerizer
I1010 19:35:53.104717 16899 provisioner.cpp:416] Provisioner recovery complete
I1010 19:35:53.105000 16895 slave.cpp:6310] Finished recovery
I1010 19:35:53.105401 16895 slave.cpp:6492] Querying resource estimator for oversubscribable
resources
I1010 19:35:53.105598 16909 slave.cpp:6506] Received oversubscribable resources {} from the
resource estimator
I1010 19:35:53.107340 16892 process.cpp:3929] Handling HTTP event for process 'slave(829)'
with path: '/slave(829)/monitor/statistics.json'
I1010 19:35:53.108647 16899 http.cpp:1185] HTTP GET for /slave(829)/monitor/statistics.json
from 172.17.0.2:46698
I1010 19:35:53.108710 16899 http.cpp:976] Authorizing principal 'test-principal' to GET the
'/monitor/statistics.json' endpoint
I1010 19:35:53.109980 16906 slave.cpp:869] Agent terminating
[       OK ] Endpoint/SlaveEndpointTest.UnauthorizedRequest/1 (23 ms)
[ RUN      ] Endpoint/SlaveEndpointTest.UnauthorizedRequest/2
I1010 19:35:53.120658  6686 containerizer.cpp:292] Using isolation { environment_secret, posix/cpu,
posix/mem, filesystem/posix, network/cni }
W1010 19:35:53.121233  6686 backend.cpp:76] Failed to create 'aufs' backend: AufsBackend requires
root privileges
W1010 19:35:53.121342  6686 backend.cpp:76] Failed to create 'bind' backend: BindBackend requires
root privileges
I1010 19:35:53.121377  6686 provisioner.cpp:255] Using default backend 'copy'
I1010 19:35:53.124954 16887 slave.cpp:254] Mesos agent started on (830)@172.17.0.2:45193
I1010 19:35:53.124984 16887 slave.cpp:255] Flags at startup: --acls="" --appc_simple_discovery_uri_prefix="http://"
--appc_store_dir="/tmp/Endpoint_SlaveEndpointTest_UnauthorizedRequest_2_sZFf3w/store/appc"
--authenticate_http_executors="true" --authenticate_http_readonly="true" --authenticate_http_readwrite="true"
--authenticatee="crammd5" --authentication_backoff_factor="1secs" --authorizer="local" --cgroups_cpu_enable_pids_and_tids_count="false"
--cgroups_enable_cfs="false" --cgroups_hierarchy="/sys/fs/cgroup" --cgroups_limit_swap="false"
--cgroups_root="mesos" --container_disk_watch_interval="15secs" --containerizers="mesos" --credential="/tmp/Endpoint_SlaveEndpointTest_UnauthorizedRequest_2_sZFf3w/credential"
--default_role="*" --disallow_sharing_agent_pid_namespace="false" --disk_watch_interval="1mins"
--docker="docker" --docker_kill_orphans="true" --docker_registry="https://registry-1.docker.io"
--docker_remove_delay="6hrs" --docker_socket="/var/run/docker.sock" --docker_stop_timeout="0ns"
--docker_store_dir="/tmp/Endpoint_SlaveEndpointTest_UnauthorizedRequest_2_sZFf3w/store/docker"
--docker_volume_checkpoint_dir="/var/run/mesos/isolators/docker/volume" --enforce_container_disk_quota="false"
--executor_registration_timeout="1mins" --executor_reregistration_timeout="2secs" --executor_secret_key="/tmp/Endpoint_SlaveEndpointTest_UnauthorizedRequest_2_sZFf3w/executor_secret_key"
--executor_shutdown_grace_period="5secs" --fetcher_cache_dir="/tmp/Endpoint_SlaveEndpointTest_UnauthorizedRequest_2_sZFf3w/fetch"
--fetcher_cache_size="2GB" --frameworks_home="" --gc_delay="1weeks" --gc_disk_headroom="0.1"
--hadoop_home="" --help="false" --hostname_lookup="true" --http_command_executor="false" --http_credentials="/tmp/Endpoint_SlaveEndpointTest_UnauthorizedRequest_2_sZFf3w/http_credentials"
--http_heartbeat_interval="30secs" --initialize_driver_logging="true" --isolation="posix/cpu,posix/mem"
--launcher="posix" --launcher_dir="/mesos/mesos-1.5.0/_build/src" --logbufsecs="0" --logging_level="INFO"
--max_completed_executors_per_framework="150" --oversubscribed_resources_interval="15secs"
--perf_duration="10secs" --perf_interval="1mins" --port="5051" --qos_correction_interval_min="0ns"
--quiet="false" --recover="reconnect" --recovery_timeout="15mins" --registration_backoff_factor="10ms"
--resources="cpus:2;gpus:0;mem:1024;disk:1024;ports:[31000-32000]" --revocable_cpu_low_priority="true"
--runtime_dir="/tmp/Endpoint_SlaveEndpointTest_UnauthorizedRequest_2_sZFf3w" --sandbox_directory="/mnt/mesos/sandbox"
--strict="true" --switch_user="true" --systemd_enable_support="true" --systemd_runtime_directory="/run/systemd/system"
--version="false" --work_dir="/tmp/Endpoint_SlaveEndpointTest_UnauthorizedRequest_2_2VnIwK"
--zk_session_timeout="10secs"
I1010 19:35:53.125308 16887 credentials.hpp:86] Loading credential for authentication from
'/tmp/Endpoint_SlaveEndpointTest_UnauthorizedRequest_2_sZFf3w/credential'
I1010 19:35:53.125435 16887 slave.cpp:287] Agent using credential for: test-principal
I1010 19:35:53.125455 16887 credentials.hpp:37] Loading credentials for authentication from
'/tmp/Endpoint_SlaveEndpointTest_UnauthorizedRequest_2_sZFf3w/http_credentials'
I1010 19:35:53.125694 16887 http.cpp:1045] Creating default 'basic' HTTP authenticator for
realm 'mesos-agent-executor'
I1010 19:35:53.125797 16887 http.cpp:1066] Creating default 'jwt' HTTP authenticator for realm
'mesos-agent-executor'
I1010 19:35:53.125970 16887 http.cpp:1045] Creating default 'basic' HTTP authenticator for
realm 'mesos-agent-readonly'
I1010 19:35:53.126060 16887 http.cpp:1066] Creating default 'jwt' HTTP authenticator for realm
'mesos-agent-readonly'
I1010 19:35:53.126216 16887 http.cpp:1045] Creating default 'basic' HTTP authenticator for
realm 'mesos-agent-readwrite'
I1010 19:35:53.126319 16887 http.cpp:1066] Creating default 'jwt' HTTP authenticator for realm
'mesos-agent-readwrite'
I1010 19:35:53.127542 16887 slave.cpp:585] Agent resources: [{"name":"cpus","scalar":{"value":2.0},"type":"SCALAR"},{"name":"mem","scalar":{"value":1024.0},"type":"SCALAR"},{"name":"disk","scalar":{"value":1024.0},"type":"SCALAR"},{"name":"ports","ranges":{"range":[{"begin":31000,"end":32000}]},"type":"RANGES"}]
I1010 19:35:53.127729 16887 slave.cpp:593] Agent attributes: [  ]
I1010 19:35:53.127743 16887 slave.cpp:602] Agent hostname: a20089648f1a
I1010 19:35:53.127866 16897 status_update_manager.cpp:177] Pausing sending status updates
I1010 19:35:53.129096 16905 state.cpp:64] Recovering state from '/tmp/Endpoint_SlaveEndpointTest_UnauthorizedRequest_2_2VnIwK/meta'
I1010 19:35:53.129305 16906 status_update_manager.cpp:203] Recovering status update manager
I1010 19:35:53.129453 16899 containerizer.cpp:648] Recovering containerizer
I1010 19:35:53.130532 16903 provisioner.cpp:416] Provisioner recovery complete
I1010 19:35:53.130781 16897 slave.cpp:6310] Finished recovery
I1010 19:35:53.131155 16897 slave.cpp:6492] Querying resource estimator for oversubscribable
resources
I1010 19:35:53.131341 16893 slave.cpp:6506] Received oversubscribable resources {} from the
resource estimator
I1010 19:35:53.132985 16890 process.cpp:3929] Handling HTTP event for process 'slave(830)'
with path: '/slave(830)/containers'
I1010 19:35:53.134302 16903 http.cpp:1185] HTTP GET for /slave(830)/containers from 172.17.0.2:46700
I1010 19:35:53.134371 16903 http.cpp:976] Authorizing principal 'test-principal' to GET the
'/containers' endpoint
I1010 19:35:53.135635 16896 slave.cpp:869] Agent terminating
[       OK ] Endpoint/SlaveEndpointTest.UnauthorizedRequest/2 (25 ms)
[ RUN      ] Endpoint/SlaveEndpointTest.NoAuthorizer/0
I1010 19:35:53.145653  6686 containerizer.cpp:292] Using isolation { environment_secret, posix/cpu,
posix/mem, filesystem/posix, network/cni }
W1010 19:35:53.146103  6686 backend.cpp:76] Failed to create 'aufs' backend: AufsBackend requires
root privileges
W1010 19:35:53.146224  6686 backend.cpp:76] Failed to create 'bind' backend: BindBackend requires
root privileges
I1010 19:35:53.146266  6686 provisioner.cpp:255] Using default backend 'copy'
I1010 19:35:53.147797  6686 cluster.cpp:448] Creating default 'local' authorizer
I1010 19:35:53.149518 16896 slave.cpp:254] Mesos agent started on (831)@172.17.0.2:45193
I1010 19:35:53.149551 16896 slave.cpp:255] Flags at startup: --acls="" --appc_simple_discovery_uri_prefix="http://"
--appc_store_dir="/tmp/Endpoint_SlaveEndpointTest_NoAuthorizer_0_PhLnmF/store/appc" --authenticate_http_executors="true"
--authenticate_http_readonly="true" --authenticate_http_readwrite="true" --authenticatee="crammd5"
--authentication_backoff_factor="1secs" --authorizer="local" --cgroups_cpu_enable_pids_and_tids_count="false"
--cgroups_enable_cfs="false" --cgroups_hierarchy="/sys/fs/cgroup" --cgroups_limit_swap="false"
--cgroups_root="mesos" --container_disk_watch_interval="15secs" --containerizers="mesos" --credential="/tmp/Endpoint_SlaveEndpointTest_NoAuthorizer_0_PhLnmF/credential"
--default_role="*" --disallow_sharing_agent_pid_namespace="false" --disk_watch_interval="1mins"
--docker="docker" --docker_kill_orphans="true" --docker_registry="https://registry-1.docker.io"
--docker_remove_delay="6hrs" --docker_socket="/var/run/docker.sock" --docker_stop_timeout="0ns"
--docker_store_dir="/tmp/Endpoint_SlaveEndpointTest_NoAuthorizer_0_PhLnmF/store/docker" --docker_volume_checkpoint_dir="/var/run/mesos/isolators/docker/volume"
--enforce_container_disk_quota="false" --executor_registration_timeout="1mins" --executor_reregistration_timeout="2secs"
--executor_secret_key="/tmp/Endpoint_SlaveEndpointTest_NoAuthorizer_0_PhLnmF/executor_secret_key"
--executor_shutdown_grace_period="5secs" --fetcher_cache_dir="/tmp/Endpoint_SlaveEndpointTest_NoAuthorizer_0_PhLnmF/fetch"
--fetcher_cache_size="2GB" --frameworks_home="" --gc_delay="1weeks" --gc_disk_headroom="0.1"
--hadoop_home="" --help="false" --hostname_lookup="true" --http_command_executor="false" --http_credentials="/tmp/Endpoint_SlaveEndpointTest_NoAuthorizer_0_PhLnmF/http_credentials"
--http_heartbeat_interval="30secs" --initialize_driver_logging="true" --isolation="posix/cpu,posix/mem"
--launcher="posix" --launcher_dir="/mesos/mesos-1.5.0/_build/src" --logbufsecs="0" --logging_level="INFO"
--max_completed_executors_per_framework="150" --oversubscribed_resources_interval="15secs"
--perf_duration="10secs" --perf_interval="1mins" --port="5051" --qos_correction_interval_min="0ns"
--quiet="false" --recover="reconnect" --recovery_timeout="15mins" --registration_backoff_factor="10ms"
--resources="cpus:2;gpus:0;mem:1024;disk:1024;ports:[31000-32000]" --revocable_cpu_low_priority="true"
--runtime_dir="/tmp/Endpoint_SlaveEndpointTest_NoAuthorizer_0_PhLnmF" --sandbox_directory="/mnt/mesos/sandbox"
--strict="true" --switch_user="true" --systemd_enable_support="true" --systemd_runtime_directory="/run/systemd/system"
--version="false" --work_dir="/tmp/Endpoint_SlaveEndpointTest_NoAuthorizer_0_9E34LS" --zk_session_timeout="10secs"
I1010 19:35:53.149943 16896 credentials.hpp:86] Loading credential for authentication from
'/tmp/Endpoint_SlaveEndpointTest_NoAuthorizer_0_PhLnmF/credential'
I1010 19:35:53.150126 16896 slave.cpp:287] Agent using credential for: test-principal
I1010 19:35:53.150156 16896 credentials.hpp:37] Loading credentials for authentication from
'/tmp/Endpoint_SlaveEndpointTest_NoAuthorizer_0_PhLnmF/http_credentials'
I1010 19:35:53.150466 16896 http.cpp:1045] Creating default 'basic' HTTP authenticator for
realm 'mesos-agent-executor'
I1010 19:35:53.150614 16896 http.cpp:1066] Creating default 'jwt' HTTP authenticator for realm
'mesos-agent-executor'
I1010 19:35:53.150841 16896 http.cpp:1045] Creating default 'basic' HTTP authenticator for
realm 'mesos-agent-readonly'
I1010 19:35:53.150938 16896 http.cpp:1066] Creating default 'jwt' HTTP authenticator for realm
'mesos-agent-readonly'
I1010 19:35:53.151124 16896 http.cpp:1045] Creating default 'basic' HTTP authenticator for
realm 'mesos-agent-readwrite'
I1010 19:35:53.151221 16896 http.cpp:1066] Creating default 'jwt' HTTP authenticator for realm
'mesos-agent-readwrite'
I1010 19:35:53.152714 16896 slave.cpp:585] Agent resources: [{"name":"cpus","scalar":{"value":2.0},"type":"SCALAR"},{"name":"mem","scalar":{"value":1024.0},"type":"SCALAR"},{"name":"disk","scalar":{"value":1024.0},"type":"SCALAR"},{"name":"ports","ranges":{"range":[{"begin":31000,"end":32000}]},"type":"RANGES"}]
I1010 19:35:53.152916 16896 slave.cpp:593] Agent attributes: [  ]
I1010 19:35:53.152931 16896 slave.cpp:602] Agent hostname: a20089648f1a
I1010 19:35:53.153059 16890 status_update_manager.cpp:177] Pausing sending status updates
I1010 19:35:53.154880 16897 state.cpp:64] Recovering state from '/tmp/Endpoint_SlaveEndpointTest_NoAuthorizer_0_9E34LS/meta'
I1010 19:35:53.155163 16889 status_update_manager.cpp:203] Recovering status update manager
I1010 19:35:53.155359 16907 containerizer.cpp:648] Recovering containerizer
I1010 19:35:53.156536 16895 provisioner.cpp:416] Provisioner recovery complete
I1010 19:35:53.157012 16894 slave.cpp:6310] Finished recovery
I1010 19:35:53.157806 16894 slave.cpp:6492] Querying resource estimator for oversubscribable
resources
I1010 19:35:53.158118 16887 slave.cpp:6506] Received oversubscribable resources {} from the
resource estimator
I1010 19:35:53.160358 16908 process.cpp:3929] Handling HTTP event for process 'slave(831)'
with path: '/slave(831)/monitor/statistics'
I1010 19:35:53.161952 16895 http.cpp:1185] HTTP GET for /slave(831)/monitor/statistics from
172.17.0.2:46706
I1010 19:35:53.162022 16895 http.cpp:976] Authorizing principal 'test-principal' to GET the
'/monitor/statistics' endpoint
I1010 19:35:53.165231  6686 slave.cpp:869] Agent terminating
[       OK ] Endpoint/SlaveEndpointTest.NoAuthorizer/0 (29 ms)
[ RUN      ] Endpoint/SlaveEndpointTest.NoAuthorizer/1
I1010 19:35:53.175928  6686 containerizer.cpp:292] Using isolation { environment_secret, posix/cpu,
posix/mem, filesystem/posix, network/cni }
W1010 19:35:53.176359  6686 backend.cpp:76] Failed to create 'aufs' backend: AufsBackend requires
root privileges
W1010 19:35:53.176460  6686 backend.cpp:76] Failed to create 'bind' backend: BindBackend requires
root privileges
I1010 19:35:53.176492  6686 provisioner.cpp:255] Using default backend 'copy'
I1010 19:35:53.177924  6686 cluster.cpp:448] Creating default 'local' authorizer
I1010 19:35:53.179656 16896 slave.cpp:254] Mesos agent started on (832)@172.17.0.2:45193
I1010 19:35:53.179687 16896 slave.cpp:255] Flags at startup: --acls="" --appc_simple_discovery_uri_prefix="http://"
--appc_store_dir="/tmp/Endpoint_SlaveEndpointTest_NoAuthorizer_1_D0sYWN/store/appc" --authenticate_http_executors="true"
--authenticate_http_readonly="true" --authenticate_http_readwrite="true" --authenticatee="crammd5"
--authentication_backoff_factor="1secs" --authorizer="local" --cgroups_cpu_enable_pids_and_tids_count="false"
--cgroups_enable_cfs="false" --cgroups_hierarchy="/sys/fs/cgroup" --cgroups_limit_swap="false"
--cgroups_root="mesos" --container_disk_watch_interval="15secs" --containerizers="mesos" --credential="/tmp/Endpoint_SlaveEndpointTest_NoAuthorizer_1_D0sYWN/credential"
--default_role="*" --disallow_sharing_agent_pid_namespace="false" --disk_watch_interval="1mins"
--docker="docker" --docker_kill_orphans="true" --docker_registry="https://registry-1.docker.io"
--docker_remove_delay="6hrs" --docker_socket="/var/run/docker.sock" --docker_stop_timeout="0ns"
--docker_store_dir="/tmp/Endpoint_SlaveEndpointTest_NoAuthorizer_1_D0sYWN/store/docker" --docker_volume_checkpoint_dir="/var/run/mesos/isolators/docker/volume"
--enforce_container_disk_quota="false" --executor_registration_timeout="1mins" --executor_reregistration_timeout="2secs"
--executor_secret_key="/tmp/Endpoint_SlaveEndpointTest_NoAuthorizer_1_D0sYWN/executor_secret_key"
--executor_shutdown_grace_period="5secs" --fetcher_cache_dir="/tmp/Endpoint_SlaveEndpointTest_NoAuthorizer_1_D0sYWN/fetch"
--fetcher_cache_size="2GB" --frameworks_home="" --gc_delay="1weeks" --gc_disk_headroom="0.1"
--hadoop_home="" --help="false" --hostname_lookup="true" --http_command_executor="false" --http_credentials="/tmp/Endpoint_SlaveEndpointTest_NoAuthorizer_1_D0sYWN/http_credentials"
--http_heartbeat_interval="30secs" --initialize_driver_logging="true" --isolation="posix/cpu,posix/mem"
--launcher="posix" --launcher_dir="/mesos/mesos-1.5.0/_build/src" --logbufsecs="0" --logging_level="INFO"
--max_completed_executors_per_framework="150" --oversubscribed_resources_interval="15secs"
--perf_duration="10secs" --perf_interval="1mins" --port="5051" --qos_correction_interval_min="0ns"
--quiet="false" --recover="reconnect" --recovery_timeout="15mins" --registration_backoff_factor="10ms"
--resources="cpus:2;gpus:0;mem:1024;disk:1024;ports:[31000-32000]" --revocable_cpu_low_priority="true"
--runtime_dir="/tmp/Endpoint_SlaveEndpointTest_NoAuthorizer_1_D0sYWN" --sandbox_directory="/mnt/mesos/sandbox"
--strict="true" --switch_user="true" --systemd_enable_support="true" --systemd_runtime_directory="/run/systemd/system"
--version="false" --work_dir="/tmp/Endpoint_SlaveEndpointTest_NoAuthorizer_1_Rorai1" --zk_session_timeout="10secs"
I1010 19:35:53.179999 16896 credentials.hpp:86] Loading credential for authentication from
'/tmp/Endpoint_SlaveEndpointTest_NoAuthorizer_1_D0sYWN/credential'
I1010 19:35:53.180128 16896 slave.cpp:287] Agent using credential for: test-principal
I1010 19:35:53.180150 16896 credentials.hpp:37] Loading credentials for authentication from
'/tmp/Endpoint_SlaveEndpointTest_NoAuthorizer_1_D0sYWN/http_credentials'
I1010 19:35:53.180392 16896 http.cpp:1045] Creating default 'basic' HTTP authenticator for
realm 'mesos-agent-executor'
I1010 19:35:53.180511 16896 http.cpp:1066] Creating default 'jwt' HTTP authenticator for realm
'mesos-agent-executor'
I1010 19:35:53.180693 16896 http.cpp:1045] Creating default 'basic' HTTP authenticator for
realm 'mesos-agent-readonly'
I1010 19:35:53.180793 16896 http.cpp:1066] Creating default 'jwt' HTTP authenticator for realm
'mesos-agent-readonly'
I1010 19:35:53.180956 16896 http.cpp:1045] Creating default 'basic' HTTP authenticator for
realm 'mesos-agent-readwrite'
I1010 19:35:53.181068 16896 http.cpp:1066] Creating default 'jwt' HTTP authenticator for realm
'mesos-agent-readwrite'
I1010 19:35:53.182246 16896 slave.cpp:585] Agent resources: [{"name":"cpus","scalar":{"value":2.0},"type":"SCALAR"},{"name":"mem","scalar":{"value":1024.0},"type":"SCALAR"},{"name":"disk","scalar":{"value":1024.0},"type":"SCALAR"},{"name":"ports","ranges":{"range":[{"begin":31000,"end":32000}]},"type":"RANGES"}]
I1010 19:35:53.182451 16896 slave.cpp:593] Agent attributes: [  ]
I1010 19:35:53.182464 16896 slave.cpp:602] Agent hostname: a20089648f1a
I1010 19:35:53.182560 16906 status_update_manager.cpp:177] Pausing sending status updates
I1010 19:35:53.183758 16891 state.cpp:64] Recovering state from '/tmp/Endpoint_SlaveEndpointTest_NoAuthorizer_1_Rorai1/meta'
I1010 19:35:53.184231 16888 status_update_manager.cpp:203] Recovering status update manager
I1010 19:35:53.184443 16889 containerizer.cpp:648] Recovering containerizer
I1010 19:35:53.185842 16907 provisioner.cpp:416] Provisioner recovery complete
I1010 19:35:53.186149 16906 slave.cpp:6310] Finished recovery
I1010 19:35:53.186821 16906 slave.cpp:6492] Querying resource estimator for oversubscribable
resources
I1010 19:35:53.187052 16891 slave.cpp:6506] Received oversubscribable resources {} from the
resource estimator
I1010 19:35:53.189400 16893 process.cpp:3929] Handling HTTP event for process 'slave(832)'
with path: '/slave(832)/monitor/statistics.json'
I1010 19:35:53.191105 16907 http.cpp:1185] HTTP GET for /slave(832)/monitor/statistics.json
from 172.17.0.2:46710
I1010 19:35:53.191184 16907 http.cpp:976] Authorizing principal 'test-principal' to GET the
'/monitor/statistics.json' endpoint
I1010 19:35:53.193480 16893 slave.cpp:869] Agent terminating
[       OK ] Endpoint/SlaveEndpointTest.NoAuthorizer/1 (29 ms)
[ RUN      ] Endpoint/SlaveEndpointTest.NoAuthorizer/2
I1010 19:35:53.204726  6686 containerizer.cpp:292] Using isolation { environment_secret, posix/cpu,
posix/mem, filesystem/posix, network/cni }
W1010 19:35:53.205123  6686 backend.cpp:76] Failed to create 'aufs' backend: AufsBackend requires
root privileges
W1010 19:35:53.205216  6686 backend.cpp:76] Failed to create 'bind' backend: BindBackend requires
root privileges
I1010 19:35:53.205245  6686 provisioner.cpp:255] Using default backend 'copy'
I1010 19:35:53.206676  6686 cluster.cpp:448] Creating default 'local' authorizer
I1010 19:35:53.208312 16902 slave.cpp:254] Mesos agent started on (833)@172.17.0.2:45193
I1010 19:35:53.208376 16902 slave.cpp:255] Flags at startup: --acls="" --appc_simple_discovery_uri_prefix="http://"
--appc_store_dir="/tmp/Endpoint_SlaveEndpointTest_NoAuthorizer_2_2ftOOW/store/appc" --authenticate_http_executors="true"
--authenticate_http_readonly="true" --authenticate_http_readwrite="true" --authenticatee="crammd5"
--authentication_backoff_factor="1secs" --authorizer="local" --cgroups_cpu_enable_pids_and_tids_count="false"
--cgroups_enable_cfs="false" --cgroups_hierarchy="/sys/fs/cgroup" --cgroups_limit_swap="false"
--cgroups_root="mesos" --container_disk_watch_interval="15secs" --containerizers="mesos" --credential="/tmp/Endpoint_SlaveEndpointTest_NoAuthorizer_2_2ftOOW/credential"
--default_role="*" --disallow_sharing_agent_pid_namespace="false" --disk_watch_interval="1mins"
--docker="docker" --docker_kill_orphans="true" --docker_registry="https://registry-1.docker.io"
--docker_remove_delay="6hrs" --docker_socket="/var/run/docker.sock" --docker_stop_timeout="0ns"
--docker_store_dir="/tmp/Endpoint_SlaveEndpointTest_NoAuthorizer_2_2ftOOW/store/docker" --docker_volume_checkpoint_dir="/var/run/mesos/isolators/docker/volume"
--enforce_container_disk_quota="false" --executor_registration_timeout="1mins" --executor_reregistration_timeout="2secs"
--executor_secret_key="/tmp/Endpoint_SlaveEndpointTest_NoAuthorizer_2_2ftOOW/executor_secret_key"
--executor_shutdown_grace_period="5secs" --fetcher_cache_dir="/tmp/Endpoint_SlaveEndpointTest_NoAuthorizer_2_2ftOOW/fetch"
--fetcher_cache_size="2GB" --frameworks_home="" --gc_delay="1weeks" --gc_disk_headroom="0.1"
--hadoop_home="" --help="false" --hostname_lookup="true" --http_command_executor="false" --http_credentials="/tmp/Endpoint_SlaveEndpointTest_NoAuthorizer_2_2ftOOW/http_credentials"
--http_heartbeat_interval="30secs" --initialize_driver_logging="true" --isolation="posix/cpu,posix/mem"
--launcher="posix" --launcher_dir="/mesos/mesos-1.5.0/_build/src" --logbufsecs="0" --logging_level="INFO"
--max_completed_executors_per_framework="150" --oversubscribed_resources_interval="15secs"
--perf_duration="10secs" --perf_interval="1mins" --port="5051" --qos_correction_interval_min="0ns"
--quiet="false" --recover="reconnect" --recovery_timeout="15mins" --registration_backoff_factor="10ms"
--resources="cpus:2;gpus:0;mem:1024;disk:1024;ports:[31000-32000]" --revocable_cpu_low_priority="true"
--runtime_dir="/tmp/Endpoint_SlaveEndpointTest_NoAuthorizer_2_2ftOOW" --sandbox_directory="/mnt/mesos/sandbox"
--strict="true" --switch_user="true" --systemd_enable_support="true" --systemd_runtime_directory="/run/systemd/system"
--version="false" --work_dir="/tmp/Endpoint_SlaveEndpointTest_NoAuthorizer_2_vCVH59" --zk_session_timeout="10secs"
I1010 19:35:53.208865 16902 credentials.hpp:86] Loading credential for authentication from
'/tmp/Endpoint_SlaveEndpointTest_NoAuthorizer_2_2ftOOW/credential'
I1010 19:35:53.209138 16902 slave.cpp:287] Agent using credential for: test-principal
I1010 19:35:53.209161 16902 credentials.hpp:37] Loading credentials for authentication from
'/tmp/Endpoint_SlaveEndpointTest_NoAuthorizer_2_2ftOOW/http_credentials'
I1010 19:35:53.209435 16902 http.cpp:1045] Creating default 'basic' HTTP authenticator for
realm 'mesos-agent-executor'
I1010 19:35:53.209575 16902 http.cpp:1066] Creating default 'jwt' HTTP authenticator for realm
'mesos-agent-executor'
I1010 19:35:53.209789 16902 http.cpp:1045] Creating default 'basic' HTTP authenticator for
realm 'mesos-agent-readonly'
I1010 19:35:53.209897 16902 http.cpp:1066] Creating default 'jwt' HTTP authenticator for realm
'mesos-agent-readonly'
I1010 19:35:53.210058 16902 http.cpp:1045] Creating default 'basic' HTTP authenticator for
realm 'mesos-agent-readwrite'
I1010 19:35:53.210145 16902 http.cpp:1066] Creating default 'jwt' HTTP authenticator for realm
'mesos-agent-readwrite'
I1010 19:35:53.211563 16902 slave.cpp:585] Agent resources: [{"name":"cpus","scalar":{"value":2.0},"type":"SCALAR"},{"name":"mem","scalar":{"value":1024.0},"type":"SCALAR"},{"name":"disk","scalar":{"value":1024.0},"type":"SCALAR"},{"name":"ports","ranges":{"range":[{"begin":31000,"end":32000}]},"type":"RANGES"}]
I1010 19:35:53.211772 16902 slave.cpp:593] Agent attributes: [  ]
I1010 19:35:53.211786 16902 slave.cpp:602] Agent hostname: a20089648f1a
I1010 19:35:53.211918 16899 status_update_manager.cpp:177] Pausing sending status updates
I1010 19:35:53.213548 16890 state.cpp:64] Recovering state from '/tmp/Endpoint_SlaveEndpointTest_NoAuthorizer_2_vCVH59/meta'
I1010 19:35:53.213827 16895 status_update_manager.cpp:203] Recovering status update manager
I1010 19:35:53.214005 16906 containerizer.cpp:648] Recovering containerizer
I1010 19:35:53.215248 16901 provisioner.cpp:416] Provisioner recovery complete
I1010 19:35:53.215518 16899 slave.cpp:6310] Finished recovery
I1010 19:35:53.216125 16899 slave.cpp:6492] Querying resource estimator for oversubscribable
resources
I1010 19:35:53.216372 16896 slave.cpp:6506] Received oversubscribable resources {} from the
resource estimator
I1010 19:35:53.218518 16887 process.cpp:3929] Handling HTTP event for process 'slave(833)'
with path: '/slave(833)/containers'
I1010 19:35:53.220147 16901 http.cpp:1185] HTTP GET for /slave(833)/containers from 172.17.0.2:46712
I1010 19:35:53.220222 16901 http.cpp:976] Authorizing principal 'test-principal' to GET the
'/containers' endpoint
I1010 19:35:53.222957 16907 slave.cpp:869] Agent terminating
[       OK ] Endpoint/SlaveEndpointTest.NoAuthorizer/2 (30 ms)
[----------] 9 tests from Endpoint/SlaveEndpointTest (267 ms total)

[----------] 2 tests from ContainerizerType/DefaultContainerDNSFlagTest
[ RUN      ] ContainerizerType/DefaultContainerDNSFlagTest.ValidateFlag/0
[       OK ] ContainerizerType/DefaultContainerDNSFlagTest.ValidateFlag/0 (9 ms)
[ RUN      ] ContainerizerType/DefaultContainerDNSFlagTest.ValidateFlag/1
[       OK ] ContainerizerType/DefaultContainerDNSFlagTest.ValidateFlag/1 (8 ms)
[----------] 2 tests from ContainerizerType/DefaultContainerDNSFlagTest (17 ms total)

[----------] Global test environment tear-down
[==========] 1703 tests from 187 test cases ran. (469554 ms total)
[  PASSED  ] 1702 tests.
[  FAILED  ] 1 test, listed below:
[  FAILED  ] DiskQuotaTest.SlaveRecovery

 1 FAILED TEST
  YOU HAVE 21 DISABLED TESTS

I1010 19:35:53.317900 16911 process.cpp:1068] Failed to accept socket: future discarded
make[4]: *** [check-local] Error 1
make[4]: Leaving directory `/mesos/mesos-1.5.0/_build/src'
make[3]: *** [check-am] Error 2
make[3]: Leaving directory `/mesos/mesos-1.5.0/_build/src'
make[2]: *** [check] Error 2
make[2]: Leaving directory `/mesos/mesos-1.5.0/_build/src'
make[1]: *** [check-recursive] Error 1
make[1]: Leaving directory `/mesos/mesos-1.5.0/_build'
make: *** [distcheck] Error 1
+ docker rmi mesos-1507661142-3768
Untagged: mesos-1507661142-3768:latest
Deleted: sha256:3075e4efddcf71a4c7f7633e7cbf1e62f2c7adab2753d08bdcb4c03730d5be90
Deleted: sha256:6b69e071541c115f293f49a4017a42679271d434cb60123fb3bca683a03a5ec5
Deleted: sha256:dd8893b7569395e08060fad152309659b0815a84d61cf8b2e2b88bd897cf0ea5
Deleted: sha256:3462ed851340889be332dfb708182609b66eb8bfb65991960d2ba094e188ef64
Deleted: sha256:f7807067bd2c51f02d6d45c094d84feae051caff9472a29ba76c9a18355f6410
Deleted: sha256:0f192345756501fa7ea152f708ee914202d6289d52aa952fcfb7e747b212f5e9
Deleted: sha256:5d379df15d6d8351351ae47b1d304c1de4379f763cc44d880592ec74e3b5598f
Deleted: sha256:c17f3f4cb5fcedf70d6579ac906bc96f825628d454250a9506583aa7837cd05c
Deleted: sha256:7a998b7fc77de627c2c801804afb8d87b30fc77e34776398d87173b3e56e1557
Deleted: sha256:8e7ad2b6fc81c328a962e27d416c4073396122e8e2ba1e284154fea6bb55084b
Deleted: sha256:bc60ce0240c821f449cd8339ef64407a4e8fc227b4155f228a4a27989915581d
Deleted: sha256:6750d0dc8e4b6f632113f1819b24e69e60ff8141ce93a19374cc5ad8e8114089
Deleted: sha256:9eea1e0350d5bc86128ad1e9f7e9ec2461437dc6cdbd06ba1cd90fa7affa0c1c
Deleted: sha256:56a07897c72f926ff5a90a455e08185ca245b869c4dab373ea814f8ea25d7e2d
Deleted: sha256:bebc9af9fe530e0e3da97e440a718f111f71a44a047578f1aee08c4cf7d8c646
Deleted: sha256:736d4bc9185b724b4c2c385caab718a0aa7a42b61ef53279e60b7ffbb545715f
Deleted: sha256:9aa942476522a9d4c85106c731a514b7941bcb7e6a3c68663750ea2edbb05e8e
Deleted: sha256:76f552fcfa5eb0b7a1106f58a4afcc66af1392262ef1947160aeca76444a15c0
Deleted: sha256:017a81364abfd78a3b42c2ac123ba2cb99ae54a16b5c2d1a7c4b3da456eef21c
Deleted: sha256:3275bc0f23ad3d1cfc0452a886ca7273df5e428c513ae144d142bdef93908ea2
Deleted: sha256:44018e5deb1e3e8126cc0dfd7a3b83b3e2af9d5b4301a504bac4c2108c151eb1
Deleted: sha256:9f64459baf225dc021f192e1aed0b09976e8656da1377dff8078dda94df515cc
Deleted: sha256:1f88e34332be885a43c7463f96e1a494adafaeea01b38cc5b80288033229a373
Deleted: sha256:08850cfdb27f4cf0226fa92dee32676ac9f5c105e37a497424396c1c1e3d4018
Deleted: sha256:53b96a71feda44d8c4595aade7f5ac010068a43a18ac28396e44de441a5f156d
Deleted: sha256:f4908b2c9b4a1afbbf7c8bf5b719770c5053a44f87115122717d3918cbecaee2
Deleted: sha256:d3b62e1d2ca637a95e8545082c6594b1aad83c2a8cde28f03bb8b2bd3dbe2fa7
Deleted: sha256:b67792c0b66d356db40da42e9dd89cecc13bea3b5f8fb0c07365daa6a21dfe7c
Build step 'Execute shell' marked build as failure


Mime
View raw message