mesos-builds mailing list archives

Site index · List index
Message view « Date » · « Thread »
Top « Date » · « Thread »
From Apache Jenkins Server <jenk...@builds.apache.org>
Subject Build failed in Jenkins: Mesos-Reviewbot #19659
Date Tue, 03 Oct 2017 15:20:04 GMT
See <https://builds.apache.org/job/Mesos-Reviewbot/19659/display/redirect>

------------------------------------------
[...truncated 31.94 MB...]
I1003 15:19:58.841931  5813 credentials.hpp:37] Loading credentials for authentication from
'/tmp/Endpoint_SlaveEndpointTest_AuthorizedRequest_2_5PV8la/http_credentials'
I1003 15:19:58.842478  5813 http.cpp:1045] Creating default 'basic' HTTP authenticator for
realm 'mesos-agent-readonly'
I1003 15:19:58.842804  5813 http.cpp:1045] Creating default 'basic' HTTP authenticator for
realm 'mesos-agent-readwrite'
I1003 15:19:58.845263  5813 slave.cpp:585] Agent resources: [{"name":"cpus","scalar":{"value":2.0},"type":"SCALAR"},{"name":"mem","scalar":{"value":1024.0},"type":"SCALAR"},{"name":"disk","scalar":{"value":1024.0},"type":"SCALAR"},{"name":"ports","ranges":{"range":[{"begin":31000,"end":32000}]},"type":"RANGES"}]
I1003 15:19:58.845674  5813 slave.cpp:593] Agent attributes: [  ]
I1003 15:19:58.845703  5813 slave.cpp:602] Agent hostname: 2f40fd0f9919
I1003 15:19:58.845959  5801 status_update_manager.cpp:177] Pausing sending status updates
I1003 15:19:58.848333  5804 state.cpp:64] Recovering state from '/tmp/Endpoint_SlaveEndpointTest_AuthorizedRequest_2_l5NhGt/meta'
I1003 15:19:58.848651  5806 status_update_manager.cpp:203] Recovering status update manager
I1003 15:19:58.848878  5806 containerizer.cpp:648] Recovering containerizer
I1003 15:19:58.850646  5793 provisioner.cpp:416] Provisioner recovery complete
I1003 15:19:58.851305  5809 slave.cpp:6310] Finished recovery
I1003 15:19:58.851960  5809 slave.cpp:6492] Querying resource estimator for oversubscribable
resources
I1003 15:19:58.852344  5811 slave.cpp:6506] Received oversubscribable resources {} from the
resource estimator
I1003 15:19:58.855069  5797 process.cpp:3929] Handling HTTP event for process 'slave(820)'
with path: '/slave(820)/containers'
I1003 15:19:58.856899  5791 http.cpp:1185] HTTP GET for /slave(820)/containers from 172.17.0.2:45770
I1003 15:19:58.856994  5791 http.cpp:976] Authorizing principal 'test-principal' to GET the
'/containers' endpoint
I1003 15:19:58.862301  5772 slave.cpp:869] Agent terminating
[       OK ] Endpoint/SlaveEndpointTest.AuthorizedRequest/2 (45 ms)
[ RUN      ] Endpoint/SlaveEndpointTest.UnauthorizedRequest/0
I1003 15:19:58.880445  5772 containerizer.cpp:292] Using isolation { environment_secret, posix/cpu,
posix/mem, filesystem/posix, network/cni }
W1003 15:19:58.881253  5772 backend.cpp:76] Failed to create 'aufs' backend: AufsBackend requires
root privileges
W1003 15:19:58.881451  5772 backend.cpp:76] Failed to create 'bind' backend: BindBackend requires
root privileges
I1003 15:19:58.881494  5772 provisioner.cpp:255] Using default backend 'copy'
I1003 15:19:58.886776  5799 slave.cpp:254] Mesos agent started on (821)@172.17.0.2:37295
I1003 15:19:58.886818  5799 slave.cpp:255] Flags at startup: --acls="" --appc_simple_discovery_uri_prefix="http://"
--appc_store_dir="/tmp/Endpoint_SlaveEndpointTest_UnauthorizedRequest_0_VmFDqV/store/appc"
--authenticate_http_readonly="true" --authenticate_http_readwrite="true" --authenticatee="crammd5"
--authentication_backoff_factor="1secs" --authorizer="local" --cgroups_cpu_enable_pids_and_tids_count="false"
--cgroups_enable_cfs="false" --cgroups_hierarchy="/sys/fs/cgroup" --cgroups_limit_swap="false"
--cgroups_root="mesos" --container_disk_watch_interval="15secs" --containerizers="mesos" --credential="/tmp/Endpoint_SlaveEndpointTest_UnauthorizedRequest_0_VmFDqV/credential"
--default_role="*" --disallow_sharing_agent_pid_namespace="false" --disk_watch_interval="1mins"
--docker="docker" --docker_kill_orphans="true" --docker_registry="https://registry-1.docker.io"
--docker_remove_delay="6hrs" --docker_socket="/var/run/docker.sock" --docker_stop_timeout="0ns"
--docker_store_dir="/tmp/Endpoint_SlaveEndpointTest_UnauthorizedRequest_0_VmFDqV/store/docker"
--docker_volume_checkpoint_dir="/var/run/mesos/isolators/docker/volume" --enforce_container_disk_quota="false"
--executor_registration_timeout="1mins" --executor_reregistration_timeout="2secs" --executor_shutdown_grace_period="5secs"
--fetcher_cache_dir="/tmp/Endpoint_SlaveEndpointTest_UnauthorizedRequest_0_VmFDqV/fetch" --fetcher_cache_size="2GB"
--frameworks_home="" --gc_delay="1weeks" --gc_disk_headroom="0.1" --hadoop_home="" --help="false"
--hostname_lookup="true" --http_command_executor="false" --http_credentials="/tmp/Endpoint_SlaveEndpointTest_UnauthorizedRequest_0_VmFDqV/http_credentials"
--http_heartbeat_interval="30secs" --initialize_driver_logging="true" --isolation="posix/cpu,posix/mem"
--launcher="posix" --launcher_dir="/mesos/mesos-1.5.0/_build/src" --logbufsecs="0" --logging_level="INFO"
--max_completed_executors_per_framework="150" --oversubscribed_resources_interval="15secs"
--perf_duration="10secs" --perf_interval="1mins" --port="5051" --qos_correction_interval_min="0ns"
--quiet="false" --recover="reconnect" --recovery_timeout="15mins" --registration_backoff_factor="10ms"
--resources="cpus:2;gpus:0;mem:1024;disk:1024;ports:[31000-32000]" --revocable_cpu_low_priority="true"
--runtime_dir="/tmp/Endpoint_SlaveEndpointTest_UnauthorizedRequest_0_VmFDqV" --sandbox_directory="/mnt/mesos/sandbox"
--strict="true" --switch_user="true" --systemd_enable_support="true" --systemd_runtime_directory="/run/systemd/system"
--version="false" --work_dir="/tmp/Endpoint_SlaveEndpointTest_UnauthorizedRequest_0_pgRYDe"
--zk_session_timeout="10secs"
I1003 15:19:58.887331  5799 credentials.hpp:86] Loading credential for authentication from
'/tmp/Endpoint_SlaveEndpointTest_UnauthorizedRequest_0_VmFDqV/credential'
I1003 15:19:58.887522  5799 slave.cpp:287] Agent using credential for: test-principal
I1003 15:19:58.887552  5799 credentials.hpp:37] Loading credentials for authentication from
'/tmp/Endpoint_SlaveEndpointTest_UnauthorizedRequest_0_VmFDqV/http_credentials'
I1003 15:19:58.887862  5799 http.cpp:1045] Creating default 'basic' HTTP authenticator for
realm 'mesos-agent-readonly'
I1003 15:19:58.888135  5799 http.cpp:1045] Creating default 'basic' HTTP authenticator for
realm 'mesos-agent-readwrite'
I1003 15:19:58.890043  5799 slave.cpp:585] Agent resources: [{"name":"cpus","scalar":{"value":2.0},"type":"SCALAR"},{"name":"mem","scalar":{"value":1024.0},"type":"SCALAR"},{"name":"disk","scalar":{"value":1024.0},"type":"SCALAR"},{"name":"ports","ranges":{"range":[{"begin":31000,"end":32000}]},"type":"RANGES"}]
I1003 15:19:58.890400  5799 slave.cpp:593] Agent attributes: [  ]
I1003 15:19:58.890420  5799 slave.cpp:602] Agent hostname: 2f40fd0f9919
I1003 15:19:58.890635  5802 status_update_manager.cpp:177] Pausing sending status updates
I1003 15:19:58.892223  5806 state.cpp:64] Recovering state from '/tmp/Endpoint_SlaveEndpointTest_UnauthorizedRequest_0_pgRYDe/meta'
I1003 15:19:58.892529  5803 status_update_manager.cpp:203] Recovering status update manager
I1003 15:19:58.892786  5803 containerizer.cpp:648] Recovering containerizer
I1003 15:19:58.894577  5796 provisioner.cpp:416] Provisioner recovery complete
I1003 15:19:58.895207  5801 slave.cpp:6310] Finished recovery
I1003 15:19:58.895782  5801 slave.cpp:6492] Querying resource estimator for oversubscribable
resources
I1003 15:19:58.896086  5809 slave.cpp:6506] Received oversubscribable resources {} from the
resource estimator
I1003 15:19:58.898715  5793 process.cpp:3929] Handling HTTP event for process 'slave(821)'
with path: '/slave(821)/monitor/statistics'
I1003 15:19:58.900130  5794 http.cpp:1185] HTTP GET for /slave(821)/monitor/statistics from
172.17.0.2:45772
I1003 15:19:58.900230  5794 http.cpp:976] Authorizing principal 'test-principal' to GET the
'/monitor/statistics' endpoint
I1003 15:19:58.904273  5772 slave.cpp:869] Agent terminating
[       OK ] Endpoint/SlaveEndpointTest.UnauthorizedRequest/0 (40 ms)
[ RUN      ] Endpoint/SlaveEndpointTest.UnauthorizedRequest/1
I1003 15:19:58.918977  5772 containerizer.cpp:292] Using isolation { environment_secret, posix/cpu,
posix/mem, filesystem/posix, network/cni }
W1003 15:19:58.919625  5772 backend.cpp:76] Failed to create 'aufs' backend: AufsBackend requires
root privileges
W1003 15:19:58.919759  5772 backend.cpp:76] Failed to create 'bind' backend: BindBackend requires
root privileges
I1003 15:19:58.919800  5772 provisioner.cpp:255] Using default backend 'copy'
I1003 15:19:58.924566  5812 slave.cpp:254] Mesos agent started on (822)@172.17.0.2:37295
I1003 15:19:58.924594  5812 slave.cpp:255] Flags at startup: --acls="" --appc_simple_discovery_uri_prefix="http://"
--appc_store_dir="/tmp/Endpoint_SlaveEndpointTest_UnauthorizedRequest_1_KiCzTG/store/appc"
--authenticate_http_readonly="true" --authenticate_http_readwrite="true" --authenticatee="crammd5"
--authentication_backoff_factor="1secs" --authorizer="local" --cgroups_cpu_enable_pids_and_tids_count="false"
--cgroups_enable_cfs="false" --cgroups_hierarchy="/sys/fs/cgroup" --cgroups_limit_swap="false"
--cgroups_root="mesos" --container_disk_watch_interval="15secs" --containerizers="mesos" --credential="/tmp/Endpoint_SlaveEndpointTest_UnauthorizedRequest_1_KiCzTG/credential"
--default_role="*" --disallow_sharing_agent_pid_namespace="false" --disk_watch_interval="1mins"
--docker="docker" --docker_kill_orphans="true" --docker_registry="https://registry-1.docker.io"
--docker_remove_delay="6hrs" --docker_socket="/var/run/docker.sock" --docker_stop_timeout="0ns"
--docker_store_dir="/tmp/Endpoint_SlaveEndpointTest_UnauthorizedRequest_1_KiCzTG/store/docker"
--docker_volume_checkpoint_dir="/var/run/mesos/isolators/docker/volume" --enforce_container_disk_quota="false"
--executor_registration_timeout="1mins" --executor_reregistration_timeout="2secs" --executor_shutdown_grace_period="5secs"
--fetcher_cache_dir="/tmp/Endpoint_SlaveEndpointTest_UnauthorizedRequest_1_KiCzTG/fetch" --fetcher_cache_size="2GB"
--frameworks_home="" --gc_delay="1weeks" --gc_disk_headroom="0.1" --hadoop_home="" --help="false"
--hostname_lookup="true" --http_command_executor="false" --http_credentials="/tmp/Endpoint_SlaveEndpointTest_UnauthorizedRequest_1_KiCzTG/http_credentials"
--http_heartbeat_interval="30secs" --initialize_driver_logging="true" --isolation="posix/cpu,posix/mem"
--launcher="posix" --launcher_dir="/mesos/mesos-1.5.0/_build/src" --logbufsecs="0" --logging_level="INFO"
--max_completed_executors_per_framework="150" --oversubscribed_resources_interval="15secs"
--perf_duration="10secs" --perf_interval="1mins" --port="5051" --qos_correction_interval_min="0ns"
--quiet="false" --recover="reconnect" --recovery_timeout="15mins" --registration_backoff_factor="10ms"
--resources="cpus:2;gpus:0;mem:1024;disk:1024;ports:[31000-32000]" --revocable_cpu_low_priority="true"
--runtime_dir="/tmp/Endpoint_SlaveEndpointTest_UnauthorizedRequest_1_KiCzTG" --sandbox_directory="/mnt/mesos/sandbox"
--strict="true" --switch_user="true" --systemd_enable_support="true" --systemd_runtime_directory="/run/systemd/system"
--version="false" --work_dir="/tmp/Endpoint_SlaveEndpointTest_UnauthorizedRequest_1_CVWZ0Z"
--zk_session_timeout="10secs"
I1003 15:19:58.925106  5812 credentials.hpp:86] Loading credential for authentication from
'/tmp/Endpoint_SlaveEndpointTest_UnauthorizedRequest_1_KiCzTG/credential'
I1003 15:19:58.925313  5812 slave.cpp:287] Agent using credential for: test-principal
I1003 15:19:58.925348  5812 credentials.hpp:37] Loading credentials for authentication from
'/tmp/Endpoint_SlaveEndpointTest_UnauthorizedRequest_1_KiCzTG/http_credentials'
I1003 15:19:58.925757  5812 http.cpp:1045] Creating default 'basic' HTTP authenticator for
realm 'mesos-agent-readonly'
I1003 15:19:58.926038  5812 http.cpp:1045] Creating default 'basic' HTTP authenticator for
realm 'mesos-agent-readwrite'
I1003 15:19:58.928324  5812 slave.cpp:585] Agent resources: [{"name":"cpus","scalar":{"value":2.0},"type":"SCALAR"},{"name":"mem","scalar":{"value":1024.0},"type":"SCALAR"},{"name":"disk","scalar":{"value":1024.0},"type":"SCALAR"},{"name":"ports","ranges":{"range":[{"begin":31000,"end":32000}]},"type":"RANGES"}]
I1003 15:19:58.928728  5812 slave.cpp:593] Agent attributes: [  ]
I1003 15:19:58.928750  5812 slave.cpp:602] Agent hostname: 2f40fd0f9919
I1003 15:19:58.928989  5792 status_update_manager.cpp:177] Pausing sending status updates
I1003 15:19:58.930660  5796 state.cpp:64] Recovering state from '/tmp/Endpoint_SlaveEndpointTest_UnauthorizedRequest_1_CVWZ0Z/meta'
I1003 15:19:58.931170  5808 status_update_manager.cpp:203] Recovering status update manager
I1003 15:19:58.931471  5799 containerizer.cpp:648] Recovering containerizer
I1003 15:19:58.933228  5793 provisioner.cpp:416] Provisioner recovery complete
I1003 15:19:58.933842  5793 slave.cpp:6310] Finished recovery
I1003 15:19:58.934456  5793 slave.cpp:6492] Querying resource estimator for oversubscribable
resources
I1003 15:19:58.934774  5802 slave.cpp:6506] Received oversubscribable resources {} from the
resource estimator
I1003 15:19:58.937976  5811 process.cpp:3929] Handling HTTP event for process 'slave(822)'
with path: '/slave(822)/monitor/statistics.json'
I1003 15:19:58.939635  5813 http.cpp:1185] HTTP GET for /slave(822)/monitor/statistics.json
from 172.17.0.2:45774
I1003 15:19:58.939723  5813 http.cpp:976] Authorizing principal 'test-principal' to GET the
'/monitor/statistics.json' endpoint
I1003 15:19:58.942447  5772 slave.cpp:869] Agent terminating
[       OK ] Endpoint/SlaveEndpointTest.UnauthorizedRequest/1 (38 ms)
[ RUN      ] Endpoint/SlaveEndpointTest.UnauthorizedRequest/2
I1003 15:19:58.957842  5772 containerizer.cpp:292] Using isolation { environment_secret, posix/cpu,
posix/mem, filesystem/posix, network/cni }
W1003 15:19:58.958529  5772 backend.cpp:76] Failed to create 'aufs' backend: AufsBackend requires
root privileges
W1003 15:19:58.958664  5772 backend.cpp:76] Failed to create 'bind' backend: BindBackend requires
root privileges
I1003 15:19:58.958709  5772 provisioner.cpp:255] Using default backend 'copy'
I1003 15:19:58.963505  5812 slave.cpp:254] Mesos agent started on (823)@172.17.0.2:37295
I1003 15:19:58.963537  5812 slave.cpp:255] Flags at startup: --acls="" --appc_simple_discovery_uri_prefix="http://"
--appc_store_dir="/tmp/Endpoint_SlaveEndpointTest_UnauthorizedRequest_2_Aw1CJs/store/appc"
--authenticate_http_readonly="true" --authenticate_http_readwrite="true" --authenticatee="crammd5"
--authentication_backoff_factor="1secs" --authorizer="local" --cgroups_cpu_enable_pids_and_tids_count="false"
--cgroups_enable_cfs="false" --cgroups_hierarchy="/sys/fs/cgroup" --cgroups_limit_swap="false"
--cgroups_root="mesos" --container_disk_watch_interval="15secs" --containerizers="mesos" --credential="/tmp/Endpoint_SlaveEndpointTest_UnauthorizedRequest_2_Aw1CJs/credential"
--default_role="*" --disallow_sharing_agent_pid_namespace="false" --disk_watch_interval="1mins"
--docker="docker" --docker_kill_orphans="true" --docker_registry="https://registry-1.docker.io"
--docker_remove_delay="6hrs" --docker_socket="/var/run/docker.sock" --docker_stop_timeout="0ns"
--docker_store_dir="/tmp/Endpoint_SlaveEndpointTest_UnauthorizedRequest_2_Aw1CJs/store/docker"
--docker_volume_checkpoint_dir="/var/run/mesos/isolators/docker/volume" --enforce_container_disk_quota="false"
--executor_registration_timeout="1mins" --executor_reregistration_timeout="2secs" --executor_shutdown_grace_period="5secs"
--fetcher_cache_dir="/tmp/Endpoint_SlaveEndpointTest_UnauthorizedRequest_2_Aw1CJs/fetch" --fetcher_cache_size="2GB"
--frameworks_home="" --gc_delay="1weeks" --gc_disk_headroom="0.1" --hadoop_home="" --help="false"
--hostname_lookup="true" --http_command_executor="false" --http_credentials="/tmp/Endpoint_SlaveEndpointTest_UnauthorizedRequest_2_Aw1CJs/http_credentials"
--http_heartbeat_interval="30secs" --initialize_driver_logging="true" --isolation="posix/cpu,posix/mem"
--launcher="posix" --launcher_dir="/mesos/mesos-1.5.0/_build/src" --logbufsecs="0" --logging_level="INFO"
--max_completed_executors_per_framework="150" --oversubscribed_resources_interval="15secs"
--perf_duration="10secs" --perf_interval="1mins" --port="5051" --qos_correction_interval_min="0ns"
--quiet="false" --recover="reconnect" --recovery_timeout="15mins" --registration_backoff_factor="10ms"
--resources="cpus:2;gpus:0;mem:1024;disk:1024;ports:[31000-32000]" --revocable_cpu_low_priority="true"
--runtime_dir="/tmp/Endpoint_SlaveEndpointTest_UnauthorizedRequest_2_Aw1CJs" --sandbox_directory="/mnt/mesos/sandbox"
--strict="true" --switch_user="true" --systemd_enable_support="true" --systemd_runtime_directory="/run/systemd/system"
--version="false" --work_dir="/tmp/Endpoint_SlaveEndpointTest_UnauthorizedRequest_2_CIjgLL"
--zk_session_timeout="10secs"
I1003 15:19:58.964099  5812 credentials.hpp:86] Loading credential for authentication from
'/tmp/Endpoint_SlaveEndpointTest_UnauthorizedRequest_2_Aw1CJs/credential'
I1003 15:19:58.964279  5812 slave.cpp:287] Agent using credential for: test-principal
I1003 15:19:58.964319  5812 credentials.hpp:37] Loading credentials for authentication from
'/tmp/Endpoint_SlaveEndpointTest_UnauthorizedRequest_2_Aw1CJs/http_credentials'
I1003 15:19:58.964640  5812 http.cpp:1045] Creating default 'basic' HTTP authenticator for
realm 'mesos-agent-readonly'
I1003 15:19:58.964841  5812 http.cpp:1045] Creating default 'basic' HTTP authenticator for
realm 'mesos-agent-readwrite'
I1003 15:19:58.966554  5812 slave.cpp:585] Agent resources: [{"name":"cpus","scalar":{"value":2.0},"type":"SCALAR"},{"name":"mem","scalar":{"value":1024.0},"type":"SCALAR"},{"name":"disk","scalar":{"value":1024.0},"type":"SCALAR"},{"name":"ports","ranges":{"range":[{"begin":31000,"end":32000}]},"type":"RANGES"}]
I1003 15:19:58.966821  5812 slave.cpp:593] Agent attributes: [  ]
I1003 15:19:58.966836  5812 slave.cpp:602] Agent hostname: 2f40fd0f9919
I1003 15:19:58.967068  5811 status_update_manager.cpp:177] Pausing sending status updates
I1003 15:19:58.968526  5799 state.cpp:64] Recovering state from '/tmp/Endpoint_SlaveEndpointTest_UnauthorizedRequest_2_CIjgLL/meta'
I1003 15:19:58.968910  5814 status_update_manager.cpp:203] Recovering status update manager
I1003 15:19:58.969144  5814 containerizer.cpp:648] Recovering containerizer
I1003 15:19:58.970865  5796 provisioner.cpp:416] Provisioner recovery complete
I1003 15:19:58.971346  5796 slave.cpp:6310] Finished recovery
I1003 15:19:58.971971  5796 slave.cpp:6492] Querying resource estimator for oversubscribable
resources
I1003 15:19:58.972311  5794 slave.cpp:6506] Received oversubscribable resources {} from the
resource estimator
I1003 15:19:58.975116  5803 process.cpp:3929] Handling HTTP event for process 'slave(823)'
with path: '/slave(823)/containers'
I1003 15:19:58.976482  5791 http.cpp:1185] HTTP GET for /slave(823)/containers from 172.17.0.2:45776
I1003 15:19:58.976595  5791 http.cpp:976] Authorizing principal 'test-principal' to GET the
'/containers' endpoint
I1003 15:19:58.980168  5804 slave.cpp:869] Agent terminating
[       OK ] Endpoint/SlaveEndpointTest.UnauthorizedRequest/2 (37 ms)
[ RUN      ] Endpoint/SlaveEndpointTest.NoAuthorizer/0
I1003 15:19:58.997083  5772 containerizer.cpp:292] Using isolation { environment_secret, posix/cpu,
posix/mem, filesystem/posix, network/cni }
W1003 15:19:58.997823  5772 backend.cpp:76] Failed to create 'aufs' backend: AufsBackend requires
root privileges
W1003 15:19:58.997993  5772 backend.cpp:76] Failed to create 'bind' backend: BindBackend requires
root privileges
I1003 15:19:58.998029  5772 provisioner.cpp:255] Using default backend 'copy'
I1003 15:19:59.000413  5772 cluster.cpp:448] Creating default 'local' authorizer
I1003 15:19:59.003106  5801 slave.cpp:254] Mesos agent started on (824)@172.17.0.2:37295
I1003 15:19:59.003155  5801 slave.cpp:255] Flags at startup: --acls="" --appc_simple_discovery_uri_prefix="http://"
--appc_store_dir="/tmp/Endpoint_SlaveEndpointTest_NoAuthorizer_0_Y6jnWe/store/appc" --authenticate_http_readonly="true"
--authenticate_http_readwrite="true" --authenticatee="crammd5" --authentication_backoff_factor="1secs"
--authorizer="local" --cgroups_cpu_enable_pids_and_tids_count="false" --cgroups_enable_cfs="false"
--cgroups_hierarchy="/sys/fs/cgroup" --cgroups_limit_swap="false" --cgroups_root="mesos" --container_disk_watch_interval="15secs"
--containerizers="mesos" --credential="/tmp/Endpoint_SlaveEndpointTest_NoAuthorizer_0_Y6jnWe/credential"
--default_role="*" --disallow_sharing_agent_pid_namespace="false" --disk_watch_interval="1mins"
--docker="docker" --docker_kill_orphans="true" --docker_registry="https://registry-1.docker.io"
--docker_remove_delay="6hrs" --docker_socket="/var/run/docker.sock" --docker_stop_timeout="0ns"
--docker_store_dir="/tmp/Endpoint_SlaveEndpointTest_NoAuthorizer_0_Y6jnWe/store/docker" --docker_volume_checkpoint_dir="/var/run/mesos/isolators/docker/volume"
--enforce_container_disk_quota="false" --executor_registration_timeout="1mins" --executor_reregistration_timeout="2secs"
--executor_shutdown_grace_period="5secs" --fetcher_cache_dir="/tmp/Endpoint_SlaveEndpointTest_NoAuthorizer_0_Y6jnWe/fetch"
--fetcher_cache_size="2GB" --frameworks_home="" --gc_delay="1weeks" --gc_disk_headroom="0.1"
--hadoop_home="" --help="false" --hostname_lookup="true" --http_command_executor="false" --http_credentials="/tmp/Endpoint_SlaveEndpointTest_NoAuthorizer_0_Y6jnWe/http_credentials"
--http_heartbeat_interval="30secs" --initialize_driver_logging="true" --isolation="posix/cpu,posix/mem"
--launcher="posix" --launcher_dir="/mesos/mesos-1.5.0/_build/src" --logbufsecs="0" --logging_level="INFO"
--max_completed_executors_per_framework="150" --oversubscribed_resources_interval="15secs"
--perf_duration="10secs" --perf_interval="1mins" --port="5051" --qos_correction_interval_min="0ns"
--quiet="false" --recover="reconnect" --recovery_timeout="15mins" --registration_backoff_factor="10ms"
--resources="cpus:2;gpus:0;mem:1024;disk:1024;ports:[31000-32000]" --revocable_cpu_low_priority="true"
--runtime_dir="/tmp/Endpoint_SlaveEndpointTest_NoAuthorizer_0_Y6jnWe" --sandbox_directory="/mnt/mesos/sandbox"
--strict="true" --switch_user="true" --systemd_enable_support="true" --systemd_runtime_directory="/run/systemd/system"
--version="false" --work_dir="/tmp/Endpoint_SlaveEndpointTest_NoAuthorizer_0_267hSx" --zk_session_timeout="10secs"
I1003 15:19:59.003685  5801 credentials.hpp:86] Loading credential for authentication from
'/tmp/Endpoint_SlaveEndpointTest_NoAuthorizer_0_Y6jnWe/credential'
I1003 15:19:59.003895  5801 slave.cpp:287] Agent using credential for: test-principal
I1003 15:19:59.003944  5801 credentials.hpp:37] Loading credentials for authentication from
'/tmp/Endpoint_SlaveEndpointTest_NoAuthorizer_0_Y6jnWe/http_credentials'
I1003 15:19:59.004279  5801 http.cpp:1045] Creating default 'basic' HTTP authenticator for
realm 'mesos-agent-readonly'
I1003 15:19:59.004528  5801 http.cpp:1045] Creating default 'basic' HTTP authenticator for
realm 'mesos-agent-readwrite'
I1003 15:19:59.006506  5801 slave.cpp:585] Agent resources: [{"name":"cpus","scalar":{"value":2.0},"type":"SCALAR"},{"name":"mem","scalar":{"value":1024.0},"type":"SCALAR"},{"name":"disk","scalar":{"value":1024.0},"type":"SCALAR"},{"name":"ports","ranges":{"range":[{"begin":31000,"end":32000}]},"type":"RANGES"}]
I1003 15:19:59.006794  5801 slave.cpp:593] Agent attributes: [  ]
I1003 15:19:59.006820  5801 slave.cpp:602] Agent hostname: 2f40fd0f9919
I1003 15:19:59.007041  5794 status_update_manager.cpp:177] Pausing sending status updates
I1003 15:19:59.008565  5791 state.cpp:64] Recovering state from '/tmp/Endpoint_SlaveEndpointTest_NoAuthorizer_0_267hSx/meta'
I1003 15:19:59.009068  5804 status_update_manager.cpp:203] Recovering status update manager
I1003 15:19:59.009408  5797 containerizer.cpp:648] Recovering containerizer
I1003 15:19:59.011291  5803 provisioner.cpp:416] Provisioner recovery complete
I1003 15:19:59.011819  5808 slave.cpp:6310] Finished recovery
I1003 15:19:59.012418  5808 slave.cpp:6492] Querying resource estimator for oversubscribable
resources
I1003 15:19:59.012706  5806 slave.cpp:6506] Received oversubscribable resources {} from the
resource estimator
I1003 15:19:59.015671  5813 process.cpp:3929] Handling HTTP event for process 'slave(824)'
with path: '/slave(824)/monitor/statistics'
I1003 15:19:59.017427  5814 http.cpp:1185] HTTP GET for /slave(824)/monitor/statistics from
172.17.0.2:45778
I1003 15:19:59.017513  5814 http.cpp:976] Authorizing principal 'test-principal' to GET the
'/monitor/statistics' endpoint
I1003 15:19:59.022320  5772 slave.cpp:869] Agent terminating
[       OK ] Endpoint/SlaveEndpointTest.NoAuthorizer/0 (40 ms)
[ RUN      ] Endpoint/SlaveEndpointTest.NoAuthorizer/1
I1003 15:19:59.036731  5772 containerizer.cpp:292] Using isolation { environment_secret, posix/cpu,
posix/mem, filesystem/posix, network/cni }
W1003 15:19:59.037317  5772 backend.cpp:76] Failed to create 'aufs' backend: AufsBackend requires
root privileges
W1003 15:19:59.037439  5772 backend.cpp:76] Failed to create 'bind' backend: BindBackend requires
root privileges
I1003 15:19:59.037475  5772 provisioner.cpp:255] Using default backend 'copy'
I1003 15:19:59.039373  5772 cluster.cpp:448] Creating default 'local' authorizer
I1003 15:19:59.041635  5795 slave.cpp:254] Mesos agent started on (825)@172.17.0.2:37295
I1003 15:19:59.041664  5795 slave.cpp:255] Flags at startup: --acls="" --appc_simple_discovery_uri_prefix="http://"
--appc_store_dir="/tmp/Endpoint_SlaveEndpointTest_NoAuthorizer_1_8XWex1/store/appc" --authenticate_http_readonly="true"
--authenticate_http_readwrite="true" --authenticatee="crammd5" --authentication_backoff_factor="1secs"
--authorizer="local" --cgroups_cpu_enable_pids_and_tids_count="false" --cgroups_enable_cfs="false"
--cgroups_hierarchy="/sys/fs/cgroup" --cgroups_limit_swap="false" --cgroups_root="mesos" --container_disk_watch_interval="15secs"
--containerizers="mesos" --credential="/tmp/Endpoint_SlaveEndpointTest_NoAuthorizer_1_8XWex1/credential"
--default_role="*" --disallow_sharing_agent_pid_namespace="false" --disk_watch_interval="1mins"
--docker="docker" --docker_kill_orphans="true" --docker_registry="https://registry-1.docker.io"
--docker_remove_delay="6hrs" --docker_socket="/var/run/docker.sock" --docker_stop_timeout="0ns"
--docker_store_dir="/tmp/Endpoint_SlaveEndpointTest_NoAuthorizer_1_8XWex1/store/docker" --docker_volume_checkpoint_dir="/var/run/mesos/isolators/docker/volume"
--enforce_container_disk_quota="false" --executor_registration_timeout="1mins" --executor_reregistration_timeout="2secs"
--executor_shutdown_grace_period="5secs" --fetcher_cache_dir="/tmp/Endpoint_SlaveEndpointTest_NoAuthorizer_1_8XWex1/fetch"
--fetcher_cache_size="2GB" --frameworks_home="" --gc_delay="1weeks" --gc_disk_headroom="0.1"
--hadoop_home="" --help="false" --hostname_lookup="true" --http_command_executor="false" --http_credentials="/tmp/Endpoint_SlaveEndpointTest_NoAuthorizer_1_8XWex1/http_credentials"
--http_heartbeat_interval="30secs" --initialize_driver_logging="true" --isolation="posix/cpu,posix/mem"
--launcher="posix" --launcher_dir="/mesos/mesos-1.5.0/_build/src" --logbufsecs="0" --logging_level="INFO"
--max_completed_executors_per_framework="150" --oversubscribed_resources_interval="15secs"
--perf_duration="10secs" --perf_interval="1mins" --port="5051" --qos_correction_interval_min="0ns"
--quiet="false" --recover="reconnect" --recovery_timeout="15mins" --registration_backoff_factor="10ms"
--resources="cpus:2;gpus:0;mem:1024;disk:1024;ports:[31000-32000]" --revocable_cpu_low_priority="true"
--runtime_dir="/tmp/Endpoint_SlaveEndpointTest_NoAuthorizer_1_8XWex1" --sandbox_directory="/mnt/mesos/sandbox"
--strict="true" --switch_user="true" --systemd_enable_support="true" --systemd_runtime_directory="/run/systemd/system"
--version="false" --work_dir="/tmp/Endpoint_SlaveEndpointTest_NoAuthorizer_1_mam9mk" --zk_session_timeout="10secs"
I1003 15:19:59.042194  5795 credentials.hpp:86] Loading credential for authentication from
'/tmp/Endpoint_SlaveEndpointTest_NoAuthorizer_1_8XWex1/credential'
I1003 15:19:59.042438  5795 slave.cpp:287] Agent using credential for: test-principal
I1003 15:19:59.042465  5795 credentials.hpp:37] Loading credentials for authentication from
'/tmp/Endpoint_SlaveEndpointTest_NoAuthorizer_1_8XWex1/http_credentials'
I1003 15:19:59.042803  5795 http.cpp:1045] Creating default 'basic' HTTP authenticator for
realm 'mesos-agent-readonly'
I1003 15:19:59.043100  5795 http.cpp:1045] Creating default 'basic' HTTP authenticator for
realm 'mesos-agent-readwrite'
I1003 15:19:59.045461  5795 slave.cpp:585] Agent resources: [{"name":"cpus","scalar":{"value":2.0},"type":"SCALAR"},{"name":"mem","scalar":{"value":1024.0},"type":"SCALAR"},{"name":"disk","scalar":{"value":1024.0},"type":"SCALAR"},{"name":"ports","ranges":{"range":[{"begin":31000,"end":32000}]},"type":"RANGES"}]
I1003 15:19:59.045855  5795 slave.cpp:593] Agent attributes: [  ]
I1003 15:19:59.045877  5795 slave.cpp:602] Agent hostname: 2f40fd0f9919
I1003 15:19:59.046121  5792 status_update_manager.cpp:177] Pausing sending status updates
I1003 15:19:59.048321  5808 state.cpp:64] Recovering state from '/tmp/Endpoint_SlaveEndpointTest_NoAuthorizer_1_mam9mk/meta'
I1003 15:19:59.048646  5807 status_update_manager.cpp:203] Recovering status update manager
I1003 15:19:59.048863  5807 containerizer.cpp:648] Recovering containerizer
I1003 15:19:59.050959  5812 provisioner.cpp:416] Provisioner recovery complete
I1003 15:19:59.051481  5805 slave.cpp:6310] Finished recovery
I1003 15:19:59.052024  5805 slave.cpp:6492] Querying resource estimator for oversubscribable
resources
I1003 15:19:59.052351  5794 slave.cpp:6506] Received oversubscribable resources {} from the
resource estimator
I1003 15:19:59.055025  5791 process.cpp:3929] Handling HTTP event for process 'slave(825)'
with path: '/slave(825)/monitor/statistics.json'
I1003 15:19:59.056481  5813 http.cpp:1185] HTTP GET for /slave(825)/monitor/statistics.json
from 172.17.0.2:45780
I1003 15:19:59.056574  5813 http.cpp:976] Authorizing principal 'test-principal' to GET the
'/monitor/statistics.json' endpoint
I1003 15:19:59.060622  5772 slave.cpp:869] Agent terminating
[       OK ] Endpoint/SlaveEndpointTest.NoAuthorizer/1 (39 ms)
[ RUN      ] Endpoint/SlaveEndpointTest.NoAuthorizer/2
I1003 15:19:59.075683  5772 containerizer.cpp:292] Using isolation { environment_secret, posix/cpu,
posix/mem, filesystem/posix, network/cni }
W1003 15:19:59.076207  5772 backend.cpp:76] Failed to create 'aufs' backend: AufsBackend requires
root privileges
W1003 15:19:59.076316  5772 backend.cpp:76] Failed to create 'bind' backend: BindBackend requires
root privileges
I1003 15:19:59.076349  5772 provisioner.cpp:255] Using default backend 'copy'
I1003 15:19:59.078130  5772 cluster.cpp:448] Creating default 'local' authorizer
I1003 15:19:59.080212  5797 slave.cpp:254] Mesos agent started on (826)@172.17.0.2:37295
I1003 15:19:59.080251  5797 slave.cpp:255] Flags at startup: --acls="" --appc_simple_discovery_uri_prefix="http://"
--appc_store_dir="/tmp/Endpoint_SlaveEndpointTest_NoAuthorizer_2_PAPzvO/store/appc" --authenticate_http_readonly="true"
--authenticate_http_readwrite="true" --authenticatee="crammd5" --authentication_backoff_factor="1secs"
--authorizer="local" --cgroups_cpu_enable_pids_and_tids_count="false" --cgroups_enable_cfs="false"
--cgroups_hierarchy="/sys/fs/cgroup" --cgroups_limit_swap="false" --cgroups_root="mesos" --container_disk_watch_interval="15secs"
--containerizers="mesos" --credential="/tmp/Endpoint_SlaveEndpointTest_NoAuthorizer_2_PAPzvO/credential"
--default_role="*" --disallow_sharing_agent_pid_namespace="false" --disk_watch_interval="1mins"
--docker="docker" --docker_kill_orphans="true" --docker_registry="https://registry-1.docker.io"
--docker_remove_delay="6hrs" --docker_socket="/var/run/docker.sock" --docker_stop_timeout="0ns"
--docker_store_dir="/tmp/Endpoint_SlaveEndpointTest_NoAuthorizer_2_PAPzvO/store/docker" --docker_volume_checkpoint_dir="/var/run/mesos/isolators/docker/volume"
--enforce_container_disk_quota="false" --executor_registration_timeout="1mins" --executor_reregistration_timeout="2secs"
--executor_shutdown_grace_period="5secs" --fetcher_cache_dir="/tmp/Endpoint_SlaveEndpointTest_NoAuthorizer_2_PAPzvO/fetch"
--fetcher_cache_size="2GB" --frameworks_home="" --gc_delay="1weeks" --gc_disk_headroom="0.1"
--hadoop_home="" --help="false" --hostname_lookup="true" --http_command_executor="false" --http_credentials="/tmp/Endpoint_SlaveEndpointTest_NoAuthorizer_2_PAPzvO/http_credentials"
--http_heartbeat_interval="30secs" --initialize_driver_logging="true" --isolation="posix/cpu,posix/mem"
--launcher="posix" --launcher_dir="/mesos/mesos-1.5.0/_build/src" --logbufsecs="0" --logging_level="INFO"
--max_completed_executors_per_framework="150" --oversubscribed_resources_interval="15secs"
--perf_duration="10secs" --perf_interval="1mins" --port="5051" --qos_correction_interval_min="0ns"
--quiet="false" --recover="reconnect" --recovery_timeout="15mins" --registration_backoff_factor="10ms"
--resources="cpus:2;gpus:0;mem:1024;disk:1024;ports:[31000-32000]" --revocable_cpu_low_priority="true"
--runtime_dir="/tmp/Endpoint_SlaveEndpointTest_NoAuthorizer_2_PAPzvO" --sandbox_directory="/mnt/mesos/sandbox"
--strict="true" --switch_user="true" --systemd_enable_support="true" --systemd_runtime_directory="/run/systemd/system"
--version="false" --work_dir="/tmp/Endpoint_SlaveEndpointTest_NoAuthorizer_2_DTPDf7" --zk_session_timeout="10secs"
I1003 15:19:59.080734  5797 credentials.hpp:86] Loading credential for authentication from
'/tmp/Endpoint_SlaveEndpointTest_NoAuthorizer_2_PAPzvO/credential'
I1003 15:19:59.080914  5797 slave.cpp:287] Agent using credential for: test-principal
I1003 15:19:59.080950  5797 credentials.hpp:37] Loading credentials for authentication from
'/tmp/Endpoint_SlaveEndpointTest_NoAuthorizer_2_PAPzvO/http_credentials'
I1003 15:19:59.081311  5797 http.cpp:1045] Creating default 'basic' HTTP authenticator for
realm 'mesos-agent-readonly'
I1003 15:19:59.081538  5797 http.cpp:1045] Creating default 'basic' HTTP authenticator for
realm 'mesos-agent-readwrite'
I1003 15:19:59.083794  5797 slave.cpp:585] Agent resources: [{"name":"cpus","scalar":{"value":2.0},"type":"SCALAR"},{"name":"mem","scalar":{"value":1024.0},"type":"SCALAR"},{"name":"disk","scalar":{"value":1024.0},"type":"SCALAR"},{"name":"ports","ranges":{"range":[{"begin":31000,"end":32000}]},"type":"RANGES"}]
I1003 15:19:59.084214  5797 slave.cpp:593] Agent attributes: [  ]
I1003 15:19:59.084241  5797 slave.cpp:602] Agent hostname: 2f40fd0f9919
I1003 15:19:59.084465  5810 status_update_manager.cpp:177] Pausing sending status updates
I1003 15:19:59.086150  5795 state.cpp:64] Recovering state from '/tmp/Endpoint_SlaveEndpointTest_NoAuthorizer_2_DTPDf7/meta'
I1003 15:19:59.086637  5792 status_update_manager.cpp:203] Recovering status update manager
I1003 15:19:59.086836  5792 containerizer.cpp:648] Recovering containerizer
I1003 15:19:59.088640  5807 provisioner.cpp:416] Provisioner recovery complete
I1003 15:19:59.089097  5814 slave.cpp:6310] Finished recovery
I1003 15:19:59.089593  5814 slave.cpp:6492] Querying resource estimator for oversubscribable
resources
I1003 15:19:59.089836  5812 slave.cpp:6506] Received oversubscribable resources {} from the
resource estimator
I1003 15:19:59.092756  5794 process.cpp:3929] Handling HTTP event for process 'slave(826)'
with path: '/slave(826)/containers'
I1003 15:19:59.094256  5804 http.cpp:1185] HTTP GET for /slave(826)/containers from 172.17.0.2:45782
I1003 15:19:59.094413  5804 http.cpp:976] Authorizing principal 'test-principal' to GET the
'/containers' endpoint
I1003 15:19:59.098912  5772 slave.cpp:869] Agent terminating
[       OK ] Endpoint/SlaveEndpointTest.NoAuthorizer/2 (36 ms)
[----------] 9 tests from Endpoint/SlaveEndpointTest (363 ms total)

[----------] 2 tests from ContainerizerType/DefaultContainerDNSFlagTest
[ RUN      ] ContainerizerType/DefaultContainerDNSFlagTest.ValidateFlag/0
[       OK ] ContainerizerType/DefaultContainerDNSFlagTest.ValidateFlag/0 (10 ms)
[ RUN      ] ContainerizerType/DefaultContainerDNSFlagTest.ValidateFlag/1
[       OK ] ContainerizerType/DefaultContainerDNSFlagTest.ValidateFlag/1 (9 ms)
[----------] 2 tests from ContainerizerType/DefaultContainerDNSFlagTest (19 ms total)

[----------] Global test environment tear-down
[==========] 1685 tests from 184 test cases ran. (649556 ms total)
[  PASSED  ] 1684 tests.
[  FAILED  ] 1 test, listed below:
[  FAILED  ] ExamplesTest.NoExecutorFramework

 1 FAILED TEST
  YOU HAVE 21 DISABLED TESTS

I1003 15:19:59.184631  5815 process.cpp:1068] Failed to accept socket: future discarded
make[4]: *** [check-local] Error 1
make[4]: Leaving directory `/mesos/mesos-1.5.0/_build/src'
make[3]: *** [check-am] Error 2
make[3]: Leaving directory `/mesos/mesos-1.5.0/_build/src'
make[2]: *** [check] Error 2
make[2]: Leaving directory `/mesos/mesos-1.5.0/_build/src'
make[1]: *** [check-recursive] Error 1
make[1]: Leaving directory `/mesos/mesos-1.5.0/_build'
make: *** [distcheck] Error 1
+ docker rmi mesos-1507040490-9409
Untagged: mesos-1507040490-9409:latest
Deleted: sha256:61696565d9f01ba18f153bf0030690501304a44ee30ad4658b9a7160dd4b0d3e
Deleted: sha256:76eedeed95b866cd63c83b527fce9dea77c64d4e2a34ecaddc882f0eaf32c678
Deleted: sha256:8623430ff660a3c2cb65eeb4737def8bb27704b3726428b9d1babbc67646ba6a
Deleted: sha256:e53301c323cc26907472e59b8dcd945df6e0645fd41047fd7001f4d7b9b4ee93
Deleted: sha256:7b9776c43c3d273f6a90e3d3c6efb8dde166d057effa8f0b0c05492181f34faf
Deleted: sha256:677cf5fe37ca1734a657ebc76f1d6fc3c69a71141a4c8d2ac005e86bc619eeef
Deleted: sha256:5183b29e50954854922c8fdf4e475f7b3bc7333aae624897a0f264e81605cfcc
Deleted: sha256:301e4aa630ea10eca9c37c0e69aa4d917fe99747689a3a1b5744ebb8c45a2b52
Deleted: sha256:e4e10f5914d4da0ba509ce2f6140f57bef6acbe22efb3243ca49285398b4d478
Deleted: sha256:205bd670c561ffc9937165ad07a5f7ba52dd7db95cd02cc4250f8af1fdf53f29
Deleted: sha256:95a8546e0c2fb72eb91ada52aabb6b86533011b0a40b5cfc48bbcafbc3edd6ec
Deleted: sha256:c80a2baa619c40b6b98f3006f2ec72e888d84a49e36ae228d29b410f28b7dadd
Deleted: sha256:a9dede5e745c5a7885849d8322f86a41a2334e11b59c8e8d84135f79f7cf1cdf
Deleted: sha256:4f426e92ddf9b3507547e3cabee36206010d1e1d21715d0f09f386ced780b24b
Deleted: sha256:a45ca0ebafd31026a2c75ea72fbf918eae522ed6d44388b007e8a96717b6388a
Deleted: sha256:f08d59bb3042cf308af34fae56750e945c498d09f49c4b9742f7c7de47d58998
Deleted: sha256:074ca0cb877840f969fb1f45070d7ab1a40f31c648fab5a8655cacdb156247bf
Deleted: sha256:50442af131f212d3aef6a2ffbb00f23311e096e5b79d3521984084d82375e8ba
Deleted: sha256:789aba3f32cf60d6ba84ac0b9862629ebea7dc6964eff06e55952a7c84561699
Deleted: sha256:683136c44f03abc5ce216c779f74257190ba4b91039e4f7aa2736d4a49307684
Deleted: sha256:f8557fd3a96822db415923a0a24fc8a457448b237c31527e58db72e7d67a937d
Deleted: sha256:01b56a14de844b2fc8520038054477d0c4c3fed8285785ab8d239e99f7fa4ddc
Deleted: sha256:c1d94ff4d2eac592996c30621e79e80dcd2709dc13e4031d16f41d9b0e984101
Deleted: sha256:558f24635396dbb486bc5556980dbcbe2bc9dfc15c6e11937d07509838e491b8
Deleted: sha256:7141342037187fdef65a2fef7914e8e65675f66137fdeca851575f421cd7669e
Deleted: sha256:250b86feaf04f0b4694ac6acb73f31ddaadc7d11b4c3695a99660528f9f84d21
Deleted: sha256:2d2291e2fe2272bb8df0cff37d1ba2a9ce96d723d503fb83c5d84f26def688bd
Deleted: sha256:e1ffd067b1712a8d7b5f50936ec2aa6db4b569053edc91066d2e8e98cb387204
Build step 'Execute shell' marked build as failure

Mime
View raw message