mesos-builds mailing list archives

Site index · List index
Message view « Date » · « Thread »
Top « Date » · « Thread »
From Apache Jenkins Server <jenk...@builds.apache.org>
Subject Build failed in Jenkins: Mesos-Buildbot » autotools,gcc,--verbose --disable-libtool-wrappers --enable-libevent --enable-ssl,GLOG_v=1 MESOS_VERBOSE=1,ubuntu:14.04,(ubuntu)&&(!ubuntu-us1)&&(!ubuntu-eu2)&&(!qnode3)&&(!H23) #4311
Date Thu, 12 Oct 2017 06:18:34 GMT
See <https://builds.apache.org/job/Mesos-Buildbot/BUILDTOOL=autotools,COMPILER=gcc,CONFIGURATION=--verbose%20--disable-libtool-wrappers%20--enable-libevent%20--enable-ssl,ENVIRONMENT=GLOG_v=1%20MESOS_VERBOSE=1,OS=ubuntu%3A14.04,label_exp=(ubuntu)&&(!ubuntu-us1)&&(!ubuntu-eu2)&&(!qnode3)&&(!H23)/4311/display/redirect?page=changes>

Changes:

[bmahler] Used variadic templates for protobuf handlers.

[bmahler] Enabled protobuf arenas code generation.

[alexr] Fixed flaky ROOT_DynamicAddDelofCniConfig test.

------------------------------------------
[...truncated 2.73 MB...]
[ RUN      ] AfterTest.Loop
[       OK ] AfterTest.Loop (2 ms)
[----------] 2 tests from AfterTest (4 ms total)

[----------] 3 tests from CollectTest
[ RUN      ] CollectTest.Ready
[       OK ] CollectTest.Ready (0 ms)
[ RUN      ] CollectTest.Failure
[       OK ] CollectTest.Failure (1 ms)
[ RUN      ] CollectTest.DiscardPropagation
[       OK ] CollectTest.DiscardPropagation (0 ms)
[----------] 3 tests from CollectTest (1 ms total)

[----------] 4 tests from AwaitTest
[ RUN      ] AwaitTest.Success
[       OK ] AwaitTest.Success (0 ms)
[ RUN      ] AwaitTest.Failure
[       OK ] AwaitTest.Failure (1 ms)
[ RUN      ] AwaitTest.Discarded
[       OK ] AwaitTest.Discarded (0 ms)
[ RUN      ] AwaitTest.DiscardPropagation
[       OK ] AwaitTest.DiscardPropagation (0 ms)
[----------] 4 tests from AwaitTest (1 ms total)

[----------] 2 tests from CountDownLatchTest
[ RUN      ] CountDownLatchTest.Triggered
[       OK ] CountDownLatchTest.Triggered (0 ms)
[ RUN      ] CountDownLatchTest.Threads
[       OK ] CountDownLatchTest.Threads (0 ms)
[----------] 2 tests from CountDownLatchTest (0 ms total)

[----------] 4 tests from RequestDecoderTest/0, where TypeParam = process::DataDecoder
[ RUN      ] RequestDecoderTest/0.Request
[       OK ] RequestDecoderTest/0.Request (1 ms)
[ RUN      ] RequestDecoderTest/0.HeaderContinuation
[       OK ] RequestDecoderTest/0.HeaderContinuation (0 ms)
[ RUN      ] RequestDecoderTest/0.HeaderCaseInsensitive
[       OK ] RequestDecoderTest/0.HeaderCaseInsensitive (0 ms)
[ RUN      ] RequestDecoderTest/0.InvalidQueryArgs
[       OK ] RequestDecoderTest/0.InvalidQueryArgs (0 ms)
[----------] 4 tests from RequestDecoderTest/0 (1 ms total)

[----------] 4 tests from RequestDecoderTest/1, where TypeParam = process::StreamingRequestDecoder
[ RUN      ] RequestDecoderTest/1.Request
[       OK ] RequestDecoderTest/1.Request (0 ms)
[ RUN      ] RequestDecoderTest/1.HeaderContinuation
[       OK ] RequestDecoderTest/1.HeaderContinuation (0 ms)
[ RUN      ] RequestDecoderTest/1.HeaderCaseInsensitive
[       OK ] RequestDecoderTest/1.HeaderCaseInsensitive (0 ms)
[ RUN      ] RequestDecoderTest/1.InvalidQueryArgs
[       OK ] RequestDecoderTest/1.InvalidQueryArgs (0 ms)
[----------] 4 tests from RequestDecoderTest/1 (0 ms total)

[----------] 5 tests from DecoderTest
[ RUN      ] DecoderTest.Response
[       OK ] DecoderTest.Response (0 ms)
[ RUN      ] DecoderTest.ResponseWithUnspecifiedLength
[       OK ] DecoderTest.ResponseWithUnspecifiedLength (0 ms)
[ RUN      ] DecoderTest.StreamingResponse
[       OK ] DecoderTest.StreamingResponse (0 ms)
[ RUN      ] DecoderTest.StreamingResponseFailure
[       OK ] DecoderTest.StreamingResponseFailure (0 ms)
[ RUN      ] DecoderTest.StreamingResponseInvalidHeader
[       OK ] DecoderTest.StreamingResponseInvalidHeader (0 ms)
[----------] 5 tests from DecoderTest (0 ms total)

[----------] 2 tests from EncoderTest
[ RUN      ] EncoderTest.Response
[       OK ] EncoderTest.Response (0 ms)
[ RUN      ] EncoderTest.AcceptableEncodings
[       OK ] EncoderTest.AcceptableEncodings (0 ms)
[----------] 2 tests from EncoderTest (0 ms total)

[----------] 17 tests from FutureTest
[ RUN      ] FutureTest.Future
[       OK ] FutureTest.Future (0 ms)
[ RUN      ] FutureTest.Associate
[       OK ] FutureTest.Associate (0 ms)
[ RUN      ] FutureTest.OnAny
[       OK ] FutureTest.OnAny (0 ms)
[ RUN      ] FutureTest.Then
[       OK ] FutureTest.Then (0 ms)
[ RUN      ] FutureTest.Repair
[       OK ] FutureTest.Repair (0 ms)
[ RUN      ] FutureTest.After1
[       OK ] FutureTest.After1 (1 ms)
[ RUN      ] FutureTest.After2
[       OK ] FutureTest.After2 (0 ms)
[ RUN      ] FutureTest.After3
[       OK ] FutureTest.After3 (0 ms)
[ RUN      ] FutureTest.Chain
[       OK ] FutureTest.Chain (0 ms)
[ RUN      ] FutureTest.Discard1
[       OK ] FutureTest.Discard1 (0 ms)
[ RUN      ] FutureTest.Discard2
[       OK ] FutureTest.Discard2 (1 ms)
[ RUN      ] FutureTest.Discard3
[       OK ] FutureTest.Discard3 (0 ms)
[ RUN      ] FutureTest.THREADSAFE_Select
[       OK ] FutureTest.THREADSAFE_Select (0 ms)
[ RUN      ] FutureTest.FromTry
[       OK ] FutureTest.FromTry (0 ms)
[ RUN      ] FutureTest.ArrowOperator
[       OK ] FutureTest.ArrowOperator (0 ms)
[ RUN      ] FutureTest.UndiscardableFuture
[       OK ] FutureTest.UndiscardableFuture (0 ms)
[ RUN      ] FutureTest.UndiscardableLambda
[       OK ] FutureTest.UndiscardableLambda (0 ms)
[----------] 17 tests from FutureTest (2 ms total)

[----------] 1 test from HTTPTest
[ RUN      ] HTTPTest.PipeReadAll
[       OK ] HTTPTest.PipeReadAll (0 ms)
[----------] 1 test from HTTPTest (0 ms total)

[----------] 8 tests from HTTPConnectionTest
[ RUN      ] HTTPConnectionTest.GzipRequestBody
I1012 06:16:52.906039  2831 process.cpp:3929] Handling HTTP event for process '(1)' with path:
'/(1)/body'
[       OK ] HTTPConnectionTest.GzipRequestBody (3 ms)
[ RUN      ] HTTPConnectionTest.Serial
I1012 06:16:52.908143  2841 process.cpp:3929] Handling HTTP event for process '(2)' with path:
'/(2)/get'
I1012 06:16:52.909741  2834 process.cpp:3929] Handling HTTP event for process '(2)' with path:
'/(2)/get'
[       OK ] HTTPConnectionTest.Serial (44 ms)
[ RUN      ] HTTPConnectionTest.Pipeline
I1012 06:16:52.952605  2821 process.cpp:3929] Handling HTTP event for process '(3)' with path:
'/(3)/get'
I1012 06:16:52.953457  2826 process.cpp:3929] Handling HTTP event for process '(4)' with path:
'/(4)/get'
I1012 06:16:52.954202  2844 process.cpp:3929] Handling HTTP event for process '(3)' with path:
'/(3)/get'
[       OK ] HTTPConnectionTest.Pipeline (5 ms)
[ RUN      ] HTTPConnectionTest.ClosingRequest
I1012 06:16:52.958153  2832 process.cpp:3929] Handling HTTP event for process '(5)' with path:
'/(5)/get'
I1012 06:16:52.958375  2832 process.cpp:3929] Handling HTTP event for process '(5)' with path:
'/(5)/get'
[       OK ] HTTPConnectionTest.ClosingRequest (4 ms)
[ RUN      ] HTTPConnectionTest.ClosingResponse
I1012 06:16:52.961571  2840 process.cpp:3929] Handling HTTP event for process '(6)' with path:
'/(6)/get'
I1012 06:16:52.961968  2840 process.cpp:3929] Handling HTTP event for process '(6)' with path:
'/(6)/get'
[       OK ] HTTPConnectionTest.ClosingResponse (3 ms)
[ RUN      ] HTTPConnectionTest.ReferenceCounting
[       OK ] HTTPConnectionTest.ReferenceCounting (1 ms)
[ RUN      ] HTTPConnectionTest.Equality
[       OK ] HTTPConnectionTest.Equality (1 ms)
[ RUN      ] HTTPConnectionTest.RequestStreaming
I1012 06:16:52.966543  2827 process.cpp:3929] Handling HTTP event for process '(9)' with path:
'/(9)/requeststreaming'
[       OK ] HTTPConnectionTest.RequestStreaming (3 ms)
[----------] 8 tests from HTTPConnectionTest (64 ms total)

[----------] 2 tests from URLTest
[ RUN      ] URLTest.Stringification
[       OK ] URLTest.Stringification (0 ms)
[ RUN      ] URLTest.ParseUrls
[       OK ] URLTest.ParseUrls (0 ms)
[----------] 2 tests from URLTest (0 ms total)

[----------] 8 tests from HttpAuthenticationTest
[ RUN      ] HttpAuthenticationTest.NoAuthenticator
I1012 06:16:52.970080  2834 process.cpp:3929] Handling HTTP event for process '(10)' with
path: '/(10)/authenticated'
[       OK ] HttpAuthenticationTest.NoAuthenticator (3 ms)
[ RUN      ] HttpAuthenticationTest.Unauthorized
I1012 06:16:52.972676  2836 process.cpp:3929] Handling HTTP event for process '(11)' with
path: '/(11)/authenticated'
[       OK ] HttpAuthenticationTest.Unauthorized (2 ms)
[ RUN      ] HttpAuthenticationTest.Forbidden
I1012 06:16:52.974853  2833 process.cpp:3929] Handling HTTP event for process '(12)' with
path: '/(12)/authenticated'
[       OK ] HttpAuthenticationTest.Forbidden (3 ms)
[ RUN      ] HttpAuthenticationTest.Authenticated
I1012 06:16:52.976955  2821 process.cpp:3929] Handling HTTP event for process '(13)' with
path: '/(13)/authenticated'
[       OK ] HttpAuthenticationTest.Authenticated (2 ms)
[ RUN      ] HttpAuthenticationTest.InvalidPrincipal
I1012 06:16:52.979188  2836 process.cpp:3929] Handling HTTP event for process '(14)' with
path: '/(14)/authenticated'
I1012 06:16:52.979471  2823 process.cpp:3986] Failed to process request for '/(14)/authenticated':
In the principal returned by an HTTP authenticator, at least one of 'value' and 'claims' must
be set
I1012 06:16:52.979498  2825 process.cpp:1606] Returning '500 Internal Server Error' for '/(14)/authenticated'
(In the principal returned by an HTTP authenticator, at least one of 'value' and 'claims'
must be set)
[       OK ] HttpAuthenticationTest.InvalidPrincipal (2 ms)
[ RUN      ] HttpAuthenticationTest.Pipelining
I1012 06:16:52.981320  2826 process.cpp:3929] Handling HTTP event for process '(15)' with
path: '/(15)/authenticated'
I1012 06:16:52.981622  2842 process.cpp:3929] Handling HTTP event for process '(15)' with
path: '/(15)/authenticated'
[       OK ] HttpAuthenticationTest.Pipelining (3 ms)
[ RUN      ] HttpAuthenticationTest.Basic
I1012 06:16:52.984012  2844 process.cpp:3929] Handling HTTP event for process '(16)' with
path: '/(16)/authenticated'
I1012 06:16:52.985684  2843 process.cpp:3929] Handling HTTP event for process '(16)' with
path: '/(16)/authenticated'
I1012 06:16:52.987329  2840 process.cpp:3929] Handling HTTP event for process '(16)' with
path: '/(16)/authenticated'
I1012 06:16:52.988970  2836 process.cpp:3929] Handling HTTP event for process '(16)' with
path: '/(16)/authenticated'
[       OK ] HttpAuthenticationTest.Basic (7 ms)
[ RUN      ] HttpAuthenticationTest.JWT
*** Aborted at 1507789012 (unix time) try "date -d @1507789012" if you are using GNU date
***
I1012 06:16:52.991205  2842 process.cpp:3929] Handling HTTP event for process '(17)' with
path: '/(17)/authenticated'
PC: @           0x8e2606 process::EventQueue::Consumer::empty()
*** SIGSEGV (@0x8) received by PID 2820 (TID 0x2b2266446700) from PID 8; stack trace: ***
    @     0x2b2261b67330 (unknown)
    @           0x8e2606 process::EventQueue::Consumer::empty()
I1012 06:16:52.992856  2827 process.cpp:3929] Handling HTTP event for process '(17)' with
path: '/(17)/authenticated'
I1012 06:16:52.994655  2843 process.cpp:3929] Handling HTTP event for process '(17)' with
path: '/(17)/authenticated'
I1012 06:16:52.996536  2834 process.cpp:3929] Handling HTTP event for process '(17)' with
path: '/(17)/authenticated'
    @           0x8ce10e process::ProcessManager::resume()
[       OK ] HttpAuthenticationTest.JWT (7 ms)
[----------] 8 tests from HttpAuthenticationTest (30 ms total)

[----------] 3 tests from HttpServeTest
[ RUN      ] HttpServeTest.Pipelining
    @           0x8ca848 _ZZN7process14ProcessManager12init_threadsEvENKUlvE_clEv
    @           0x8dc8ca _ZNSt12_Bind_simpleIFZN7process14ProcessManager12init_threadsEvEUlvE_vEE9_M_invokeIIEEEvSt12_Index_tupleIIXspT_EEE
    @           0x8dc821 _ZNSt12_Bind_simpleIFZN7process14ProcessManager12init_threadsEvEUlvE_vEEclEv
    @           0x8dc7ba _ZNSt6thread5_ImplISt12_Bind_simpleIFZN7process14ProcessManager12init_threadsEvEUlvE_vEEE6_M_runEv
    @     0x2b2262ecfa60 (unknown)
    @     0x2b2261b5f184 start_thread
    @     0x2b226373bffd (unknown)
make[7]: *** [check-local] Segmentation fault (core dumped)
make[7]: Leaving directory `/mesos/mesos-1.5.0/_build/3rdparty/libprocess'
make[6]: *** [check-am] Error 2
make[6]: Leaving directory `/mesos/mesos-1.5.0/_build/3rdparty/libprocess'
make[5]: *** [check-recursive] Error 1
make[5]: Leaving directory `/mesos/mesos-1.5.0/_build/3rdparty/libprocess'
make[4]: *** [check] Error 2
make[4]: Leaving directory `/mesos/mesos-1.5.0/_build/3rdparty/libprocess'
make[3]: *** [check-recursive] Error 1
make[3]: Leaving directory `/mesos/mesos-1.5.0/_build/3rdparty'
make[2]: *** [check] Error 2
make[2]: Leaving directory `/mesos/mesos-1.5.0/_build/3rdparty'
make[1]: *** [check-recursive] Error 1
make[1]: Leaving directory `/mesos/mesos-1.5.0/_build'
make: *** [distcheck] Error 1
+ docker rmi mesos-1507786851-11822
Untagged: mesos-1507786851-11822:latest
Deleted: sha256:e35c8ef90798f2f14695c21331c4ad3cf14ad1ef736c817dbcd085dfeac92d36
Deleted: sha256:24bff0472d126ad1b5b062a6101b4b521e99a0563a7b03415c36be93c859002b
Deleted: sha256:7690ece048671f3496aea4a5526db2345d0c0a18431ed5d80ad244d443aee580
Deleted: sha256:d62ebf82ad9bd58609205a38a1620a44212ee8151013c61ee2e0c5587f52a273
Deleted: sha256:ecb24cb7824da2d511cc1abf49335e729993f5aa98857973824be6be01163051
Deleted: sha256:4a4903e1541147a2306ff5c3a4589a3f71271e70c217a8d02e918399d2692fb1
Deleted: sha256:3c57dd66c9562c37dd87b5d3f3bb5c2bd28bcf7796971b594960f351aad8c4af
Deleted: sha256:f1d56738d5405a5f2d4bb5724d8ee42369b9e4b7a3a249039ca2ab496981642f
Deleted: sha256:4853747893634f099b144a77ece245968f2c9c67f82ca1b90fa14579a89d44c5
Deleted: sha256:0c6d5621e2e8fb473ba6cd17e10586038143557ffa1ba90743511ade358b73a5
Deleted: sha256:57e4083ac900081e6b32160b69091fa9fd8e51c15c0e18be6251599f047a6c77
Deleted: sha256:cc239f1617357b918e06667c4c8cf6deb506bb38431d2feb130d6244d7037aea
Deleted: sha256:3f3d156cab2876c93462cc3fe1a9a60fa3bb7634ca1f48deecd9c148b164464e
Deleted: sha256:c7b1381228c852700c1f2e14761937ee6e8c3403cef2a81bd36948a70532086d
Deleted: sha256:d9e88bfd0f33c5feedb596df2fcab2d2222439d944bf9c86e133f9a111b0e169
Deleted: sha256:5ec37810bf30a7d438bafdf963b552bc69d6c1e070208a473b756081430542af
Deleted: sha256:ea8a6b7f4735c9aa8b5b296b3776bc75bc4732932c33941fb1d4f3e0a3762a0e
Deleted: sha256:eac5ad64759ccad0817a6bbee927d4365dc83be7672810056c1bf56bbee844e4
Deleted: sha256:c57eabc137a35c71af759b9e486f096a9a2b6b5b7e421933fdb6376a371b0c09
Deleted: sha256:8c6eab880f2090c47bf5a959fd307588d9b10178c8cfb47bbe41f30eee74fec2
Deleted: sha256:873cab2987a73bcaf1afbaa3d6e1a75a1824ca6e3ddf2f39e5374baab71e1e1b
Deleted: sha256:f25d14a8862d23fa29a93a8810101e1f3a77f3c0190c5a3cd1056ea33bcc26ee
Deleted: sha256:db7f46d74326bb2e59c167f66e2cf3a6a41cb46020a34cabad828a64b84be5bb
Deleted: sha256:b5206b4c319330fc6c08492e44c1378246c425a6f2ce773f001b1d04d61b9acb
Deleted: sha256:25cd2f3941de39ee7c468993fed01355a41ee9eff772952d5c65ba6b2c825802
Deleted: sha256:ab90694acdc086a90ba85709a042d45c7f65d4d8f05c226c709805cee04ea858
Deleted: sha256:5ff63d3cf3c00e4739ee8188e27446d357ca899ea4b4b57f539f5e20a81e2ed5
Deleted: sha256:a61d87d06e3183e693b1642f0bdcd7d9ed17d7649cecd9b0333164fb70897141
Build step 'Execute shell' marked build as failure

Mime
View raw message