mesos-builds mailing list archives

Site index · List index
Message view « Date » · « Thread »
Top « Date » · « Thread »
From Apache Jenkins Server <jenk...@builds.apache.org>
Subject Build failed in Jenkins: Mesos-Reviewbot #19660
Date Tue, 03 Oct 2017 17:06:00 GMT
See <https://builds.apache.org/job/Mesos-Reviewbot/19660/display/redirect>

------------------------------------------
[...truncated 31.90 MB...]
I1003 17:05:52.303705  5807 credentials.hpp:37] Loading credentials for authentication from
'/tmp/Endpoint_SlaveEndpointTest_AuthorizedRequest_2_14xbsX/http_credentials'
I1003 17:05:52.304110  5807 http.cpp:1045] Creating default 'basic' HTTP authenticator for
realm 'mesos-agent-readonly'
I1003 17:05:52.304291  5807 http.cpp:1045] Creating default 'basic' HTTP authenticator for
realm 'mesos-agent-readwrite'
I1003 17:05:52.305727  5807 slave.cpp:585] Agent resources: [{"name":"cpus","scalar":{"value":2.0},"type":"SCALAR"},{"name":"mem","scalar":{"value":1024.0},"type":"SCALAR"},{"name":"disk","scalar":{"value":1024.0},"type":"SCALAR"},{"name":"ports","ranges":{"range":[{"begin":31000,"end":32000}]},"type":"RANGES"}]
I1003 17:05:52.305999  5807 slave.cpp:593] Agent attributes: [  ]
I1003 17:05:52.306020  5807 slave.cpp:602] Agent hostname: 1edecd6610b4
I1003 17:05:52.306190  5795 status_update_manager.cpp:177] Pausing sending status updates
I1003 17:05:52.307837  5803 state.cpp:64] Recovering state from '/tmp/Endpoint_SlaveEndpointTest_AuthorizedRequest_2_AVxGyb/meta'
I1003 17:05:52.308358  5793 status_update_manager.cpp:203] Recovering status update manager
I1003 17:05:52.308631  5801 containerizer.cpp:648] Recovering containerizer
I1003 17:05:52.310772  5810 provisioner.cpp:416] Provisioner recovery complete
I1003 17:05:52.311235  5795 slave.cpp:6310] Finished recovery
I1003 17:05:52.311694  5795 slave.cpp:6492] Querying resource estimator for oversubscribable
resources
I1003 17:05:52.311983  5796 slave.cpp:6506] Received oversubscribable resources {} from the
resource estimator
I1003 17:05:52.314580  5811 process.cpp:3929] Handling HTTP event for process 'slave(820)'
with path: '/slave(820)/containers'
I1003 17:05:52.316555  5806 http.cpp:1185] HTTP GET for /slave(820)/containers from 172.17.0.2:44988
I1003 17:05:52.316675  5806 http.cpp:976] Authorizing principal 'test-principal' to GET the
'/containers' endpoint
I1003 17:05:52.321110  5771 slave.cpp:869] Agent terminating
[       OK ] Endpoint/SlaveEndpointTest.AuthorizedRequest/2 (36 ms)
[ RUN      ] Endpoint/SlaveEndpointTest.UnauthorizedRequest/0
I1003 17:05:52.337337  5771 containerizer.cpp:292] Using isolation { environment_secret, posix/cpu,
posix/mem, filesystem/posix, network/cni }
W1003 17:05:52.338244  5771 backend.cpp:76] Failed to create 'aufs' backend: AufsBackend requires
root privileges
W1003 17:05:52.338479  5771 backend.cpp:76] Failed to create 'bind' backend: BindBackend requires
root privileges
I1003 17:05:52.338520  5771 provisioner.cpp:255] Using default backend 'copy'
I1003 17:05:52.343629  5813 slave.cpp:254] Mesos agent started on (821)@172.17.0.2:44516
I1003 17:05:52.343677  5813 slave.cpp:255] Flags at startup: --acls="" --appc_simple_discovery_uri_prefix="http://"
--appc_store_dir="/tmp/Endpoint_SlaveEndpointTest_UnauthorizedRequest_0_rjbGk3/store/appc"
--authenticate_http_readonly="true" --authenticate_http_readwrite="true" --authenticatee="crammd5"
--authentication_backoff_factor="1secs" --authorizer="local" --cgroups_cpu_enable_pids_and_tids_count="false"
--cgroups_enable_cfs="false" --cgroups_hierarchy="/sys/fs/cgroup" --cgroups_limit_swap="false"
--cgroups_root="mesos" --container_disk_watch_interval="15secs" --containerizers="mesos" --credential="/tmp/Endpoint_SlaveEndpointTest_UnauthorizedRequest_0_rjbGk3/credential"
--default_role="*" --disallow_sharing_agent_pid_namespace="false" --disk_watch_interval="1mins"
--docker="docker" --docker_kill_orphans="true" --docker_registry="https://registry-1.docker.io"
--docker_remove_delay="6hrs" --docker_socket="/var/run/docker.sock" --docker_stop_timeout="0ns"
--docker_store_dir="/tmp/Endpoint_SlaveEndpointTest_UnauthorizedRequest_0_rjbGk3/store/docker"
--docker_volume_checkpoint_dir="/var/run/mesos/isolators/docker/volume" --enforce_container_disk_quota="false"
--executor_registration_timeout="1mins" --executor_reregistration_timeout="2secs" --executor_shutdown_grace_period="5secs"
--fetcher_cache_dir="/tmp/Endpoint_SlaveEndpointTest_UnauthorizedRequest_0_rjbGk3/fetch" --fetcher_cache_size="2GB"
--frameworks_home="" --gc_delay="1weeks" --gc_disk_headroom="0.1" --hadoop_home="" --help="false"
--hostname_lookup="true" --http_command_executor="false" --http_credentials="/tmp/Endpoint_SlaveEndpointTest_UnauthorizedRequest_0_rjbGk3/http_credentials"
--http_heartbeat_interval="30secs" --initialize_driver_logging="true" --isolation="posix/cpu,posix/mem"
--launcher="posix" --launcher_dir="/mesos/mesos-1.5.0/_build/src" --logbufsecs="0" --logging_level="INFO"
--max_completed_executors_per_framework="150" --oversubscribed_resources_interval="15secs"
--perf_duration="10secs" --perf_interval="1mins" --port="5051" --qos_correction_interval_min="0ns"
--quiet="false" --recover="reconnect" --recovery_timeout="15mins" --registration_backoff_factor="10ms"
--resources="cpus:2;gpus:0;mem:1024;disk:1024;ports:[31000-32000]" --revocable_cpu_low_priority="true"
--runtime_dir="/tmp/Endpoint_SlaveEndpointTest_UnauthorizedRequest_0_rjbGk3" --sandbox_directory="/mnt/mesos/sandbox"
--strict="true" --switch_user="true" --systemd_enable_support="true" --systemd_runtime_directory="/run/systemd/system"
--version="false" --work_dir="/tmp/Endpoint_SlaveEndpointTest_UnauthorizedRequest_0_Us0Flh"
--zk_session_timeout="10secs"
I1003 17:05:52.344239  5813 credentials.hpp:86] Loading credential for authentication from
'/tmp/Endpoint_SlaveEndpointTest_UnauthorizedRequest_0_rjbGk3/credential'
I1003 17:05:52.344564  5813 slave.cpp:287] Agent using credential for: test-principal
I1003 17:05:52.344593  5813 credentials.hpp:37] Loading credentials for authentication from
'/tmp/Endpoint_SlaveEndpointTest_UnauthorizedRequest_0_rjbGk3/http_credentials'
I1003 17:05:52.344830  5813 http.cpp:1045] Creating default 'basic' HTTP authenticator for
realm 'mesos-agent-readonly'
I1003 17:05:52.345002  5813 http.cpp:1045] Creating default 'basic' HTTP authenticator for
realm 'mesos-agent-readwrite'
I1003 17:05:52.346299  5813 slave.cpp:585] Agent resources: [{"name":"cpus","scalar":{"value":2.0},"type":"SCALAR"},{"name":"mem","scalar":{"value":1024.0},"type":"SCALAR"},{"name":"disk","scalar":{"value":1024.0},"type":"SCALAR"},{"name":"ports","ranges":{"range":[{"begin":31000,"end":32000}]},"type":"RANGES"}]
I1003 17:05:52.346545  5813 slave.cpp:593] Agent attributes: [  ]
I1003 17:05:52.346560  5813 slave.cpp:602] Agent hostname: 1edecd6610b4
I1003 17:05:52.346838  5806 status_update_manager.cpp:177] Pausing sending status updates
I1003 17:05:52.348403  5801 state.cpp:64] Recovering state from '/tmp/Endpoint_SlaveEndpointTest_UnauthorizedRequest_0_Us0Flh/meta'
I1003 17:05:52.348668  5801 status_update_manager.cpp:203] Recovering status update manager
I1003 17:05:52.348948  5798 containerizer.cpp:648] Recovering containerizer
I1003 17:05:52.350914  5794 provisioner.cpp:416] Provisioner recovery complete
I1003 17:05:52.351449  5806 slave.cpp:6310] Finished recovery
I1003 17:05:52.352154  5806 slave.cpp:6492] Querying resource estimator for oversubscribable
resources
I1003 17:05:52.352416  5799 slave.cpp:6506] Received oversubscribable resources {} from the
resource estimator
I1003 17:05:52.354774  5812 process.cpp:3929] Handling HTTP event for process 'slave(821)'
with path: '/slave(821)/monitor/statistics'
I1003 17:05:52.356662  5792 http.cpp:1185] HTTP GET for /slave(821)/monitor/statistics from
172.17.0.2:44990
I1003 17:05:52.356796  5792 http.cpp:976] Authorizing principal 'test-principal' to GET the
'/monitor/statistics' endpoint
I1003 17:05:52.359724  5771 slave.cpp:869] Agent terminating
[       OK ] Endpoint/SlaveEndpointTest.UnauthorizedRequest/0 (37 ms)
[ RUN      ] Endpoint/SlaveEndpointTest.UnauthorizedRequest/1
I1003 17:05:52.371780  5771 containerizer.cpp:292] Using isolation { environment_secret, posix/cpu,
posix/mem, filesystem/posix, network/cni }
W1003 17:05:52.372321  5771 backend.cpp:76] Failed to create 'aufs' backend: AufsBackend requires
root privileges
W1003 17:05:52.372432  5771 backend.cpp:76] Failed to create 'bind' backend: BindBackend requires
root privileges
I1003 17:05:52.372465  5771 provisioner.cpp:255] Using default backend 'copy'
I1003 17:05:52.375824  5803 slave.cpp:254] Mesos agent started on (822)@172.17.0.2:44516
I1003 17:05:52.375847  5803 slave.cpp:255] Flags at startup: --acls="" --appc_simple_discovery_uri_prefix="http://"
--appc_store_dir="/tmp/Endpoint_SlaveEndpointTest_UnauthorizedRequest_1_1HGRz9/store/appc"
--authenticate_http_readonly="true" --authenticate_http_readwrite="true" --authenticatee="crammd5"
--authentication_backoff_factor="1secs" --authorizer="local" --cgroups_cpu_enable_pids_and_tids_count="false"
--cgroups_enable_cfs="false" --cgroups_hierarchy="/sys/fs/cgroup" --cgroups_limit_swap="false"
--cgroups_root="mesos" --container_disk_watch_interval="15secs" --containerizers="mesos" --credential="/tmp/Endpoint_SlaveEndpointTest_UnauthorizedRequest_1_1HGRz9/credential"
--default_role="*" --disallow_sharing_agent_pid_namespace="false" --disk_watch_interval="1mins"
--docker="docker" --docker_kill_orphans="true" --docker_registry="https://registry-1.docker.io"
--docker_remove_delay="6hrs" --docker_socket="/var/run/docker.sock" --docker_stop_timeout="0ns"
--docker_store_dir="/tmp/Endpoint_SlaveEndpointTest_UnauthorizedRequest_1_1HGRz9/store/docker"
--docker_volume_checkpoint_dir="/var/run/mesos/isolators/docker/volume" --enforce_container_disk_quota="false"
--executor_registration_timeout="1mins" --executor_reregistration_timeout="2secs" --executor_shutdown_grace_period="5secs"
--fetcher_cache_dir="/tmp/Endpoint_SlaveEndpointTest_UnauthorizedRequest_1_1HGRz9/fetch" --fetcher_cache_size="2GB"
--frameworks_home="" --gc_delay="1weeks" --gc_disk_headroom="0.1" --hadoop_home="" --help="false"
--hostname_lookup="true" --http_command_executor="false" --http_credentials="/tmp/Endpoint_SlaveEndpointTest_UnauthorizedRequest_1_1HGRz9/http_credentials"
--http_heartbeat_interval="30secs" --initialize_driver_logging="true" --isolation="posix/cpu,posix/mem"
--launcher="posix" --launcher_dir="/mesos/mesos-1.5.0/_build/src" --logbufsecs="0" --logging_level="INFO"
--max_completed_executors_per_framework="150" --oversubscribed_resources_interval="15secs"
--perf_duration="10secs" --perf_interval="1mins" --port="5051" --qos_correction_interval_min="0ns"
--quiet="false" --recover="reconnect" --recovery_timeout="15mins" --registration_backoff_factor="10ms"
--resources="cpus:2;gpus:0;mem:1024;disk:1024;ports:[31000-32000]" --revocable_cpu_low_priority="true"
--runtime_dir="/tmp/Endpoint_SlaveEndpointTest_UnauthorizedRequest_1_1HGRz9" --sandbox_directory="/mnt/mesos/sandbox"
--strict="true" --switch_user="true" --systemd_enable_support="true" --systemd_runtime_directory="/run/systemd/system"
--version="false" --work_dir="/tmp/Endpoint_SlaveEndpointTest_UnauthorizedRequest_1_oPTlvn"
--zk_session_timeout="10secs"
I1003 17:05:52.376243  5803 credentials.hpp:86] Loading credential for authentication from
'/tmp/Endpoint_SlaveEndpointTest_UnauthorizedRequest_1_1HGRz9/credential'
I1003 17:05:52.376394  5803 slave.cpp:287] Agent using credential for: test-principal
I1003 17:05:52.376416  5803 credentials.hpp:37] Loading credentials for authentication from
'/tmp/Endpoint_SlaveEndpointTest_UnauthorizedRequest_1_1HGRz9/http_credentials'
I1003 17:05:52.376672  5803 http.cpp:1045] Creating default 'basic' HTTP authenticator for
realm 'mesos-agent-readonly'
I1003 17:05:52.376834  5803 http.cpp:1045] Creating default 'basic' HTTP authenticator for
realm 'mesos-agent-readwrite'
I1003 17:05:52.378792  5803 slave.cpp:585] Agent resources: [{"name":"cpus","scalar":{"value":2.0},"type":"SCALAR"},{"name":"mem","scalar":{"value":1024.0},"type":"SCALAR"},{"name":"disk","scalar":{"value":1024.0},"type":"SCALAR"},{"name":"ports","ranges":{"range":[{"begin":31000,"end":32000}]},"type":"RANGES"}]
I1003 17:05:52.379016  5803 slave.cpp:593] Agent attributes: [  ]
I1003 17:05:52.379031  5803 slave.cpp:602] Agent hostname: 1edecd6610b4
I1003 17:05:52.379168  5812 status_update_manager.cpp:177] Pausing sending status updates
I1003 17:05:52.380471  5811 state.cpp:64] Recovering state from '/tmp/Endpoint_SlaveEndpointTest_UnauthorizedRequest_1_oPTlvn/meta'
I1003 17:05:52.380693  5794 status_update_manager.cpp:203] Recovering status update manager
I1003 17:05:52.380868  5813 containerizer.cpp:648] Recovering containerizer
I1003 17:05:52.382068  5809 provisioner.cpp:416] Provisioner recovery complete
I1003 17:05:52.382401  5812 slave.cpp:6310] Finished recovery
I1003 17:05:52.382771  5812 slave.cpp:6492] Querying resource estimator for oversubscribable
resources
I1003 17:05:52.382980  5808 slave.cpp:6506] Received oversubscribable resources {} from the
resource estimator
I1003 17:05:52.385089  5799 process.cpp:3929] Handling HTTP event for process 'slave(822)'
with path: '/slave(822)/monitor/statistics.json'
I1003 17:05:52.386343  5805 http.cpp:1185] HTTP GET for /slave(822)/monitor/statistics.json
from 172.17.0.2:44992
I1003 17:05:52.386458  5805 http.cpp:976] Authorizing principal 'test-principal' to GET the
'/monitor/statistics.json' endpoint
I1003 17:05:52.388514  5771 slave.cpp:869] Agent terminating
[       OK ] Endpoint/SlaveEndpointTest.UnauthorizedRequest/1 (27 ms)
[ RUN      ] Endpoint/SlaveEndpointTest.UnauthorizedRequest/2
I1003 17:05:52.413329  5771 containerizer.cpp:292] Using isolation { environment_secret, posix/cpu,
posix/mem, filesystem/posix, network/cni }
W1003 17:05:52.413858  5771 backend.cpp:76] Failed to create 'aufs' backend: AufsBackend requires
root privileges
W1003 17:05:52.413976  5771 backend.cpp:76] Failed to create 'bind' backend: BindBackend requires
root privileges
I1003 17:05:52.414011  5771 provisioner.cpp:255] Using default backend 'copy'
I1003 17:05:52.417701  5791 slave.cpp:254] Mesos agent started on (823)@172.17.0.2:44516
I1003 17:05:52.417734  5791 slave.cpp:255] Flags at startup: --acls="" --appc_simple_discovery_uri_prefix="http://"
--appc_store_dir="/tmp/Endpoint_SlaveEndpointTest_UnauthorizedRequest_2_n70Xbg/store/appc"
--authenticate_http_readonly="true" --authenticate_http_readwrite="true" --authenticatee="crammd5"
--authentication_backoff_factor="1secs" --authorizer="local" --cgroups_cpu_enable_pids_and_tids_count="false"
--cgroups_enable_cfs="false" --cgroups_hierarchy="/sys/fs/cgroup" --cgroups_limit_swap="false"
--cgroups_root="mesos" --container_disk_watch_interval="15secs" --containerizers="mesos" --credential="/tmp/Endpoint_SlaveEndpointTest_UnauthorizedRequest_2_n70Xbg/credential"
--default_role="*" --disallow_sharing_agent_pid_namespace="false" --disk_watch_interval="1mins"
--docker="docker" --docker_kill_orphans="true" --docker_registry="https://registry-1.docker.io"
--docker_remove_delay="6hrs" --docker_socket="/var/run/docker.sock" --docker_stop_timeout="0ns"
--docker_store_dir="/tmp/Endpoint_SlaveEndpointTest_UnauthorizedRequest_2_n70Xbg/store/docker"
--docker_volume_checkpoint_dir="/var/run/mesos/isolators/docker/volume" --enforce_container_disk_quota="false"
--executor_registration_timeout="1mins" --executor_reregistration_timeout="2secs" --executor_shutdown_grace_period="5secs"
--fetcher_cache_dir="/tmp/Endpoint_SlaveEndpointTest_UnauthorizedRequest_2_n70Xbg/fetch" --fetcher_cache_size="2GB"
--frameworks_home="" --gc_delay="1weeks" --gc_disk_headroom="0.1" --hadoop_home="" --help="false"
--hostname_lookup="true" --http_command_executor="false" --http_credentials="/tmp/Endpoint_SlaveEndpointTest_UnauthorizedRequest_2_n70Xbg/http_credentials"
--http_heartbeat_interval="30secs" --initialize_driver_logging="true" --isolation="posix/cpu,posix/mem"
--launcher="posix" --launcher_dir="/mesos/mesos-1.5.0/_build/src" --logbufsecs="0" --logging_level="INFO"
--max_completed_executors_per_framework="150" --oversubscribed_resources_interval="15secs"
--perf_duration="10secs" --perf_interval="1mins" --port="5051" --qos_correction_interval_min="0ns"
--quiet="false" --recover="reconnect" --recovery_timeout="15mins" --registration_backoff_factor="10ms"
--resources="cpus:2;gpus:0;mem:1024;disk:1024;ports:[31000-32000]" --revocable_cpu_low_priority="true"
--runtime_dir="/tmp/Endpoint_SlaveEndpointTest_UnauthorizedRequest_2_n70Xbg" --sandbox_directory="/mnt/mesos/sandbox"
--strict="true" --switch_user="true" --systemd_enable_support="true" --systemd_runtime_directory="/run/systemd/system"
--version="false" --work_dir="/tmp/Endpoint_SlaveEndpointTest_UnauthorizedRequest_2_sI4j1t"
--zk_session_timeout="10secs"
I1003 17:05:52.418373  5791 credentials.hpp:86] Loading credential for authentication from
'/tmp/Endpoint_SlaveEndpointTest_UnauthorizedRequest_2_n70Xbg/credential'
I1003 17:05:52.418588  5791 slave.cpp:287] Agent using credential for: test-principal
I1003 17:05:52.418619  5791 credentials.hpp:37] Loading credentials for authentication from
'/tmp/Endpoint_SlaveEndpointTest_UnauthorizedRequest_2_n70Xbg/http_credentials'
I1003 17:05:52.418967  5791 http.cpp:1045] Creating default 'basic' HTTP authenticator for
realm 'mesos-agent-readonly'
I1003 17:05:52.419142  5791 http.cpp:1045] Creating default 'basic' HTTP authenticator for
realm 'mesos-agent-readwrite'
I1003 17:05:52.420544  5791 slave.cpp:585] Agent resources: [{"name":"cpus","scalar":{"value":2.0},"type":"SCALAR"},{"name":"mem","scalar":{"value":1024.0},"type":"SCALAR"},{"name":"disk","scalar":{"value":1024.0},"type":"SCALAR"},{"name":"ports","ranges":{"range":[{"begin":31000,"end":32000}]},"type":"RANGES"}]
I1003 17:05:52.420781  5791 slave.cpp:593] Agent attributes: [  ]
I1003 17:05:52.420797  5791 slave.cpp:602] Agent hostname: 1edecd6610b4
I1003 17:05:52.420922  5811 status_update_manager.cpp:177] Pausing sending status updates
I1003 17:05:52.422509  5810 state.cpp:64] Recovering state from '/tmp/Endpoint_SlaveEndpointTest_UnauthorizedRequest_2_sI4j1t/meta'
I1003 17:05:52.422842  5804 status_update_manager.cpp:203] Recovering status update manager
I1003 17:05:52.423020  5790 containerizer.cpp:648] Recovering containerizer
I1003 17:05:52.424345  5801 provisioner.cpp:416] Provisioner recovery complete
I1003 17:05:52.424666  5811 slave.cpp:6310] Finished recovery
I1003 17:05:52.425118  5811 slave.cpp:6492] Querying resource estimator for oversubscribable
resources
I1003 17:05:52.425369  5809 slave.cpp:6506] Received oversubscribable resources {} from the
resource estimator
I1003 17:05:52.428107  5807 process.cpp:3929] Handling HTTP event for process 'slave(823)'
with path: '/slave(823)/containers'
I1003 17:05:52.429708  5799 http.cpp:1185] HTTP GET for /slave(823)/containers from 172.17.0.2:44994
I1003 17:05:52.429785  5799 http.cpp:976] Authorizing principal 'test-principal' to GET the
'/containers' endpoint
I1003 17:05:52.431785  5799 slave.cpp:869] Agent terminating
[       OK ] Endpoint/SlaveEndpointTest.UnauthorizedRequest/2 (29 ms)
[ RUN      ] Endpoint/SlaveEndpointTest.NoAuthorizer/0
I1003 17:05:52.442167  5771 containerizer.cpp:292] Using isolation { environment_secret, posix/cpu,
posix/mem, filesystem/posix, network/cni }
W1003 17:05:52.442662  5771 backend.cpp:76] Failed to create 'aufs' backend: AufsBackend requires
root privileges
W1003 17:05:52.442771  5771 backend.cpp:76] Failed to create 'bind' backend: BindBackend requires
root privileges
I1003 17:05:52.442802  5771 provisioner.cpp:255] Using default backend 'copy'
I1003 17:05:52.444365  5771 cluster.cpp:448] Creating default 'local' authorizer
I1003 17:05:52.446247  5794 slave.cpp:254] Mesos agent started on (824)@172.17.0.2:44516
I1003 17:05:52.446269  5794 slave.cpp:255] Flags at startup: --acls="" --appc_simple_discovery_uri_prefix="http://"
--appc_store_dir="/tmp/Endpoint_SlaveEndpointTest_NoAuthorizer_0_j8Fo7m/store/appc" --authenticate_http_readonly="true"
--authenticate_http_readwrite="true" --authenticatee="crammd5" --authentication_backoff_factor="1secs"
--authorizer="local" --cgroups_cpu_enable_pids_and_tids_count="false" --cgroups_enable_cfs="false"
--cgroups_hierarchy="/sys/fs/cgroup" --cgroups_limit_swap="false" --cgroups_root="mesos" --container_disk_watch_interval="15secs"
--containerizers="mesos" --credential="/tmp/Endpoint_SlaveEndpointTest_NoAuthorizer_0_j8Fo7m/credential"
--default_role="*" --disallow_sharing_agent_pid_namespace="false" --disk_watch_interval="1mins"
--docker="docker" --docker_kill_orphans="true" --docker_registry="https://registry-1.docker.io"
--docker_remove_delay="6hrs" --docker_socket="/var/run/docker.sock" --docker_stop_timeout="0ns"
--docker_store_dir="/tmp/Endpoint_SlaveEndpointTest_NoAuthorizer_0_j8Fo7m/store/docker" --docker_volume_checkpoint_dir="/var/run/mesos/isolators/docker/volume"
--enforce_container_disk_quota="false" --executor_registration_timeout="1mins" --executor_reregistration_timeout="2secs"
--executor_shutdown_grace_period="5secs" --fetcher_cache_dir="/tmp/Endpoint_SlaveEndpointTest_NoAuthorizer_0_j8Fo7m/fetch"
--fetcher_cache_size="2GB" --frameworks_home="" --gc_delay="1weeks" --gc_disk_headroom="0.1"
--hadoop_home="" --help="false" --hostname_lookup="true" --http_command_executor="false" --http_credentials="/tmp/Endpoint_SlaveEndpointTest_NoAuthorizer_0_j8Fo7m/http_credentials"
--http_heartbeat_interval="30secs" --initialize_driver_logging="true" --isolation="posix/cpu,posix/mem"
--launcher="posix" --launcher_dir="/mesos/mesos-1.5.0/_build/src" --logbufsecs="0" --logging_level="INFO"
--max_completed_executors_per_framework="150" --oversubscribed_resources_interval="15secs"
--perf_duration="10secs" --perf_interval="1mins" --port="5051" --qos_correction_interval_min="0ns"
--quiet="false" --recover="reconnect" --recovery_timeout="15mins" --registration_backoff_factor="10ms"
--resources="cpus:2;gpus:0;mem:1024;disk:1024;ports:[31000-32000]" --revocable_cpu_low_priority="true"
--runtime_dir="/tmp/Endpoint_SlaveEndpointTest_NoAuthorizer_0_j8Fo7m" --sandbox_directory="/mnt/mesos/sandbox"
--strict="true" --switch_user="true" --systemd_enable_support="true" --systemd_runtime_directory="/run/systemd/system"
--version="false" --work_dir="/tmp/Endpoint_SlaveEndpointTest_NoAuthorizer_0_uYAqSA" --zk_session_timeout="10secs"
I1003 17:05:52.446666  5794 credentials.hpp:86] Loading credential for authentication from
'/tmp/Endpoint_SlaveEndpointTest_NoAuthorizer_0_j8Fo7m/credential'
I1003 17:05:52.446815  5794 slave.cpp:287] Agent using credential for: test-principal
I1003 17:05:52.446836  5794 credentials.hpp:37] Loading credentials for authentication from
'/tmp/Endpoint_SlaveEndpointTest_NoAuthorizer_0_j8Fo7m/http_credentials'
I1003 17:05:52.447105  5794 http.cpp:1045] Creating default 'basic' HTTP authenticator for
realm 'mesos-agent-readonly'
I1003 17:05:52.447263  5794 http.cpp:1045] Creating default 'basic' HTTP authenticator for
realm 'mesos-agent-readwrite'
I1003 17:05:52.448665  5794 slave.cpp:585] Agent resources: [{"name":"cpus","scalar":{"value":2.0},"type":"SCALAR"},{"name":"mem","scalar":{"value":1024.0},"type":"SCALAR"},{"name":"disk","scalar":{"value":1024.0},"type":"SCALAR"},{"name":"ports","ranges":{"range":[{"begin":31000,"end":32000}]},"type":"RANGES"}]
I1003 17:05:52.448892  5794 slave.cpp:593] Agent attributes: [  ]
I1003 17:05:52.448909  5794 slave.cpp:602] Agent hostname: 1edecd6610b4
I1003 17:05:52.449041  5802 status_update_manager.cpp:177] Pausing sending status updates
I1003 17:05:52.450310  5801 state.cpp:64] Recovering state from '/tmp/Endpoint_SlaveEndpointTest_NoAuthorizer_0_uYAqSA/meta'
I1003 17:05:52.450611  5801 status_update_manager.cpp:203] Recovering status update manager
I1003 17:05:52.450800  5800 containerizer.cpp:648] Recovering containerizer
I1003 17:05:52.451958  5792 provisioner.cpp:416] Provisioner recovery complete
I1003 17:05:52.452263  5808 slave.cpp:6310] Finished recovery
I1003 17:05:52.452735  5808 slave.cpp:6492] Querying resource estimator for oversubscribable
resources
I1003 17:05:52.452992  5813 slave.cpp:6506] Received oversubscribable resources {} from the
resource estimator
I1003 17:05:52.455168  5812 process.cpp:3929] Handling HTTP event for process 'slave(824)'
with path: '/slave(824)/monitor/statistics'
I1003 17:05:52.456302  5805 http.cpp:1185] HTTP GET for /slave(824)/monitor/statistics from
172.17.0.2:44996
I1003 17:05:52.456368  5805 http.cpp:976] Authorizing principal 'test-principal' to GET the
'/monitor/statistics' endpoint
I1003 17:05:52.459528  5806 slave.cpp:869] Agent terminating
[       OK ] Endpoint/SlaveEndpointTest.NoAuthorizer/0 (27 ms)
[ RUN      ] Endpoint/SlaveEndpointTest.NoAuthorizer/1
I1003 17:05:52.469877  5771 containerizer.cpp:292] Using isolation { environment_secret, posix/cpu,
posix/mem, filesystem/posix, network/cni }
W1003 17:05:52.470397  5771 backend.cpp:76] Failed to create 'aufs' backend: AufsBackend requires
root privileges
W1003 17:05:52.470504  5771 backend.cpp:76] Failed to create 'bind' backend: BindBackend requires
root privileges
I1003 17:05:52.470535  5771 provisioner.cpp:255] Using default backend 'copy'
I1003 17:05:52.472120  5771 cluster.cpp:448] Creating default 'local' authorizer
I1003 17:05:52.473968  5798 slave.cpp:254] Mesos agent started on (825)@172.17.0.2:44516
I1003 17:05:52.473989  5798 slave.cpp:255] Flags at startup: --acls="" --appc_simple_discovery_uri_prefix="http://"
--appc_store_dir="/tmp/Endpoint_SlaveEndpointTest_NoAuthorizer_1_faZjju/store/appc" --authenticate_http_readonly="true"
--authenticate_http_readwrite="true" --authenticatee="crammd5" --authentication_backoff_factor="1secs"
--authorizer="local" --cgroups_cpu_enable_pids_and_tids_count="false" --cgroups_enable_cfs="false"
--cgroups_hierarchy="/sys/fs/cgroup" --cgroups_limit_swap="false" --cgroups_root="mesos" --container_disk_watch_interval="15secs"
--containerizers="mesos" --credential="/tmp/Endpoint_SlaveEndpointTest_NoAuthorizer_1_faZjju/credential"
--default_role="*" --disallow_sharing_agent_pid_namespace="false" --disk_watch_interval="1mins"
--docker="docker" --docker_kill_orphans="true" --docker_registry="https://registry-1.docker.io"
--docker_remove_delay="6hrs" --docker_socket="/var/run/docker.sock" --docker_stop_timeout="0ns"
--docker_store_dir="/tmp/Endpoint_SlaveEndpointTest_NoAuthorizer_1_faZjju/store/docker" --docker_volume_checkpoint_dir="/var/run/mesos/isolators/docker/volume"
--enforce_container_disk_quota="false" --executor_registration_timeout="1mins" --executor_reregistration_timeout="2secs"
--executor_shutdown_grace_period="5secs" --fetcher_cache_dir="/tmp/Endpoint_SlaveEndpointTest_NoAuthorizer_1_faZjju/fetch"
--fetcher_cache_size="2GB" --frameworks_home="" --gc_delay="1weeks" --gc_disk_headroom="0.1"
--hadoop_home="" --help="false" --hostname_lookup="true" --http_command_executor="false" --http_credentials="/tmp/Endpoint_SlaveEndpointTest_NoAuthorizer_1_faZjju/http_credentials"
--http_heartbeat_interval="30secs" --initialize_driver_logging="true" --isolation="posix/cpu,posix/mem"
--launcher="posix" --launcher_dir="/mesos/mesos-1.5.0/_build/src" --logbufsecs="0" --logging_level="INFO"
--max_completed_executors_per_framework="150" --oversubscribed_resources_interval="15secs"
--perf_duration="10secs" --perf_interval="1mins" --port="5051" --qos_correction_interval_min="0ns"
--quiet="false" --recover="reconnect" --recovery_timeout="15mins" --registration_backoff_factor="10ms"
--resources="cpus:2;gpus:0;mem:1024;disk:1024;ports:[31000-32000]" --revocable_cpu_low_priority="true"
--runtime_dir="/tmp/Endpoint_SlaveEndpointTest_NoAuthorizer_1_faZjju" --sandbox_directory="/mnt/mesos/sandbox"
--strict="true" --switch_user="true" --systemd_enable_support="true" --systemd_runtime_directory="/run/systemd/system"
--version="false" --work_dir="/tmp/Endpoint_SlaveEndpointTest_NoAuthorizer_1_UJUd0H" --zk_session_timeout="10secs"
I1003 17:05:52.474382  5798 credentials.hpp:86] Loading credential for authentication from
'/tmp/Endpoint_SlaveEndpointTest_NoAuthorizer_1_faZjju/credential'
I1003 17:05:52.474532  5798 slave.cpp:287] Agent using credential for: test-principal
I1003 17:05:52.474556  5798 credentials.hpp:37] Loading credentials for authentication from
'/tmp/Endpoint_SlaveEndpointTest_NoAuthorizer_1_faZjju/http_credentials'
I1003 17:05:52.474781  5798 http.cpp:1045] Creating default 'basic' HTTP authenticator for
realm 'mesos-agent-readonly'
I1003 17:05:52.474931  5798 http.cpp:1045] Creating default 'basic' HTTP authenticator for
realm 'mesos-agent-readwrite'
I1003 17:05:52.476218  5798 slave.cpp:585] Agent resources: [{"name":"cpus","scalar":{"value":2.0},"type":"SCALAR"},{"name":"mem","scalar":{"value":1024.0},"type":"SCALAR"},{"name":"disk","scalar":{"value":1024.0},"type":"SCALAR"},{"name":"ports","ranges":{"range":[{"begin":31000,"end":32000}]},"type":"RANGES"}]
I1003 17:05:52.476444  5798 slave.cpp:593] Agent attributes: [  ]
I1003 17:05:52.476459  5798 slave.cpp:602] Agent hostname: 1edecd6610b4
I1003 17:05:52.476585  5810 status_update_manager.cpp:177] Pausing sending status updates
I1003 17:05:52.477912  5806 state.cpp:64] Recovering state from '/tmp/Endpoint_SlaveEndpointTest_NoAuthorizer_1_UJUd0H/meta'
I1003 17:05:52.478158  5806 status_update_manager.cpp:203] Recovering status update manager
I1003 17:05:52.478328  5797 containerizer.cpp:648] Recovering containerizer
I1003 17:05:52.479478  5807 provisioner.cpp:416] Provisioner recovery complete
I1003 17:05:52.479760  5813 slave.cpp:6310] Finished recovery
I1003 17:05:52.480221  5813 slave.cpp:6492] Querying resource estimator for oversubscribable
resources
I1003 17:05:52.480449  5806 slave.cpp:6506] Received oversubscribable resources {} from the
resource estimator
I1003 17:05:52.482653  5795 process.cpp:3929] Handling HTTP event for process 'slave(825)'
with path: '/slave(825)/monitor/statistics.json'
I1003 17:05:52.483747  5800 http.cpp:1185] HTTP GET for /slave(825)/monitor/statistics.json
from 172.17.0.2:44998
I1003 17:05:52.483810  5800 http.cpp:976] Authorizing principal 'test-principal' to GET the
'/monitor/statistics.json' endpoint
I1003 17:05:52.486312  5771 slave.cpp:869] Agent terminating
[       OK ] Endpoint/SlaveEndpointTest.NoAuthorizer/1 (26 ms)
[ RUN      ] Endpoint/SlaveEndpointTest.NoAuthorizer/2
I1003 17:05:52.506028  5771 containerizer.cpp:292] Using isolation { environment_secret, posix/cpu,
posix/mem, filesystem/posix, network/cni }
W1003 17:05:52.506547  5771 backend.cpp:76] Failed to create 'aufs' backend: AufsBackend requires
root privileges
W1003 17:05:52.506656  5771 backend.cpp:76] Failed to create 'bind' backend: BindBackend requires
root privileges
I1003 17:05:52.506690  5771 provisioner.cpp:255] Using default backend 'copy'
I1003 17:05:52.508313  5771 cluster.cpp:448] Creating default 'local' authorizer
I1003 17:05:52.510217  5795 slave.cpp:254] Mesos agent started on (826)@172.17.0.2:44516
I1003 17:05:52.510237  5795 slave.cpp:255] Flags at startup: --acls="" --appc_simple_discovery_uri_prefix="http://"
--appc_store_dir="/tmp/Endpoint_SlaveEndpointTest_NoAuthorizer_2_19JtPB/store/appc" --authenticate_http_readonly="true"
--authenticate_http_readwrite="true" --authenticatee="crammd5" --authentication_backoff_factor="1secs"
--authorizer="local" --cgroups_cpu_enable_pids_and_tids_count="false" --cgroups_enable_cfs="false"
--cgroups_hierarchy="/sys/fs/cgroup" --cgroups_limit_swap="false" --cgroups_root="mesos" --container_disk_watch_interval="15secs"
--containerizers="mesos" --credential="/tmp/Endpoint_SlaveEndpointTest_NoAuthorizer_2_19JtPB/credential"
--default_role="*" --disallow_sharing_agent_pid_namespace="false" --disk_watch_interval="1mins"
--docker="docker" --docker_kill_orphans="true" --docker_registry="https://registry-1.docker.io"
--docker_remove_delay="6hrs" --docker_socket="/var/run/docker.sock" --docker_stop_timeout="0ns"
--docker_store_dir="/tmp/Endpoint_SlaveEndpointTest_NoAuthorizer_2_19JtPB/store/docker" --docker_volume_checkpoint_dir="/var/run/mesos/isolators/docker/volume"
--enforce_container_disk_quota="false" --executor_registration_timeout="1mins" --executor_reregistration_timeout="2secs"
--executor_shutdown_grace_period="5secs" --fetcher_cache_dir="/tmp/Endpoint_SlaveEndpointTest_NoAuthorizer_2_19JtPB/fetch"
--fetcher_cache_size="2GB" --frameworks_home="" --gc_delay="1weeks" --gc_disk_headroom="0.1"
--hadoop_home="" --help="false" --hostname_lookup="true" --http_command_executor="false" --http_credentials="/tmp/Endpoint_SlaveEndpointTest_NoAuthorizer_2_19JtPB/http_credentials"
--http_heartbeat_interval="30secs" --initialize_driver_logging="true" --isolation="posix/cpu,posix/mem"
--launcher="posix" --launcher_dir="/mesos/mesos-1.5.0/_build/src" --logbufsecs="0" --logging_level="INFO"
--max_completed_executors_per_framework="150" --oversubscribed_resources_interval="15secs"
--perf_duration="10secs" --perf_interval="1mins" --port="5051" --qos_correction_interval_min="0ns"
--quiet="false" --recover="reconnect" --recovery_timeout="15mins" --registration_backoff_factor="10ms"
--resources="cpus:2;gpus:0;mem:1024;disk:1024;ports:[31000-32000]" --revocable_cpu_low_priority="true"
--runtime_dir="/tmp/Endpoint_SlaveEndpointTest_NoAuthorizer_2_19JtPB" --sandbox_directory="/mnt/mesos/sandbox"
--strict="true" --switch_user="true" --systemd_enable_support="true" --systemd_runtime_directory="/run/systemd/system"
--version="false" --work_dir="/tmp/Endpoint_SlaveEndpointTest_NoAuthorizer_2_cmc0qP" --zk_session_timeout="10secs"
I1003 17:05:52.510646  5795 credentials.hpp:86] Loading credential for authentication from
'/tmp/Endpoint_SlaveEndpointTest_NoAuthorizer_2_19JtPB/credential'
I1003 17:05:52.510802  5795 slave.cpp:287] Agent using credential for: test-principal
I1003 17:05:52.510824  5795 credentials.hpp:37] Loading credentials for authentication from
'/tmp/Endpoint_SlaveEndpointTest_NoAuthorizer_2_19JtPB/http_credentials'
I1003 17:05:52.511087  5795 http.cpp:1045] Creating default 'basic' HTTP authenticator for
realm 'mesos-agent-readonly'
I1003 17:05:52.511255  5795 http.cpp:1045] Creating default 'basic' HTTP authenticator for
realm 'mesos-agent-readwrite'
I1003 17:05:52.512619  5795 slave.cpp:585] Agent resources: [{"name":"cpus","scalar":{"value":2.0},"type":"SCALAR"},{"name":"mem","scalar":{"value":1024.0},"type":"SCALAR"},{"name":"disk","scalar":{"value":1024.0},"type":"SCALAR"},{"name":"ports","ranges":{"range":[{"begin":31000,"end":32000}]},"type":"RANGES"}]
I1003 17:05:52.512859  5795 slave.cpp:593] Agent attributes: [  ]
I1003 17:05:52.512876  5795 slave.cpp:602] Agent hostname: 1edecd6610b4
I1003 17:05:52.513006  5802 status_update_manager.cpp:177] Pausing sending status updates
I1003 17:05:52.514462  5810 state.cpp:64] Recovering state from '/tmp/Endpoint_SlaveEndpointTest_NoAuthorizer_2_cmc0qP/meta'
I1003 17:05:52.514773  5808 status_update_manager.cpp:203] Recovering status update manager
I1003 17:05:52.514967  5806 containerizer.cpp:648] Recovering containerizer
I1003 17:05:52.516239  5805 provisioner.cpp:416] Provisioner recovery complete
I1003 17:05:52.516582  5800 slave.cpp:6310] Finished recovery
I1003 17:05:52.517062  5800 slave.cpp:6492] Querying resource estimator for oversubscribable
resources
I1003 17:05:52.517307  5811 slave.cpp:6506] Received oversubscribable resources {} from the
resource estimator
I1003 17:05:52.520056  5790 process.cpp:3929] Handling HTTP event for process 'slave(826)'
with path: '/slave(826)/containers'
I1003 17:05:52.521345  5801 http.cpp:1185] HTTP GET for /slave(826)/containers from 172.17.0.2:45000
I1003 17:05:52.521428  5801 http.cpp:976] Authorizing principal 'test-principal' to GET the
'/containers' endpoint
I1003 17:05:52.524809  5771 slave.cpp:869] Agent terminating
[       OK ] Endpoint/SlaveEndpointTest.NoAuthorizer/2 (29 ms)
[----------] 9 tests from Endpoint/SlaveEndpointTest (303 ms total)

[----------] 2 tests from ContainerizerType/DefaultContainerDNSFlagTest
[ RUN      ] ContainerizerType/DefaultContainerDNSFlagTest.ValidateFlag/0
[       OK ] ContainerizerType/DefaultContainerDNSFlagTest.ValidateFlag/0 (11 ms)
[ RUN      ] ContainerizerType/DefaultContainerDNSFlagTest.ValidateFlag/1
[       OK ] ContainerizerType/DefaultContainerDNSFlagTest.ValidateFlag/1 (9 ms)
[----------] 2 tests from ContainerizerType/DefaultContainerDNSFlagTest (20 ms total)

[----------] Global test environment tear-down
[==========] 1685 tests from 184 test cases ran. (772224 ms total)
[  PASSED  ] 1684 tests.
[  FAILED  ] 1 test, listed below:
[  FAILED  ] ExamplesTest.PythonFramework

 1 FAILED TEST
  YOU HAVE 21 DISABLED TESTS

I1003 17:05:52.614531  5814 process.cpp:1068] Failed to accept socket: future discarded
make[4]: *** [check-local] Error 1
make[4]: Leaving directory `/mesos/mesos-1.5.0/_build/src'
make[3]: *** [check-am] Error 2
make[3]: Leaving directory `/mesos/mesos-1.5.0/_build/src'
make[2]: *** [check] Error 2
make[2]: Leaving directory `/mesos/mesos-1.5.0/_build/src'
make[1]: *** [check-recursive] Error 1
make[1]: Leaving directory `/mesos/mesos-1.5.0/_build'
make: *** [distcheck] Error 1
+ docker rmi mesos-1507046490-24264
Untagged: mesos-1507046490-24264:latest
Deleted: sha256:3eb23667131f8262fc4b1734736700dff731ac12f0b6694f513d569903a89d13
Deleted: sha256:86889fd15dadc6896cb193852f6317d7ee15705e62166b2701ae594f30cf4475
Deleted: sha256:606b637030bb2e09ddebf574364f3e5ef6d54c7e26de7063c95182825c912823
Deleted: sha256:9d82a43f6001410dea57232e425ffe5f89be2c57f0c3997d5510df53733d870a
Deleted: sha256:a3093f78dbe9c29577296ff84ce2ec980b70406a7ae0c80fe4f1eab0e4aefb86
Deleted: sha256:30a3a7b495cde62036c233b53cd8709e8d99604b04153801ccac5bf19f8bf4fd
Deleted: sha256:fa1170ca3ab7c0a4480380caeadea1c6d285d93a1a191e6f200a09215553fa50
Deleted: sha256:46b05fe645861d3303c1900b9e457008e47c6bde34d83e9a6b000d7a5c6228d2
Deleted: sha256:6be3ae966095b1824239599e3d46621a8d33c82400959c7abc654b5ddc148797
Deleted: sha256:8571ef25efabc3ce8ca9b90cc7de57dff94af7108b117cdf5bf1e21813788418
Deleted: sha256:511f010cfa07da27b0d1d800559200a89f6fe77ece02f749b72a43bcb9e6f6bc
Deleted: sha256:24e6e6c6419b7fc49305de77964579e5570b5fad16efe3c1c588883f13911b38
Deleted: sha256:f9a0986c9e32c5abbdd4634065313313c4072d268fc827a7c58c8852e95b724c
Deleted: sha256:75e39ddeb525f9c2486977e4f9f53ef1eddf8cb72bea5891b13780cb989f6971
Deleted: sha256:cfa5a9d1e5f5b90507365603ffcf7718822b05bde4539bcf03d69baa519f5bfd
Deleted: sha256:1214bc99964a7621f9b446566ff8b48f5c46c849a232bbdf853ed3f3d6826d46
Deleted: sha256:a4d8a84d2ca8d2c26a75e0796acc662d89855670d74b824e9250b5d5402a693d
Deleted: sha256:70c69197cfb2043df481b21c2de0c7808923941984790c2e70a3b1864d5e0e30
Deleted: sha256:8cb1e2d00c5abe95576a216737b2604dc467185d1ce6a715c8657cf8de90a99a
Deleted: sha256:fea5895519a852b282cee9910a796bdd4bfa87d94852a79edca68c16268a852b
Deleted: sha256:b064e388fa8ae4f2ff478e2e83abace6a244b894b0337d48e7e83242680efa7c
Deleted: sha256:e15747e856e0721c14b1f4406b3689069c4839d177c7ac4e7b8fba941f82cb88
Deleted: sha256:c7a656a7bbdf91bb7aa9271322b296a2a4c8e99d0ffad5ce6ea6a39c7b0f3749
Deleted: sha256:35efd7a97f5ff52ea701f1f6f924b85fe787e13fbeee630ab6fcc78f8e65b58b
Deleted: sha256:2c648cb469fce981918772477f032b888e84081ebb59478ce8bf7a63ce1c2d2d
Deleted: sha256:ad44611445549795348b04a42066fcc75e4b4269b64ab055d35ea042efa2444f
Deleted: sha256:62cf21deac5be87693fc781761031ceecc83ce093253d04cc723a4fd38ba742f
Deleted: sha256:b59475c85a3a006d9c2d3ba32a35824561136d11679f4ff40d2d49cfa6c2ddd9
Build step 'Execute shell' marked build as failure

Mime
View raw message