mesos-builds mailing list archives

Site index · List index
Message view « Date » · « Thread »
Top « Date » · « Thread »
From Apache Jenkins Server <jenk...@builds.apache.org>
Subject Build failed in Jenkins: Mesos-Buildbot » autotools,gcc,--verbose --disable-libtool-wrappers --enable-libevent --enable-ssl,GLOG_v=1 MESOS_VERBOSE=1,centos:7,(ubuntu)&&(!ubuntu-us1)&&(!ubuntu-eu2)&&(!qnode3)&&(!H23) #4312
Date Thu, 12 Oct 2017 08:46:33 GMT
See <https://builds.apache.org/job/Mesos-Buildbot/BUILDTOOL=autotools,COMPILER=gcc,CONFIGURATION=--verbose%20--disable-libtool-wrappers%20--enable-libevent%20--enable-ssl,ENVIRONMENT=GLOG_v=1%20MESOS_VERBOSE=1,OS=centos%3A7,label_exp=(ubuntu)&&(!ubuntu-us1)&&(!ubuntu-eu2)&&(!qnode3)&&(!H23)/4312/display/redirect>

------------------------------------------
[...truncated 33.10 MB...]
I1012 08:46:21.872932 12939 slave.cpp:255] Flags at startup: --acls="" --appc_simple_discovery_uri_prefix="http://"
--appc_store_dir="/tmp/Endpoint_SlaveEndpointTest_UnauthorizedRequest_0_uiWjcD/store/appc"
--authenticate_http_executors="true" --authenticate_http_readonly="true" --authenticate_http_readwrite="true"
--authenticatee="crammd5" --authentication_backoff_factor="1secs" --authorizer="local" --cgroups_cpu_enable_pids_and_tids_count="false"
--cgroups_enable_cfs="false" --cgroups_hierarchy="/sys/fs/cgroup" --cgroups_limit_swap="false"
--cgroups_root="mesos" --container_disk_watch_interval="15secs" --containerizers="mesos" --credential="/tmp/Endpoint_SlaveEndpointTest_UnauthorizedRequest_0_uiWjcD/credential"
--default_role="*" --disallow_sharing_agent_pid_namespace="false" --disk_watch_interval="1mins"
--docker="docker" --docker_kill_orphans="true" --docker_registry="https://registry-1.docker.io"
--docker_remove_delay="6hrs" --docker_socket="/var/run/docker.sock" --docker_stop_timeout="0ns"
--docker_store_dir="/tmp/Endpoint_SlaveEndpointTest_UnauthorizedRequest_0_uiWjcD/store/docker"
--docker_volume_checkpoint_dir="/var/run/mesos/isolators/docker/volume" --enforce_container_disk_quota="false"
--executor_registration_timeout="1mins" --executor_reregistration_timeout="2secs" --executor_secret_key="/tmp/Endpoint_SlaveEndpointTest_UnauthorizedRequest_0_uiWjcD/executor_secret_key"
--executor_shutdown_grace_period="5secs" --fetcher_cache_dir="/tmp/Endpoint_SlaveEndpointTest_UnauthorizedRequest_0_uiWjcD/fetch"
--fetcher_cache_size="2GB" --frameworks_home="" --gc_delay="1weeks" --gc_disk_headroom="0.1"
--hadoop_home="" --help="false" --hostname_lookup="true" --http_command_executor="false" --http_credentials="/tmp/Endpoint_SlaveEndpointTest_UnauthorizedRequest_0_uiWjcD/http_credentials"
--http_heartbeat_interval="30secs" --initialize_driver_logging="true" --isolation="posix/cpu,posix/mem"
--launcher="posix" --launcher_dir="/mesos/mesos-1.5.0/_build/src" --logbufsecs="0" --logging_level="INFO"
--max_completed_executors_per_framework="150" --oversubscribed_resources_interval="15secs"
--perf_duration="10secs" --perf_interval="1mins" --port="5051" --qos_correction_interval_min="0ns"
--quiet="false" --recover="reconnect" --recovery_timeout="15mins" --registration_backoff_factor="10ms"
--resources="cpus:2;gpus:0;mem:1024;disk:1024;ports:[31000-32000]" --revocable_cpu_low_priority="true"
--runtime_dir="/tmp/Endpoint_SlaveEndpointTest_UnauthorizedRequest_0_uiWjcD" --sandbox_directory="/mnt/mesos/sandbox"
--strict="true" --switch_user="true" --systemd_enable_support="true" --systemd_runtime_directory="/run/systemd/system"
--version="false" --work_dir="/tmp/Endpoint_SlaveEndpointTest_UnauthorizedRequest_0_qBeMyT"
--zk_session_timeout="10secs"
I1012 08:46:21.873808 12939 credentials.hpp:86] Loading credential for authentication from
'/tmp/Endpoint_SlaveEndpointTest_UnauthorizedRequest_0_uiWjcD/credential'
I1012 08:46:21.874099 12939 slave.cpp:287] Agent using credential for: test-principal
I1012 08:46:21.874136 12939 credentials.hpp:37] Loading credentials for authentication from
'/tmp/Endpoint_SlaveEndpointTest_UnauthorizedRequest_0_uiWjcD/http_credentials'
I1012 08:46:21.874675 12939 http.cpp:1045] Creating default 'basic' HTTP authenticator for
realm 'mesos-agent-executor'
I1012 08:46:21.874855 12939 http.cpp:1066] Creating default 'jwt' HTTP authenticator for realm
'mesos-agent-executor'
I1012 08:46:21.875238 12939 http.cpp:1045] Creating default 'basic' HTTP authenticator for
realm 'mesos-agent-readonly'
I1012 08:46:21.875433 12939 http.cpp:1066] Creating default 'jwt' HTTP authenticator for realm
'mesos-agent-readonly'
I1012 08:46:21.875712 12939 http.cpp:1045] Creating default 'basic' HTTP authenticator for
realm 'mesos-agent-readwrite'
I1012 08:46:21.875885 12939 http.cpp:1066] Creating default 'jwt' HTTP authenticator for realm
'mesos-agent-readwrite'
I1012 08:46:21.878393 12939 slave.cpp:585] Agent resources: [{"name":"cpus","scalar":{"value":2.0},"type":"SCALAR"},{"name":"mem","scalar":{"value":1024.0},"type":"SCALAR"},{"name":"disk","scalar":{"value":1024.0},"type":"SCALAR"},{"name":"ports","ranges":{"range":[{"begin":31000,"end":32000}]},"type":"RANGES"}]
I1012 08:46:21.878859 12939 slave.cpp:593] Agent attributes: [  ]
I1012 08:46:21.878880 12939 slave.cpp:602] Agent hostname: e160db019aaa
I1012 08:46:21.879199 12944 status_update_manager.cpp:177] Pausing sending status updates
I1012 08:46:21.881490 12940 state.cpp:64] Recovering state from '/tmp/Endpoint_SlaveEndpointTest_UnauthorizedRequest_0_qBeMyT/meta'
I1012 08:46:21.882233 12940 status_update_manager.cpp:203] Recovering status update manager
I1012 08:46:21.882804 12939 containerizer.cpp:648] Recovering containerizer
I1012 08:46:21.884982 12941 provisioner.cpp:416] Provisioner recovery complete
I1012 08:46:21.885687 12938 slave.cpp:6310] Finished recovery
I1012 08:46:21.886304 12938 slave.cpp:6492] Querying resource estimator for oversubscribable
resources
I1012 08:46:21.887003 12938 slave.cpp:6506] Received oversubscribable resources {} from the
resource estimator
I1012 08:46:21.891680 12945 process.cpp:3929] Handling HTTP event for process 'slave(825)'
with path: '/slave(825)/monitor/statistics'
I1012 08:46:21.895359 12938 http.cpp:1185] HTTP GET for /slave(825)/monitor/statistics from
172.17.0.2:40044
I1012 08:46:21.895485 12938 http.cpp:976] Authorizing principal 'test-principal' to GET the
'/monitor/statistics' endpoint
I1012 08:46:21.898929  7714 slave.cpp:869] Agent terminating
[       OK ] Endpoint/SlaveEndpointTest.UnauthorizedRequest/0 (52 ms)
[ RUN      ] Endpoint/SlaveEndpointTest.UnauthorizedRequest/1
I1012 08:46:21.923895  7714 containerizer.cpp:292] Using isolation { environment_secret, posix/cpu,
posix/mem, filesystem/posix, network/cni }
W1012 08:46:21.924998  7714 backend.cpp:76] Failed to create 'overlay' backend: OverlayBackend
requires root privileges
W1012 08:46:21.925457  7714 backend.cpp:76] Failed to create 'bind' backend: BindBackend requires
root privileges
I1012 08:46:21.925546  7714 provisioner.cpp:255] Using default backend 'copy'
I1012 08:46:21.931681 12941 slave.cpp:254] Mesos agent started on (826)@172.17.0.2:46623
I1012 08:46:21.931727 12941 slave.cpp:255] Flags at startup: --acls="" --appc_simple_discovery_uri_prefix="http://"
--appc_store_dir="/tmp/Endpoint_SlaveEndpointTest_UnauthorizedRequest_1_c5pCgA/store/appc"
--authenticate_http_executors="true" --authenticate_http_readonly="true" --authenticate_http_readwrite="true"
--authenticatee="crammd5" --authentication_backoff_factor="1secs" --authorizer="local" --cgroups_cpu_enable_pids_and_tids_count="false"
--cgroups_enable_cfs="false" --cgroups_hierarchy="/sys/fs/cgroup" --cgroups_limit_swap="false"
--cgroups_root="mesos" --container_disk_watch_interval="15secs" --containerizers="mesos" --credential="/tmp/Endpoint_SlaveEndpointTest_UnauthorizedRequest_1_c5pCgA/credential"
--default_role="*" --disallow_sharing_agent_pid_namespace="false" --disk_watch_interval="1mins"
--docker="docker" --docker_kill_orphans="true" --docker_registry="https://registry-1.docker.io"
--docker_remove_delay="6hrs" --docker_socket="/var/run/docker.sock" --docker_stop_timeout="0ns"
--docker_store_dir="/tmp/Endpoint_SlaveEndpointTest_UnauthorizedRequest_1_c5pCgA/store/docker"
--docker_volume_checkpoint_dir="/var/run/mesos/isolators/docker/volume" --enforce_container_disk_quota="false"
--executor_registration_timeout="1mins" --executor_reregistration_timeout="2secs" --executor_secret_key="/tmp/Endpoint_SlaveEndpointTest_UnauthorizedRequest_1_c5pCgA/executor_secret_key"
--executor_shutdown_grace_period="5secs" --fetcher_cache_dir="/tmp/Endpoint_SlaveEndpointTest_UnauthorizedRequest_1_c5pCgA/fetch"
--fetcher_cache_size="2GB" --frameworks_home="" --gc_delay="1weeks" --gc_disk_headroom="0.1"
--hadoop_home="" --help="false" --hostname_lookup="true" --http_command_executor="false" --http_credentials="/tmp/Endpoint_SlaveEndpointTest_UnauthorizedRequest_1_c5pCgA/http_credentials"
--http_heartbeat_interval="30secs" --initialize_driver_logging="true" --isolation="posix/cpu,posix/mem"
--launcher="posix" --launcher_dir="/mesos/mesos-1.5.0/_build/src" --logbufsecs="0" --logging_level="INFO"
--max_completed_executors_per_framework="150" --oversubscribed_resources_interval="15secs"
--perf_duration="10secs" --perf_interval="1mins" --port="5051" --qos_correction_interval_min="0ns"
--quiet="false" --recover="reconnect" --recovery_timeout="15mins" --registration_backoff_factor="10ms"
--resources="cpus:2;gpus:0;mem:1024;disk:1024;ports:[31000-32000]" --revocable_cpu_low_priority="true"
--runtime_dir="/tmp/Endpoint_SlaveEndpointTest_UnauthorizedRequest_1_c5pCgA" --sandbox_directory="/mnt/mesos/sandbox"
--strict="true" --switch_user="true" --systemd_enable_support="true" --systemd_runtime_directory="/run/systemd/system"
--version="false" --work_dir="/tmp/Endpoint_SlaveEndpointTest_UnauthorizedRequest_1_C3TvtQ"
--zk_session_timeout="10secs"
I1012 08:46:21.932512 12941 credentials.hpp:86] Loading credential for authentication from
'/tmp/Endpoint_SlaveEndpointTest_UnauthorizedRequest_1_c5pCgA/credential'
I1012 08:46:21.932771 12941 slave.cpp:287] Agent using credential for: test-principal
I1012 08:46:21.932796 12941 credentials.hpp:37] Loading credentials for authentication from
'/tmp/Endpoint_SlaveEndpointTest_UnauthorizedRequest_1_c5pCgA/http_credentials'
I1012 08:46:21.933248 12941 http.cpp:1045] Creating default 'basic' HTTP authenticator for
realm 'mesos-agent-executor'
I1012 08:46:21.933476 12941 http.cpp:1066] Creating default 'jwt' HTTP authenticator for realm
'mesos-agent-executor'
I1012 08:46:21.933755 12941 http.cpp:1045] Creating default 'basic' HTTP authenticator for
realm 'mesos-agent-readonly'
I1012 08:46:21.933866 12941 http.cpp:1066] Creating default 'jwt' HTTP authenticator for realm
'mesos-agent-readonly'
I1012 08:46:21.934065 12941 http.cpp:1045] Creating default 'basic' HTTP authenticator for
realm 'mesos-agent-readwrite'
I1012 08:46:21.934173 12941 http.cpp:1066] Creating default 'jwt' HTTP authenticator for realm
'mesos-agent-readwrite'
I1012 08:46:21.936602 12941 slave.cpp:585] Agent resources: [{"name":"cpus","scalar":{"value":2.0},"type":"SCALAR"},{"name":"mem","scalar":{"value":1024.0},"type":"SCALAR"},{"name":"disk","scalar":{"value":1024.0},"type":"SCALAR"},{"name":"ports","ranges":{"range":[{"begin":31000,"end":32000}]},"type":"RANGES"}]
I1012 08:46:21.937060 12941 slave.cpp:593] Agent attributes: [  ]
I1012 08:46:21.937083 12941 slave.cpp:602] Agent hostname: e160db019aaa
I1012 08:46:21.937430 12942 status_update_manager.cpp:177] Pausing sending status updates
I1012 08:46:21.939610 12945 state.cpp:64] Recovering state from '/tmp/Endpoint_SlaveEndpointTest_UnauthorizedRequest_1_C3TvtQ/meta'
I1012 08:46:21.940353 12945 status_update_manager.cpp:203] Recovering status update manager
I1012 08:46:21.940872 12945 containerizer.cpp:648] Recovering containerizer
I1012 08:46:21.943370 12945 provisioner.cpp:416] Provisioner recovery complete
I1012 08:46:21.944378 12945 slave.cpp:6310] Finished recovery
I1012 08:46:21.945562 12945 slave.cpp:6492] Querying resource estimator for oversubscribable
resources
I1012 08:46:21.946249 12941 slave.cpp:6506] Received oversubscribable resources {} from the
resource estimator
I1012 08:46:21.949846 12945 process.cpp:3929] Handling HTTP event for process 'slave(826)'
with path: '/slave(826)/monitor/statistics.json'
I1012 08:46:21.953260 12943 http.cpp:1185] HTTP GET for /slave(826)/monitor/statistics.json
from 172.17.0.2:40048
I1012 08:46:21.953393 12943 http.cpp:976] Authorizing principal 'test-principal' to GET the
'/monitor/statistics.json' endpoint
I1012 08:46:21.956668 12938 slave.cpp:869] Agent terminating
[       OK ] Endpoint/SlaveEndpointTest.UnauthorizedRequest/1 (52 ms)
[ RUN      ] Endpoint/SlaveEndpointTest.UnauthorizedRequest/2
I1012 08:46:21.975890  7714 containerizer.cpp:292] Using isolation { environment_secret, posix/cpu,
posix/mem, filesystem/posix, network/cni }
W1012 08:46:21.977005  7714 backend.cpp:76] Failed to create 'overlay' backend: OverlayBackend
requires root privileges
W1012 08:46:21.977464  7714 backend.cpp:76] Failed to create 'bind' backend: BindBackend requires
root privileges
I1012 08:46:21.977551  7714 provisioner.cpp:255] Using default backend 'copy'
I1012 08:46:21.983696 12939 slave.cpp:254] Mesos agent started on (827)@172.17.0.2:46623
I1012 08:46:21.983742 12939 slave.cpp:255] Flags at startup: --acls="" --appc_simple_discovery_uri_prefix="http://"
--appc_store_dir="/tmp/Endpoint_SlaveEndpointTest_UnauthorizedRequest_2_qssUTx/store/appc"
--authenticate_http_executors="true" --authenticate_http_readonly="true" --authenticate_http_readwrite="true"
--authenticatee="crammd5" --authentication_backoff_factor="1secs" --authorizer="local" --cgroups_cpu_enable_pids_and_tids_count="false"
--cgroups_enable_cfs="false" --cgroups_hierarchy="/sys/fs/cgroup" --cgroups_limit_swap="false"
--cgroups_root="mesos" --container_disk_watch_interval="15secs" --containerizers="mesos" --credential="/tmp/Endpoint_SlaveEndpointTest_UnauthorizedRequest_2_qssUTx/credential"
--default_role="*" --disallow_sharing_agent_pid_namespace="false" --disk_watch_interval="1mins"
--docker="docker" --docker_kill_orphans="true" --docker_registry="https://registry-1.docker.io"
--docker_remove_delay="6hrs" --docker_socket="/var/run/docker.sock" --docker_stop_timeout="0ns"
--docker_store_dir="/tmp/Endpoint_SlaveEndpointTest_UnauthorizedRequest_2_qssUTx/store/docker"
--docker_volume_checkpoint_dir="/var/run/mesos/isolators/docker/volume" --enforce_container_disk_quota="false"
--executor_registration_timeout="1mins" --executor_reregistration_timeout="2secs" --executor_secret_key="/tmp/Endpoint_SlaveEndpointTest_UnauthorizedRequest_2_qssUTx/executor_secret_key"
--executor_shutdown_grace_period="5secs" --fetcher_cache_dir="/tmp/Endpoint_SlaveEndpointTest_UnauthorizedRequest_2_qssUTx/fetch"
--fetcher_cache_size="2GB" --frameworks_home="" --gc_delay="1weeks" --gc_disk_headroom="0.1"
--hadoop_home="" --help="false" --hostname_lookup="true" --http_command_executor="false" --http_credentials="/tmp/Endpoint_SlaveEndpointTest_UnauthorizedRequest_2_qssUTx/http_credentials"
--http_heartbeat_interval="30secs" --initialize_driver_logging="true" --isolation="posix/cpu,posix/mem"
--launcher="posix" --launcher_dir="/mesos/mesos-1.5.0/_build/src" --logbufsecs="0" --logging_level="INFO"
--max_completed_executors_per_framework="150" --oversubscribed_resources_interval="15secs"
--perf_duration="10secs" --perf_interval="1mins" --port="5051" --qos_correction_interval_min="0ns"
--quiet="false" --recover="reconnect" --recovery_timeout="15mins" --registration_backoff_factor="10ms"
--resources="cpus:2;gpus:0;mem:1024;disk:1024;ports:[31000-32000]" --revocable_cpu_low_priority="true"
--runtime_dir="/tmp/Endpoint_SlaveEndpointTest_UnauthorizedRequest_2_qssUTx" --sandbox_directory="/mnt/mesos/sandbox"
--strict="true" --switch_user="true" --systemd_enable_support="true" --systemd_runtime_directory="/run/systemd/system"
--version="false" --work_dir="/tmp/Endpoint_SlaveEndpointTest_UnauthorizedRequest_2_QmsnYN"
--zk_session_timeout="10secs"
I1012 08:46:21.984561 12939 credentials.hpp:86] Loading credential for authentication from
'/tmp/Endpoint_SlaveEndpointTest_UnauthorizedRequest_2_qssUTx/credential'
I1012 08:46:21.984850 12939 slave.cpp:287] Agent using credential for: test-principal
I1012 08:46:21.984889 12939 credentials.hpp:37] Loading credentials for authentication from
'/tmp/Endpoint_SlaveEndpointTest_UnauthorizedRequest_2_qssUTx/http_credentials'
I1012 08:46:21.985437 12939 http.cpp:1045] Creating default 'basic' HTTP authenticator for
realm 'mesos-agent-executor'
I1012 08:46:21.985693 12939 http.cpp:1066] Creating default 'jwt' HTTP authenticator for realm
'mesos-agent-executor'
I1012 08:46:21.986009 12939 http.cpp:1045] Creating default 'basic' HTTP authenticator for
realm 'mesos-agent-readonly'
I1012 08:46:21.986181 12939 http.cpp:1066] Creating default 'jwt' HTTP authenticator for realm
'mesos-agent-readonly'
I1012 08:46:21.986448 12939 http.cpp:1045] Creating default 'basic' HTTP authenticator for
realm 'mesos-agent-readwrite'
I1012 08:46:21.986604 12939 http.cpp:1066] Creating default 'jwt' HTTP authenticator for realm
'mesos-agent-readwrite'
I1012 08:46:21.989104 12939 slave.cpp:585] Agent resources: [{"name":"cpus","scalar":{"value":2.0},"type":"SCALAR"},{"name":"mem","scalar":{"value":1024.0},"type":"SCALAR"},{"name":"disk","scalar":{"value":1024.0},"type":"SCALAR"},{"name":"ports","ranges":{"range":[{"begin":31000,"end":32000}]},"type":"RANGES"}]
I1012 08:46:21.989563 12939 slave.cpp:593] Agent attributes: [  ]
I1012 08:46:21.989586 12939 slave.cpp:602] Agent hostname: e160db019aaa
I1012 08:46:21.989797 12938 status_update_manager.cpp:177] Pausing sending status updates
I1012 08:46:21.992022 12945 state.cpp:64] Recovering state from '/tmp/Endpoint_SlaveEndpointTest_UnauthorizedRequest_2_QmsnYN/meta'
I1012 08:46:21.992905 12945 status_update_manager.cpp:203] Recovering status update manager
I1012 08:46:21.993470 12945 containerizer.cpp:648] Recovering containerizer
I1012 08:46:21.995749 12945 provisioner.cpp:416] Provisioner recovery complete
I1012 08:46:21.996830 12945 slave.cpp:6310] Finished recovery
I1012 08:46:21.997804 12945 slave.cpp:6492] Querying resource estimator for oversubscribable
resources
I1012 08:46:21.998479 12938 slave.cpp:6506] Received oversubscribable resources {} from the
resource estimator
I1012 08:46:22.002053 12939 process.cpp:3929] Handling HTTP event for process 'slave(827)'
with path: '/slave(827)/containers'
I1012 08:46:22.004770 12938 http.cpp:1185] HTTP GET for /slave(827)/containers from 172.17.0.2:40050
I1012 08:46:22.004899 12938 http.cpp:976] Authorizing principal 'test-principal' to GET the
'/containers' endpoint
I1012 08:46:22.008239 12942 slave.cpp:869] Agent terminating
[       OK ] Endpoint/SlaveEndpointTest.UnauthorizedRequest/2 (51 ms)
[ RUN      ] Endpoint/SlaveEndpointTest.NoAuthorizer/0
I1012 08:46:22.027658  7714 containerizer.cpp:292] Using isolation { environment_secret, posix/cpu,
posix/mem, filesystem/posix, network/cni }
W1012 08:46:22.028834  7714 backend.cpp:76] Failed to create 'overlay' backend: OverlayBackend
requires root privileges
W1012 08:46:22.029322  7714 backend.cpp:76] Failed to create 'bind' backend: BindBackend requires
root privileges
I1012 08:46:22.029422  7714 provisioner.cpp:255] Using default backend 'copy'
I1012 08:46:22.032373  7714 cluster.cpp:448] Creating default 'local' authorizer
I1012 08:46:22.036046 12945 slave.cpp:254] Mesos agent started on (828)@172.17.0.2:46623
I1012 08:46:22.036092 12945 slave.cpp:255] Flags at startup: --acls="" --appc_simple_discovery_uri_prefix="http://"
--appc_store_dir="/tmp/Endpoint_SlaveEndpointTest_NoAuthorizer_0_ofQtYu/store/appc" --authenticate_http_executors="true"
--authenticate_http_readonly="true" --authenticate_http_readwrite="true" --authenticatee="crammd5"
--authentication_backoff_factor="1secs" --authorizer="local" --cgroups_cpu_enable_pids_and_tids_count="false"
--cgroups_enable_cfs="false" --cgroups_hierarchy="/sys/fs/cgroup" --cgroups_limit_swap="false"
--cgroups_root="mesos" --container_disk_watch_interval="15secs" --containerizers="mesos" --credential="/tmp/Endpoint_SlaveEndpointTest_NoAuthorizer_0_ofQtYu/credential"
--default_role="*" --disallow_sharing_agent_pid_namespace="false" --disk_watch_interval="1mins"
--docker="docker" --docker_kill_orphans="true" --docker_registry="https://registry-1.docker.io"
--docker_remove_delay="6hrs" --docker_socket="/var/run/docker.sock" --docker_stop_timeout="0ns"
--docker_store_dir="/tmp/Endpoint_SlaveEndpointTest_NoAuthorizer_0_ofQtYu/store/docker" --docker_volume_checkpoint_dir="/var/run/mesos/isolators/docker/volume"
--enforce_container_disk_quota="false" --executor_registration_timeout="1mins" --executor_reregistration_timeout="2secs"
--executor_secret_key="/tmp/Endpoint_SlaveEndpointTest_NoAuthorizer_0_ofQtYu/executor_secret_key"
--executor_shutdown_grace_period="5secs" --fetcher_cache_dir="/tmp/Endpoint_SlaveEndpointTest_NoAuthorizer_0_ofQtYu/fetch"
--fetcher_cache_size="2GB" --frameworks_home="" --gc_delay="1weeks" --gc_disk_headroom="0.1"
--hadoop_home="" --help="false" --hostname_lookup="true" --http_command_executor="false" --http_credentials="/tmp/Endpoint_SlaveEndpointTest_NoAuthorizer_0_ofQtYu/http_credentials"
--http_heartbeat_interval="30secs" --initialize_driver_logging="true" --isolation="posix/cpu,posix/mem"
--launcher="posix" --launcher_dir="/mesos/mesos-1.5.0/_build/src" --logbufsecs="0" --logging_level="INFO"
--max_completed_executors_per_framework="150" --oversubscribed_resources_interval="15secs"
--perf_duration="10secs" --perf_interval="1mins" --port="5051" --qos_correction_interval_min="0ns"
--quiet="false" --recover="reconnect" --recovery_timeout="15mins" --registration_backoff_factor="10ms"
--resources="cpus:2;gpus:0;mem:1024;disk:1024;ports:[31000-32000]" --revocable_cpu_low_priority="true"
--runtime_dir="/tmp/Endpoint_SlaveEndpointTest_NoAuthorizer_0_ofQtYu" --sandbox_directory="/mnt/mesos/sandbox"
--strict="true" --switch_user="true" --systemd_enable_support="true" --systemd_runtime_directory="/run/systemd/system"
--version="false" --work_dir="/tmp/Endpoint_SlaveEndpointTest_NoAuthorizer_0_GrfDUK" --zk_session_timeout="10secs"
I1012 08:46:22.037091 12945 credentials.hpp:86] Loading credential for authentication from
'/tmp/Endpoint_SlaveEndpointTest_NoAuthorizer_0_ofQtYu/credential'
I1012 08:46:22.038018 12945 slave.cpp:287] Agent using credential for: test-principal
I1012 08:46:22.038094 12945 credentials.hpp:37] Loading credentials for authentication from
'/tmp/Endpoint_SlaveEndpointTest_NoAuthorizer_0_ofQtYu/http_credentials'
I1012 08:46:22.038775 12945 http.cpp:1045] Creating default 'basic' HTTP authenticator for
realm 'mesos-agent-executor'
I1012 08:46:22.039171 12945 http.cpp:1066] Creating default 'jwt' HTTP authenticator for realm
'mesos-agent-executor'
I1012 08:46:22.039677 12945 http.cpp:1045] Creating default 'basic' HTTP authenticator for
realm 'mesos-agent-readonly'
I1012 08:46:22.039997 12945 http.cpp:1066] Creating default 'jwt' HTTP authenticator for realm
'mesos-agent-readonly'
I1012 08:46:22.040485 12945 http.cpp:1045] Creating default 'basic' HTTP authenticator for
realm 'mesos-agent-readwrite'
I1012 08:46:22.040802 12945 http.cpp:1066] Creating default 'jwt' HTTP authenticator for realm
'mesos-agent-readwrite'
I1012 08:46:22.043650 12945 slave.cpp:585] Agent resources: [{"name":"cpus","scalar":{"value":2.0},"type":"SCALAR"},{"name":"mem","scalar":{"value":1024.0},"type":"SCALAR"},{"name":"disk","scalar":{"value":1024.0},"type":"SCALAR"},{"name":"ports","ranges":{"range":[{"begin":31000,"end":32000}]},"type":"RANGES"}]
I1012 08:46:22.044211 12945 slave.cpp:593] Agent attributes: [  ]
I1012 08:46:22.044450 12945 slave.cpp:602] Agent hostname: e160db019aaa
I1012 08:46:22.044847 12942 status_update_manager.cpp:177] Pausing sending status updates
I1012 08:46:22.047857 12945 state.cpp:64] Recovering state from '/tmp/Endpoint_SlaveEndpointTest_NoAuthorizer_0_GrfDUK/meta'
I1012 08:46:22.048534 12944 status_update_manager.cpp:203] Recovering status update manager
I1012 08:46:22.049008 12940 containerizer.cpp:648] Recovering containerizer
I1012 08:46:22.051306 12942 provisioner.cpp:416] Provisioner recovery complete
I1012 08:46:22.052325 12942 slave.cpp:6310] Finished recovery
I1012 08:46:22.053426 12942 slave.cpp:6492] Querying resource estimator for oversubscribable
resources
I1012 08:46:22.054301 12938 slave.cpp:6506] Received oversubscribable resources {} from the
resource estimator
I1012 08:46:22.058569 12944 process.cpp:3929] Handling HTTP event for process 'slave(828)'
with path: '/slave(828)/monitor/statistics'
I1012 08:46:22.062187 12944 http.cpp:1185] HTTP GET for /slave(828)/monitor/statistics from
172.17.0.2:40052
I1012 08:46:22.062573 12944 http.cpp:976] Authorizing principal 'test-principal' to GET the
'/monitor/statistics' endpoint
I1012 08:46:22.069357 12941 slave.cpp:869] Agent terminating
[       OK ] Endpoint/SlaveEndpointTest.NoAuthorizer/0 (61 ms)
[ RUN      ] Endpoint/SlaveEndpointTest.NoAuthorizer/1
I1012 08:46:22.093864  7714 containerizer.cpp:292] Using isolation { environment_secret, posix/cpu,
posix/mem, filesystem/posix, network/cni }
W1012 08:46:22.094786  7714 backend.cpp:76] Failed to create 'overlay' backend: OverlayBackend
requires root privileges
W1012 08:46:22.095243  7714 backend.cpp:76] Failed to create 'bind' backend: BindBackend requires
root privileges
I1012 08:46:22.095474  7714 provisioner.cpp:255] Using default backend 'copy'
I1012 08:46:22.099242  7714 cluster.cpp:448] Creating default 'local' authorizer
I1012 08:46:22.103320 12942 slave.cpp:254] Mesos agent started on (829)@172.17.0.2:46623
I1012 08:46:22.103368 12942 slave.cpp:255] Flags at startup: --acls="" --appc_simple_discovery_uri_prefix="http://"
--appc_store_dir="/tmp/Endpoint_SlaveEndpointTest_NoAuthorizer_1_WoWENt/store/appc" --authenticate_http_executors="true"
--authenticate_http_readonly="true" --authenticate_http_readwrite="true" --authenticatee="crammd5"
--authentication_backoff_factor="1secs" --authorizer="local" --cgroups_cpu_enable_pids_and_tids_count="false"
--cgroups_enable_cfs="false" --cgroups_hierarchy="/sys/fs/cgroup" --cgroups_limit_swap="false"
--cgroups_root="mesos" --container_disk_watch_interval="15secs" --containerizers="mesos" --credential="/tmp/Endpoint_SlaveEndpointTest_NoAuthorizer_1_WoWENt/credential"
--default_role="*" --disallow_sharing_agent_pid_namespace="false" --disk_watch_interval="1mins"
--docker="docker" --docker_kill_orphans="true" --docker_registry="https://registry-1.docker.io"
--docker_remove_delay="6hrs" --docker_socket="/var/run/docker.sock" --docker_stop_timeout="0ns"
--docker_store_dir="/tmp/Endpoint_SlaveEndpointTest_NoAuthorizer_1_WoWENt/store/docker" --docker_volume_checkpoint_dir="/var/run/mesos/isolators/docker/volume"
--enforce_container_disk_quota="false" --executor_registration_timeout="1mins" --executor_reregistration_timeout="2secs"
--executor_secret_key="/tmp/Endpoint_SlaveEndpointTest_NoAuthorizer_1_WoWENt/executor_secret_key"
--executor_shutdown_grace_period="5secs" --fetcher_cache_dir="/tmp/Endpoint_SlaveEndpointTest_NoAuthorizer_1_WoWENt/fetch"
--fetcher_cache_size="2GB" --frameworks_home="" --gc_delay="1weeks" --gc_disk_headroom="0.1"
--hadoop_home="" --help="false" --hostname_lookup="true" --http_command_executor="false" --http_credentials="/tmp/Endpoint_SlaveEndpointTest_NoAuthorizer_1_WoWENt/http_credentials"
--http_heartbeat_interval="30secs" --initialize_driver_logging="true" --isolation="posix/cpu,posix/mem"
--launcher="posix" --launcher_dir="/mesos/mesos-1.5.0/_build/src" --logbufsecs="0" --logging_level="INFO"
--max_completed_executors_per_framework="150" --oversubscribed_resources_interval="15secs"
--perf_duration="10secs" --perf_interval="1mins" --port="5051" --qos_correction_interval_min="0ns"
--quiet="false" --recover="reconnect" --recovery_timeout="15mins" --registration_backoff_factor="10ms"
--resources="cpus:2;gpus:0;mem:1024;disk:1024;ports:[31000-32000]" --revocable_cpu_low_priority="true"
--runtime_dir="/tmp/Endpoint_SlaveEndpointTest_NoAuthorizer_1_WoWENt" --sandbox_directory="/mnt/mesos/sandbox"
--strict="true" --switch_user="true" --systemd_enable_support="true" --systemd_runtime_directory="/run/systemd/system"
--version="false" --work_dir="/tmp/Endpoint_SlaveEndpointTest_NoAuthorizer_1_YUH6yJ" --zk_session_timeout="10secs"
I1012 08:46:22.104634 12942 credentials.hpp:86] Loading credential for authentication from
'/tmp/Endpoint_SlaveEndpointTest_NoAuthorizer_1_WoWENt/credential'
I1012 08:46:22.105583 12942 slave.cpp:287] Agent using credential for: test-principal
I1012 08:46:22.105638 12942 credentials.hpp:37] Loading credentials for authentication from
'/tmp/Endpoint_SlaveEndpointTest_NoAuthorizer_1_WoWENt/http_credentials'
I1012 08:46:22.106813 12942 http.cpp:1045] Creating default 'basic' HTTP authenticator for
realm 'mesos-agent-executor'
I1012 08:46:22.107669 12942 http.cpp:1066] Creating default 'jwt' HTTP authenticator for realm
'mesos-agent-executor'
I1012 08:46:22.108324 12942 http.cpp:1045] Creating default 'basic' HTTP authenticator for
realm 'mesos-agent-readonly'
I1012 08:46:22.109318 12942 http.cpp:1066] Creating default 'jwt' HTTP authenticator for realm
'mesos-agent-readonly'
I1012 08:46:22.110273 12942 http.cpp:1045] Creating default 'basic' HTTP authenticator for
realm 'mesos-agent-readwrite'
I1012 08:46:22.111096 12942 http.cpp:1066] Creating default 'jwt' HTTP authenticator for realm
'mesos-agent-readwrite'
I1012 08:46:22.114534 12942 slave.cpp:585] Agent resources: [{"name":"cpus","scalar":{"value":2.0},"type":"SCALAR"},{"name":"mem","scalar":{"value":1024.0},"type":"SCALAR"},{"name":"disk","scalar":{"value":1024.0},"type":"SCALAR"},{"name":"ports","ranges":{"range":[{"begin":31000,"end":32000}]},"type":"RANGES"}]
I1012 08:46:22.115051 12942 slave.cpp:593] Agent attributes: [  ]
I1012 08:46:22.115721 12942 slave.cpp:602] Agent hostname: e160db019aaa
I1012 08:46:22.116760 12938 status_update_manager.cpp:177] Pausing sending status updates
I1012 08:46:22.120410 12941 state.cpp:64] Recovering state from '/tmp/Endpoint_SlaveEndpointTest_NoAuthorizer_1_YUH6yJ/meta'
I1012 08:46:22.120959 12941 status_update_manager.cpp:203] Recovering status update manager
I1012 08:46:22.121369 12940 containerizer.cpp:648] Recovering containerizer
I1012 08:46:22.123736 12939 provisioner.cpp:416] Provisioner recovery complete
I1012 08:46:22.124887 12940 slave.cpp:6310] Finished recovery
I1012 08:46:22.125560 12940 slave.cpp:6492] Querying resource estimator for oversubscribable
resources
I1012 08:46:22.125988 12944 slave.cpp:6506] Received oversubscribable resources {} from the
resource estimator
I1012 08:46:22.130036 12943 process.cpp:3929] Handling HTTP event for process 'slave(829)'
with path: '/slave(829)/monitor/statistics.json'
I1012 08:46:22.133312 12943 http.cpp:1185] HTTP GET for /slave(829)/monitor/statistics.json
from 172.17.0.2:40054
I1012 08:46:22.133448 12943 http.cpp:976] Authorizing principal 'test-principal' to GET the
'/monitor/statistics.json' endpoint
I1012 08:46:22.137848 12941 slave.cpp:869] Agent terminating
[       OK ] Endpoint/SlaveEndpointTest.NoAuthorizer/1 (77 ms)
[ RUN      ] Endpoint/SlaveEndpointTest.NoAuthorizer/2
I1012 08:46:22.169498  7714 containerizer.cpp:292] Using isolation { environment_secret, posix/cpu,
posix/mem, filesystem/posix, network/cni }
W1012 08:46:22.170404  7714 backend.cpp:76] Failed to create 'overlay' backend: OverlayBackend
requires root privileges
W1012 08:46:22.170711  7714 backend.cpp:76] Failed to create 'bind' backend: BindBackend requires
root privileges
I1012 08:46:22.170812  7714 provisioner.cpp:255] Using default backend 'copy'
I1012 08:46:22.174587  7714 cluster.cpp:448] Creating default 'local' authorizer
I1012 08:46:22.178396 12942 slave.cpp:254] Mesos agent started on (830)@172.17.0.2:46623
I1012 08:46:22.178442 12942 slave.cpp:255] Flags at startup: --acls="" --appc_simple_discovery_uri_prefix="http://"
--appc_store_dir="/tmp/Endpoint_SlaveEndpointTest_NoAuthorizer_2_qyZjpt/store/appc" --authenticate_http_executors="true"
--authenticate_http_readonly="true" --authenticate_http_readwrite="true" --authenticatee="crammd5"
--authentication_backoff_factor="1secs" --authorizer="local" --cgroups_cpu_enable_pids_and_tids_count="false"
--cgroups_enable_cfs="false" --cgroups_hierarchy="/sys/fs/cgroup" --cgroups_limit_swap="false"
--cgroups_root="mesos" --container_disk_watch_interval="15secs" --containerizers="mesos" --credential="/tmp/Endpoint_SlaveEndpointTest_NoAuthorizer_2_qyZjpt/credential"
--default_role="*" --disallow_sharing_agent_pid_namespace="false" --disk_watch_interval="1mins"
--docker="docker" --docker_kill_orphans="true" --docker_registry="https://registry-1.docker.io"
--docker_remove_delay="6hrs" --docker_socket="/var/run/docker.sock" --docker_stop_timeout="0ns"
--docker_store_dir="/tmp/Endpoint_SlaveEndpointTest_NoAuthorizer_2_qyZjpt/store/docker" --docker_volume_checkpoint_dir="/var/run/mesos/isolators/docker/volume"
--enforce_container_disk_quota="false" --executor_registration_timeout="1mins" --executor_reregistration_timeout="2secs"
--executor_secret_key="/tmp/Endpoint_SlaveEndpointTest_NoAuthorizer_2_qyZjpt/executor_secret_key"
--executor_shutdown_grace_period="5secs" --fetcher_cache_dir="/tmp/Endpoint_SlaveEndpointTest_NoAuthorizer_2_qyZjpt/fetch"
--fetcher_cache_size="2GB" --frameworks_home="" --gc_delay="1weeks" --gc_disk_headroom="0.1"
--hadoop_home="" --help="false" --hostname_lookup="true" --http_command_executor="false" --http_credentials="/tmp/Endpoint_SlaveEndpointTest_NoAuthorizer_2_qyZjpt/http_credentials"
--http_heartbeat_interval="30secs" --initialize_driver_logging="true" --isolation="posix/cpu,posix/mem"
--launcher="posix" --launcher_dir="/mesos/mesos-1.5.0/_build/src" --logbufsecs="0" --logging_level="INFO"
--max_completed_executors_per_framework="150" --oversubscribed_resources_interval="15secs"
--perf_duration="10secs" --perf_interval="1mins" --port="5051" --qos_correction_interval_min="0ns"
--quiet="false" --recover="reconnect" --recovery_timeout="15mins" --registration_backoff_factor="10ms"
--resources="cpus:2;gpus:0;mem:1024;disk:1024;ports:[31000-32000]" --revocable_cpu_low_priority="true"
--runtime_dir="/tmp/Endpoint_SlaveEndpointTest_NoAuthorizer_2_qyZjpt" --sandbox_directory="/mnt/mesos/sandbox"
--strict="true" --switch_user="true" --systemd_enable_support="true" --systemd_runtime_directory="/run/systemd/system"
--version="false" --work_dir="/tmp/Endpoint_SlaveEndpointTest_NoAuthorizer_2_kW0FYI" --zk_session_timeout="10secs"
I1012 08:46:22.179405 12942 credentials.hpp:86] Loading credential for authentication from
'/tmp/Endpoint_SlaveEndpointTest_NoAuthorizer_2_qyZjpt/credential'
I1012 08:46:22.179924 12942 slave.cpp:287] Agent using credential for: test-principal
I1012 08:46:22.179955 12942 credentials.hpp:37] Loading credentials for authentication from
'/tmp/Endpoint_SlaveEndpointTest_NoAuthorizer_2_qyZjpt/http_credentials'
I1012 08:46:22.180481 12942 http.cpp:1045] Creating default 'basic' HTTP authenticator for
realm 'mesos-agent-executor'
I1012 08:46:22.181093 12942 http.cpp:1066] Creating default 'jwt' HTTP authenticator for realm
'mesos-agent-executor'
I1012 08:46:22.181669 12942 http.cpp:1045] Creating default 'basic' HTTP authenticator for
realm 'mesos-agent-readonly'
I1012 08:46:22.182005 12942 http.cpp:1066] Creating default 'jwt' HTTP authenticator for realm
'mesos-agent-readonly'
I1012 08:46:22.182673 12942 http.cpp:1045] Creating default 'basic' HTTP authenticator for
realm 'mesos-agent-readwrite'
I1012 08:46:22.183256 12942 http.cpp:1066] Creating default 'jwt' HTTP authenticator for realm
'mesos-agent-readwrite'
I1012 08:46:22.186202 12942 slave.cpp:585] Agent resources: [{"name":"cpus","scalar":{"value":2.0},"type":"SCALAR"},{"name":"mem","scalar":{"value":1024.0},"type":"SCALAR"},{"name":"disk","scalar":{"value":1024.0},"type":"SCALAR"},{"name":"ports","ranges":{"range":[{"begin":31000,"end":32000}]},"type":"RANGES"}]
I1012 08:46:22.186666 12942 slave.cpp:593] Agent attributes: [  ]
I1012 08:46:22.187080 12942 slave.cpp:602] Agent hostname: e160db019aaa
I1012 08:46:22.187856 12941 status_update_manager.cpp:177] Pausing sending status updates
I1012 08:46:22.190404 12939 state.cpp:64] Recovering state from '/tmp/Endpoint_SlaveEndpointTest_NoAuthorizer_2_kW0FYI/meta'
I1012 08:46:22.190954 12941 status_update_manager.cpp:203] Recovering status update manager
I1012 08:46:22.191269 12940 containerizer.cpp:648] Recovering containerizer
I1012 08:46:22.193620 12939 provisioner.cpp:416] Provisioner recovery complete
I1012 08:46:22.194154 12940 slave.cpp:6310] Finished recovery
I1012 08:46:22.195001 12940 slave.cpp:6492] Querying resource estimator for oversubscribable
resources
I1012 08:46:22.195416 12943 slave.cpp:6506] Received oversubscribable resources {} from the
resource estimator
I1012 08:46:22.198983 12940 process.cpp:3929] Handling HTTP event for process 'slave(830)'
with path: '/slave(830)/containers'
I1012 08:46:22.202278 12944 http.cpp:1185] HTTP GET for /slave(830)/containers from 172.17.0.2:40058
I1012 08:46:22.202407 12944 http.cpp:976] Authorizing principal 'test-principal' to GET the
'/containers' endpoint
I1012 08:46:22.208775 12945 slave.cpp:869] Agent terminating
[       OK ] Endpoint/SlaveEndpointTest.NoAuthorizer/2 (73 ms)
[----------] 9 tests from Endpoint/SlaveEndpointTest (565 ms total)

[----------] 2 tests from ContainerizerType/DefaultContainerDNSFlagTest
[ RUN      ] ContainerizerType/DefaultContainerDNSFlagTest.ValidateFlag/0
[       OK ] ContainerizerType/DefaultContainerDNSFlagTest.ValidateFlag/0 (20 ms)
[ RUN      ] ContainerizerType/DefaultContainerDNSFlagTest.ValidateFlag/1
[       OK ] ContainerizerType/DefaultContainerDNSFlagTest.ValidateFlag/1 (24 ms)
[----------] 2 tests from ContainerizerType/DefaultContainerDNSFlagTest (44 ms total)

[----------] Global test environment tear-down
[==========] 1700 tests from 187 test cases ran. (617321 ms total)
[  PASSED  ] 1699 tests.
[  FAILED  ] 1 test, listed below:
[  FAILED  ] ContentType/AgentAPIStreamingTest.AttachInputToNestedContainerSession/0, where
GetParam() = application/x-protobuf

 1 FAILED TEST
  YOU HAVE 21 DISABLED TESTS

I1012 08:46:22.433746 12946 process.cpp:1068] Failed to accept socket: future discarded
make[4]: *** [check-local] Error 1
make[4]: Leaving directory `/mesos/mesos-1.5.0/_build/src'
make[3]: *** [check-am] Error 2
make[3]: Leaving directory `/mesos/mesos-1.5.0/_build/src'
make[2]: *** [check] Error 2
make[2]: Leaving directory `/mesos/mesos-1.5.0/_build/src'
make[1]: *** [check-recursive] Error 1
make[1]: Leaving directory `/mesos/mesos-1.5.0/_build'
make: *** [distcheck] Error 1
+ docker rmi mesos-1507792770-9060
Untagged: mesos-1507792770-9060:latest
Deleted: sha256:e96bb6bedc14818c8bde5c2d9542e068ea00aa603dc421284a948a7fa59a8663
Deleted: sha256:6feecac50eb1e0fcedfdf3267f88002e0fe8c59095d414ffd96106aa8c72e66e
Deleted: sha256:907e1ebcbcfdeb2a3b242488ba9af81817123d3663fb90b44d0032d7256e8862
Deleted: sha256:94c0bc8ad87a0cc2588dac2f83a4f5bd2ff309fdb36630adb434bf1bf52bf6d4
Deleted: sha256:48fa0b56943d80867426f9906230f2af2eee35abf48c17ac49ddae0114c1615d
Deleted: sha256:bfb8c5e921047d2d0f95201cf15ffcda2cf07be676fd820dffda09c610224700
Deleted: sha256:26a3a58652c2c474e3941b6001ee55c63286ee262d2d0879f42c9a1a4ddfe1c9
Deleted: sha256:b904dd8d80b8490fa740190c0a078b4cc859c13194a20cbf32673f1209517c6b
Deleted: sha256:9f48066c0305a2158b56e6351c5d6573a46cecb6cbbcf40e87069724784f7093
Deleted: sha256:01836b4230437b425c872bdc4d02f35a652f0bf76fb652571eeb32aabf34b879
Deleted: sha256:5b3460f6850bd7aa84c79e3f78f25f169a6e9619d43fe183ba381fb105f7e37c
Deleted: sha256:8cba233a10072c7f571ed8ec90b084c633835f350e646828820044e2f4f18d19
Deleted: sha256:21aa824894386ff40a71efeafddd77c701b8a2b985a5911c17ceececaf6c920e
Deleted: sha256:79135e1445d205ec187b9951bac24a039106e943f33bdaaff3157099b1efa82e
Deleted: sha256:9d1e3e1ffc39cb4b6e6f989ca8086f518a2ab55ca8609ef040e22f0db4e143fc
Deleted: sha256:ed790b78d9e6d6569572d692740f23bab7dd13793adc5ebaa974e6b9cd253445
Deleted: sha256:7702fbfb4b70b91d8aba3fdfea4906e86af1922faa706b7a24442283eaea8144
Deleted: sha256:0e939f365eb5a88a7f49b25b94f39cc0d5a79a29377872c6c6fb9ba6c2d45ddd
Deleted: sha256:88e1d504dddb416820269a364086c40dadc42084276340fa83cf57d66c98ecc5
Deleted: sha256:a77644dc9a1c3c0ba7de09ddf817e92cdf5af25d2586db52ec48e0ebd78dc3e4
Deleted: sha256:9bde28faad613ebb2d8982e2a4bb056162000d8cf5e00ae627488d4a59a6c458
Deleted: sha256:f893b307c688fd02e3e494f49fbcc7ab618c767f21cf3f8a15f27f9a336dd8bf
Deleted: sha256:0bc292bebb824b24e2edad639ff976fa170f7dc15ae8341918f9a32bce21c1b2
Deleted: sha256:9efe58cc8bef7874ab23f76c20799504e22475071b725d419e787db738901398
Deleted: sha256:2ff8a3db652013d1f411486670879d59f469ea5ba5d1b874436a5d763d9aa9b3
Deleted: sha256:65633eb90c0ffb36c0935fbe13f414fe1c717148f9b09bcb9a096bf08e8247ec
Deleted: sha256:500b84c127c67f63e938875f8db882784e181cb53702f5b4d3d4179d452e75c6
Deleted: sha256:95682d05a1fdd7f6d8a78e3eb261905f295a9141adf5ba2465932f6106ac3c67
Deleted: sha256:099b165ce82fa1a5e87cd747e8330df48c59b2dd42b6a8639423b5b5b2ef4294
Build step 'Execute shell' marked build as failure


Mime
View raw message