mesos-builds mailing list archives

Site index · List index
Message view « Date » · « Thread »
Top « Date » · « Thread »
From Apache Jenkins Server <jenk...@builds.apache.org>
Subject Build failed in Jenkins: Mesos-Reviewbot #19646
Date Mon, 02 Oct 2017 16:44:16 GMT
See <https://builds.apache.org/job/Mesos-Reviewbot/19646/display/redirect>

------------------------------------------
[...truncated 31.99 MB...]
I1002 16:44:10.122903  5815 credentials.hpp:37] Loading credentials for authentication from
'/tmp/Endpoint_SlaveEndpointTest_AuthorizedRequest_2_2lZb04/http_credentials'
I1002 16:44:10.123132  5815 http.cpp:1045] Creating default 'basic' HTTP authenticator for
realm 'mesos-agent-readonly'
I1002 16:44:10.123289  5815 http.cpp:1045] Creating default 'basic' HTTP authenticator for
realm 'mesos-agent-readwrite'
I1002 16:44:10.124642  5815 slave.cpp:585] Agent resources: [{"name":"cpus","scalar":{"value":2.0},"type":"SCALAR"},{"name":"mem","scalar":{"value":1024.0},"type":"SCALAR"},{"name":"disk","scalar":{"value":1024.0},"type":"SCALAR"},{"name":"ports","ranges":{"range":[{"begin":31000,"end":32000}]},"type":"RANGES"}]
I1002 16:44:10.124862  5815 slave.cpp:593] Agent attributes: [  ]
I1002 16:44:10.124876  5815 slave.cpp:602] Agent hostname: f96be2ba668f
I1002 16:44:10.125061  5803 status_update_manager.cpp:177] Pausing sending status updates
I1002 16:44:10.126348  5806 state.cpp:64] Recovering state from '/tmp/Endpoint_SlaveEndpointTest_AuthorizedRequest_2_EbGJgd/meta'
I1002 16:44:10.126639  5798 status_update_manager.cpp:203] Recovering status update manager
I1002 16:44:10.126871  5798 containerizer.cpp:648] Recovering containerizer
I1002 16:44:10.128298  5797 provisioner.cpp:416] Provisioner recovery complete
I1002 16:44:10.128816  5811 slave.cpp:6313] Finished recovery
I1002 16:44:10.129252  5811 slave.cpp:6495] Querying resource estimator for oversubscribable
resources
I1002 16:44:10.129513  5820 slave.cpp:6509] Received oversubscribable resources {} from the
resource estimator
I1002 16:44:10.131717  5804 process.cpp:3929] Handling HTTP event for process 'slave(820)'
with path: '/slave(820)/containers'
I1002 16:44:10.133463  5799 http.cpp:1185] HTTP GET for /slave(820)/containers from 172.17.0.2:47106
I1002 16:44:10.133543  5799 http.cpp:976] Authorizing principal 'test-principal' to GET the
'/containers' endpoint
I1002 16:44:10.137692  5778 slave.cpp:869] Agent terminating
[       OK ] Endpoint/SlaveEndpointTest.AuthorizedRequest/2 (31 ms)
[ RUN      ] Endpoint/SlaveEndpointTest.UnauthorizedRequest/0
I1002 16:44:10.148707  5778 containerizer.cpp:292] Using isolation { environment_secret, posix/cpu,
posix/mem, filesystem/posix, network/cni }
W1002 16:44:10.149173  5778 backend.cpp:76] Failed to create 'aufs' backend: AufsBackend requires
root privileges
W1002 16:44:10.149273  5778 backend.cpp:76] Failed to create 'bind' backend: BindBackend requires
root privileges
I1002 16:44:10.149304  5778 provisioner.cpp:255] Using default backend 'copy'
I1002 16:44:10.152823  5805 slave.cpp:254] Mesos agent started on (821)@172.17.0.2:42511
I1002 16:44:10.152849  5805 slave.cpp:255] Flags at startup: --acls="" --appc_simple_discovery_uri_prefix="http://"
--appc_store_dir="/tmp/Endpoint_SlaveEndpointTest_UnauthorizedRequest_0_6u2Fby/store/appc"
--authenticate_http_readonly="true" --authenticate_http_readwrite="true" --authenticatee="crammd5"
--authentication_backoff_factor="1secs" --authorizer="local" --cgroups_cpu_enable_pids_and_tids_count="false"
--cgroups_enable_cfs="false" --cgroups_hierarchy="/sys/fs/cgroup" --cgroups_limit_swap="false"
--cgroups_root="mesos" --container_disk_watch_interval="15secs" --containerizers="mesos" --credential="/tmp/Endpoint_SlaveEndpointTest_UnauthorizedRequest_0_6u2Fby/credential"
--default_role="*" --disallow_sharing_agent_pid_namespace="false" --disk_watch_interval="1mins"
--docker="docker" --docker_kill_orphans="true" --docker_registry="https://registry-1.docker.io"
--docker_remove_delay="6hrs" --docker_socket="/var/run/docker.sock" --docker_stop_timeout="0ns"
--docker_store_dir="/tmp/Endpoint_SlaveEndpointTest_UnauthorizedRequest_0_6u2Fby/store/docker"
--docker_volume_checkpoint_dir="/var/run/mesos/isolators/docker/volume" --enforce_container_disk_quota="false"
--executor_registration_timeout="1mins" --executor_reregistration_timeout="2secs" --executor_shutdown_grace_period="5secs"
--fetcher_cache_dir="/tmp/Endpoint_SlaveEndpointTest_UnauthorizedRequest_0_6u2Fby/fetch" --fetcher_cache_size="2GB"
--frameworks_home="" --gc_delay="1weeks" --gc_disk_headroom="0.1" --hadoop_home="" --help="false"
--hostname_lookup="true" --http_command_executor="false" --http_credentials="/tmp/Endpoint_SlaveEndpointTest_UnauthorizedRequest_0_6u2Fby/http_credentials"
--http_heartbeat_interval="30secs" --initialize_driver_logging="true" --isolation="posix/cpu,posix/mem"
--launcher="posix" --launcher_dir="/mesos/mesos-1.5.0/_build/src" --logbufsecs="0" --logging_level="INFO"
--max_completed_executors_per_framework="150" --oversubscribed_resources_interval="15secs"
--perf_duration="10secs" --perf_interval="1mins" --port="5051" --qos_correction_interval_min="0ns"
--quiet="false" --recover="reconnect" --recovery_timeout="15mins" --registration_backoff_factor="10ms"
--resources="cpus:2;gpus:0;mem:1024;disk:1024;ports:[31000-32000]" --revocable_cpu_low_priority="true"
--runtime_dir="/tmp/Endpoint_SlaveEndpointTest_UnauthorizedRequest_0_6u2Fby" --sandbox_directory="/mnt/mesos/sandbox"
--strict="true" --switch_user="true" --systemd_enable_support="true" --systemd_runtime_directory="/run/systemd/system"
--version="false" --work_dir="/tmp/Endpoint_SlaveEndpointTest_UnauthorizedRequest_0_2C8AnG"
--zk_session_timeout="10secs"
I1002 16:44:10.153223  5805 credentials.hpp:86] Loading credential for authentication from
'/tmp/Endpoint_SlaveEndpointTest_UnauthorizedRequest_0_6u2Fby/credential'
I1002 16:44:10.153367  5805 slave.cpp:287] Agent using credential for: test-principal
I1002 16:44:10.153388  5805 credentials.hpp:37] Loading credentials for authentication from
'/tmp/Endpoint_SlaveEndpointTest_UnauthorizedRequest_0_6u2Fby/http_credentials'
I1002 16:44:10.153611  5805 http.cpp:1045] Creating default 'basic' HTTP authenticator for
realm 'mesos-agent-readonly'
I1002 16:44:10.153759  5805 http.cpp:1045] Creating default 'basic' HTTP authenticator for
realm 'mesos-agent-readwrite'
I1002 16:44:10.155117  5805 slave.cpp:585] Agent resources: [{"name":"cpus","scalar":{"value":2.0},"type":"SCALAR"},{"name":"mem","scalar":{"value":1024.0},"type":"SCALAR"},{"name":"disk","scalar":{"value":1024.0},"type":"SCALAR"},{"name":"ports","ranges":{"range":[{"begin":31000,"end":32000}]},"type":"RANGES"}]
I1002 16:44:10.155336  5805 slave.cpp:593] Agent attributes: [  ]
I1002 16:44:10.155350  5805 slave.cpp:602] Agent hostname: f96be2ba668f
I1002 16:44:10.155534  5818 status_update_manager.cpp:177] Pausing sending status updates
I1002 16:44:10.156791  5815 state.cpp:64] Recovering state from '/tmp/Endpoint_SlaveEndpointTest_UnauthorizedRequest_0_2C8AnG/meta'
I1002 16:44:10.157111  5809 status_update_manager.cpp:203] Recovering status update manager
I1002 16:44:10.157282  5806 containerizer.cpp:648] Recovering containerizer
I1002 16:44:10.158936  5817 provisioner.cpp:416] Provisioner recovery complete
I1002 16:44:10.159458  5811 slave.cpp:6313] Finished recovery
I1002 16:44:10.160058  5811 slave.cpp:6495] Querying resource estimator for oversubscribable
resources
I1002 16:44:10.160358  5804 slave.cpp:6509] Received oversubscribable resources {} from the
resource estimator
I1002 16:44:10.162997  5797 process.cpp:3929] Handling HTTP event for process 'slave(821)'
with path: '/slave(821)/monitor/statistics'
I1002 16:44:10.164271  5810 http.cpp:1185] HTTP GET for /slave(821)/monitor/statistics from
172.17.0.2:47108
I1002 16:44:10.164345  5810 http.cpp:976] Authorizing principal 'test-principal' to GET the
'/monitor/statistics' endpoint
I1002 16:44:10.166321  5778 slave.cpp:869] Agent terminating
[       OK ] Endpoint/SlaveEndpointTest.UnauthorizedRequest/0 (29 ms)
[ RUN      ] Endpoint/SlaveEndpointTest.UnauthorizedRequest/1
I1002 16:44:10.182735  5778 containerizer.cpp:292] Using isolation { environment_secret, posix/cpu,
posix/mem, filesystem/posix, network/cni }
W1002 16:44:10.183431  5778 backend.cpp:76] Failed to create 'aufs' backend: AufsBackend requires
root privileges
W1002 16:44:10.183583  5778 backend.cpp:76] Failed to create 'bind' backend: BindBackend requires
root privileges
I1002 16:44:10.183640  5778 provisioner.cpp:255] Using default backend 'copy'
I1002 16:44:10.188647  5812 slave.cpp:254] Mesos agent started on (822)@172.17.0.2:42511
I1002 16:44:10.188673  5812 slave.cpp:255] Flags at startup: --acls="" --appc_simple_discovery_uri_prefix="http://"
--appc_store_dir="/tmp/Endpoint_SlaveEndpointTest_UnauthorizedRequest_1_IbVKF1/store/appc"
--authenticate_http_readonly="true" --authenticate_http_readwrite="true" --authenticatee="crammd5"
--authentication_backoff_factor="1secs" --authorizer="local" --cgroups_cpu_enable_pids_and_tids_count="false"
--cgroups_enable_cfs="false" --cgroups_hierarchy="/sys/fs/cgroup" --cgroups_limit_swap="false"
--cgroups_root="mesos" --container_disk_watch_interval="15secs" --containerizers="mesos" --credential="/tmp/Endpoint_SlaveEndpointTest_UnauthorizedRequest_1_IbVKF1/credential"
--default_role="*" --disallow_sharing_agent_pid_namespace="false" --disk_watch_interval="1mins"
--docker="docker" --docker_kill_orphans="true" --docker_registry="https://registry-1.docker.io"
--docker_remove_delay="6hrs" --docker_socket="/var/run/docker.sock" --docker_stop_timeout="0ns"
--docker_store_dir="/tmp/Endpoint_SlaveEndpointTest_UnauthorizedRequest_1_IbVKF1/store/docker"
--docker_volume_checkpoint_dir="/var/run/mesos/isolators/docker/volume" --enforce_container_disk_quota="false"
--executor_registration_timeout="1mins" --executor_reregistration_timeout="2secs" --executor_shutdown_grace_period="5secs"
--fetcher_cache_dir="/tmp/Endpoint_SlaveEndpointTest_UnauthorizedRequest_1_IbVKF1/fetch" --fetcher_cache_size="2GB"
--frameworks_home="" --gc_delay="1weeks" --gc_disk_headroom="0.1" --hadoop_home="" --help="false"
--hostname_lookup="true" --http_command_executor="false" --http_credentials="/tmp/Endpoint_SlaveEndpointTest_UnauthorizedRequest_1_IbVKF1/http_credentials"
--http_heartbeat_interval="30secs" --initialize_driver_logging="true" --isolation="posix/cpu,posix/mem"
--launcher="posix" --launcher_dir="/mesos/mesos-1.5.0/_build/src" --logbufsecs="0" --logging_level="INFO"
--max_completed_executors_per_framework="150" --oversubscribed_resources_interval="15secs"
--perf_duration="10secs" --perf_interval="1mins" --port="5051" --qos_correction_interval_min="0ns"
--quiet="false" --recover="reconnect" --recovery_timeout="15mins" --registration_backoff_factor="10ms"
--resources="cpus:2;gpus:0;mem:1024;disk:1024;ports:[31000-32000]" --revocable_cpu_low_priority="true"
--runtime_dir="/tmp/Endpoint_SlaveEndpointTest_UnauthorizedRequest_1_IbVKF1" --sandbox_directory="/mnt/mesos/sandbox"
--strict="true" --switch_user="true" --systemd_enable_support="true" --systemd_runtime_directory="/run/systemd/system"
--version="false" --work_dir="/tmp/Endpoint_SlaveEndpointTest_UnauthorizedRequest_1_0Q2UM9"
--zk_session_timeout="10secs"
I1002 16:44:10.189105  5812 credentials.hpp:86] Loading credential for authentication from
'/tmp/Endpoint_SlaveEndpointTest_UnauthorizedRequest_1_IbVKF1/credential'
I1002 16:44:10.189276  5812 slave.cpp:287] Agent using credential for: test-principal
I1002 16:44:10.189307  5812 credentials.hpp:37] Loading credentials for authentication from
'/tmp/Endpoint_SlaveEndpointTest_UnauthorizedRequest_1_IbVKF1/http_credentials'
I1002 16:44:10.189543  5812 http.cpp:1045] Creating default 'basic' HTTP authenticator for
realm 'mesos-agent-readonly'
I1002 16:44:10.189704  5812 http.cpp:1045] Creating default 'basic' HTTP authenticator for
realm 'mesos-agent-readwrite'
I1002 16:44:10.191670  5812 slave.cpp:585] Agent resources: [{"name":"cpus","scalar":{"value":2.0},"type":"SCALAR"},{"name":"mem","scalar":{"value":1024.0},"type":"SCALAR"},{"name":"disk","scalar":{"value":1024.0},"type":"SCALAR"},{"name":"ports","ranges":{"range":[{"begin":31000,"end":32000}]},"type":"RANGES"}]
I1002 16:44:10.192072  5812 slave.cpp:593] Agent attributes: [  ]
I1002 16:44:10.192096  5812 slave.cpp:602] Agent hostname: f96be2ba668f
I1002 16:44:10.192338  5800 status_update_manager.cpp:177] Pausing sending status updates
I1002 16:44:10.194298  5813 state.cpp:64] Recovering state from '/tmp/Endpoint_SlaveEndpointTest_UnauthorizedRequest_1_0Q2UM9/meta'
I1002 16:44:10.194650  5798 status_update_manager.cpp:203] Recovering status update manager
I1002 16:44:10.194849  5806 containerizer.cpp:648] Recovering containerizer
I1002 16:44:10.196665  5808 provisioner.cpp:416] Provisioner recovery complete
I1002 16:44:10.197016  5808 slave.cpp:6313] Finished recovery
I1002 16:44:10.197417  5808 slave.cpp:6495] Querying resource estimator for oversubscribable
resources
I1002 16:44:10.197669  5819 slave.cpp:6509] Received oversubscribable resources {} from the
resource estimator
I1002 16:44:10.200269  5797 process.cpp:3929] Handling HTTP event for process 'slave(822)'
with path: '/slave(822)/monitor/statistics.json'
I1002 16:44:10.201364  5815 http.cpp:1185] HTTP GET for /slave(822)/monitor/statistics.json
from 172.17.0.2:47110
I1002 16:44:10.201439  5815 http.cpp:976] Authorizing principal 'test-principal' to GET the
'/monitor/statistics.json' endpoint
I1002 16:44:10.204434  5778 slave.cpp:869] Agent terminating
[       OK ] Endpoint/SlaveEndpointTest.UnauthorizedRequest/1 (37 ms)
[ RUN      ] Endpoint/SlaveEndpointTest.UnauthorizedRequest/2
I1002 16:44:10.221309  5778 containerizer.cpp:292] Using isolation { environment_secret, posix/cpu,
posix/mem, filesystem/posix, network/cni }
W1002 16:44:10.222230  5778 backend.cpp:76] Failed to create 'aufs' backend: AufsBackend requires
root privileges
W1002 16:44:10.222460  5778 backend.cpp:76] Failed to create 'bind' backend: BindBackend requires
root privileges
I1002 16:44:10.222517  5778 provisioner.cpp:255] Using default backend 'copy'
I1002 16:44:10.227756  5819 slave.cpp:254] Mesos agent started on (823)@172.17.0.2:42511
I1002 16:44:10.227785  5819 slave.cpp:255] Flags at startup: --acls="" --appc_simple_discovery_uri_prefix="http://"
--appc_store_dir="/tmp/Endpoint_SlaveEndpointTest_UnauthorizedRequest_2_QqKuwv/store/appc"
--authenticate_http_readonly="true" --authenticate_http_readwrite="true" --authenticatee="crammd5"
--authentication_backoff_factor="1secs" --authorizer="local" --cgroups_cpu_enable_pids_and_tids_count="false"
--cgroups_enable_cfs="false" --cgroups_hierarchy="/sys/fs/cgroup" --cgroups_limit_swap="false"
--cgroups_root="mesos" --container_disk_watch_interval="15secs" --containerizers="mesos" --credential="/tmp/Endpoint_SlaveEndpointTest_UnauthorizedRequest_2_QqKuwv/credential"
--default_role="*" --disallow_sharing_agent_pid_namespace="false" --disk_watch_interval="1mins"
--docker="docker" --docker_kill_orphans="true" --docker_registry="https://registry-1.docker.io"
--docker_remove_delay="6hrs" --docker_socket="/var/run/docker.sock" --docker_stop_timeout="0ns"
--docker_store_dir="/tmp/Endpoint_SlaveEndpointTest_UnauthorizedRequest_2_QqKuwv/store/docker"
--docker_volume_checkpoint_dir="/var/run/mesos/isolators/docker/volume" --enforce_container_disk_quota="false"
--executor_registration_timeout="1mins" --executor_reregistration_timeout="2secs" --executor_shutdown_grace_period="5secs"
--fetcher_cache_dir="/tmp/Endpoint_SlaveEndpointTest_UnauthorizedRequest_2_QqKuwv/fetch" --fetcher_cache_size="2GB"
--frameworks_home="" --gc_delay="1weeks" --gc_disk_headroom="0.1" --hadoop_home="" --help="false"
--hostname_lookup="true" --http_command_executor="false" --http_credentials="/tmp/Endpoint_SlaveEndpointTest_UnauthorizedRequest_2_QqKuwv/http_credentials"
--http_heartbeat_interval="30secs" --initialize_driver_logging="true" --isolation="posix/cpu,posix/mem"
--launcher="posix" --launcher_dir="/mesos/mesos-1.5.0/_build/src" --logbufsecs="0" --logging_level="INFO"
--max_completed_executors_per_framework="150" --oversubscribed_resources_interval="15secs"
--perf_duration="10secs" --perf_interval="1mins" --port="5051" --qos_correction_interval_min="0ns"
--quiet="false" --recover="reconnect" --recovery_timeout="15mins" --registration_backoff_factor="10ms"
--resources="cpus:2;gpus:0;mem:1024;disk:1024;ports:[31000-32000]" --revocable_cpu_low_priority="true"
--runtime_dir="/tmp/Endpoint_SlaveEndpointTest_UnauthorizedRequest_2_QqKuwv" --sandbox_directory="/mnt/mesos/sandbox"
--strict="true" --switch_user="true" --systemd_enable_support="true" --systemd_runtime_directory="/run/systemd/system"
--version="false" --work_dir="/tmp/Endpoint_SlaveEndpointTest_UnauthorizedRequest_2_7QbXxD"
--zk_session_timeout="10secs"
I1002 16:44:10.228371  5819 credentials.hpp:86] Loading credential for authentication from
'/tmp/Endpoint_SlaveEndpointTest_UnauthorizedRequest_2_QqKuwv/credential'
I1002 16:44:10.228567  5819 slave.cpp:287] Agent using credential for: test-principal
I1002 16:44:10.228588  5819 credentials.hpp:37] Loading credentials for authentication from
'/tmp/Endpoint_SlaveEndpointTest_UnauthorizedRequest_2_QqKuwv/http_credentials'
I1002 16:44:10.228838  5819 http.cpp:1045] Creating default 'basic' HTTP authenticator for
realm 'mesos-agent-readonly'
I1002 16:44:10.229012  5819 http.cpp:1045] Creating default 'basic' HTTP authenticator for
realm 'mesos-agent-readwrite'
I1002 16:44:10.230782  5819 slave.cpp:585] Agent resources: [{"name":"cpus","scalar":{"value":2.0},"type":"SCALAR"},{"name":"mem","scalar":{"value":1024.0},"type":"SCALAR"},{"name":"disk","scalar":{"value":1024.0},"type":"SCALAR"},{"name":"ports","ranges":{"range":[{"begin":31000,"end":32000}]},"type":"RANGES"}]
I1002 16:44:10.231186  5819 slave.cpp:593] Agent attributes: [  ]
I1002 16:44:10.231209  5819 slave.cpp:602] Agent hostname: f96be2ba668f
I1002 16:44:10.231446  5818 status_update_manager.cpp:177] Pausing sending status updates
I1002 16:44:10.233180  5815 state.cpp:64] Recovering state from '/tmp/Endpoint_SlaveEndpointTest_UnauthorizedRequest_2_7QbXxD/meta'
I1002 16:44:10.233563  5799 status_update_manager.cpp:203] Recovering status update manager
I1002 16:44:10.233789  5811 containerizer.cpp:648] Recovering containerizer
I1002 16:44:10.235201  5806 provisioner.cpp:416] Provisioner recovery complete
I1002 16:44:10.235658  5806 slave.cpp:6313] Finished recovery
I1002 16:44:10.236107  5806 slave.cpp:6495] Querying resource estimator for oversubscribable
resources
I1002 16:44:10.236501  5800 slave.cpp:6509] Received oversubscribable resources {} from the
resource estimator
I1002 16:44:10.239465  5813 process.cpp:3929] Handling HTTP event for process 'slave(823)'
with path: '/slave(823)/containers'
I1002 16:44:10.240913  5810 http.cpp:1185] HTTP GET for /slave(823)/containers from 172.17.0.2:47112
I1002 16:44:10.240980  5810 http.cpp:976] Authorizing principal 'test-principal' to GET the
'/containers' endpoint
I1002 16:44:10.243556  5778 slave.cpp:869] Agent terminating
[       OK ] Endpoint/SlaveEndpointTest.UnauthorizedRequest/2 (38 ms)
[ RUN      ] Endpoint/SlaveEndpointTest.NoAuthorizer/0
I1002 16:44:10.256934  5778 containerizer.cpp:292] Using isolation { environment_secret, posix/cpu,
posix/mem, filesystem/posix, network/cni }
W1002 16:44:10.257402  5778 backend.cpp:76] Failed to create 'aufs' backend: AufsBackend requires
root privileges
W1002 16:44:10.257509  5778 backend.cpp:76] Failed to create 'bind' backend: BindBackend requires
root privileges
I1002 16:44:10.257541  5778 provisioner.cpp:255] Using default backend 'copy'
I1002 16:44:10.259420  5778 cluster.cpp:448] Creating default 'local' authorizer
I1002 16:44:10.261770  5813 slave.cpp:254] Mesos agent started on (824)@172.17.0.2:42511
I1002 16:44:10.261795  5813 slave.cpp:255] Flags at startup: --acls="" --appc_simple_discovery_uri_prefix="http://"
--appc_store_dir="/tmp/Endpoint_SlaveEndpointTest_NoAuthorizer_0_MsiXJZ/store/appc" --authenticate_http_readonly="true"
--authenticate_http_readwrite="true" --authenticatee="crammd5" --authentication_backoff_factor="1secs"
--authorizer="local" --cgroups_cpu_enable_pids_and_tids_count="false" --cgroups_enable_cfs="false"
--cgroups_hierarchy="/sys/fs/cgroup" --cgroups_limit_swap="false" --cgroups_root="mesos" --container_disk_watch_interval="15secs"
--containerizers="mesos" --credential="/tmp/Endpoint_SlaveEndpointTest_NoAuthorizer_0_MsiXJZ/credential"
--default_role="*" --disallow_sharing_agent_pid_namespace="false" --disk_watch_interval="1mins"
--docker="docker" --docker_kill_orphans="true" --docker_registry="https://registry-1.docker.io"
--docker_remove_delay="6hrs" --docker_socket="/var/run/docker.sock" --docker_stop_timeout="0ns"
--docker_store_dir="/tmp/Endpoint_SlaveEndpointTest_NoAuthorizer_0_MsiXJZ/store/docker" --docker_volume_checkpoint_dir="/var/run/mesos/isolators/docker/volume"
--enforce_container_disk_quota="false" --executor_registration_timeout="1mins" --executor_reregistration_timeout="2secs"
--executor_shutdown_grace_period="5secs" --fetcher_cache_dir="/tmp/Endpoint_SlaveEndpointTest_NoAuthorizer_0_MsiXJZ/fetch"
--fetcher_cache_size="2GB" --frameworks_home="" --gc_delay="1weeks" --gc_disk_headroom="0.1"
--hadoop_home="" --help="false" --hostname_lookup="true" --http_command_executor="false" --http_credentials="/tmp/Endpoint_SlaveEndpointTest_NoAuthorizer_0_MsiXJZ/http_credentials"
--http_heartbeat_interval="30secs" --initialize_driver_logging="true" --isolation="posix/cpu,posix/mem"
--launcher="posix" --launcher_dir="/mesos/mesos-1.5.0/_build/src" --logbufsecs="0" --logging_level="INFO"
--max_completed_executors_per_framework="150" --oversubscribed_resources_interval="15secs"
--perf_duration="10secs" --perf_interval="1mins" --port="5051" --qos_correction_interval_min="0ns"
--quiet="false" --recover="reconnect" --recovery_timeout="15mins" --registration_backoff_factor="10ms"
--resources="cpus:2;gpus:0;mem:1024;disk:1024;ports:[31000-32000]" --revocable_cpu_low_priority="true"
--runtime_dir="/tmp/Endpoint_SlaveEndpointTest_NoAuthorizer_0_MsiXJZ" --sandbox_directory="/mnt/mesos/sandbox"
--strict="true" --switch_user="true" --systemd_enable_support="true" --systemd_runtime_directory="/run/systemd/system"
--version="false" --work_dir="/tmp/Endpoint_SlaveEndpointTest_NoAuthorizer_0_UXgQF7" --zk_session_timeout="10secs"
I1002 16:44:10.262209  5813 credentials.hpp:86] Loading credential for authentication from
'/tmp/Endpoint_SlaveEndpointTest_NoAuthorizer_0_MsiXJZ/credential'
I1002 16:44:10.262356  5813 slave.cpp:287] Agent using credential for: test-principal
I1002 16:44:10.262403  5813 credentials.hpp:37] Loading credentials for authentication from
'/tmp/Endpoint_SlaveEndpointTest_NoAuthorizer_0_MsiXJZ/http_credentials'
I1002 16:44:10.262686  5813 http.cpp:1045] Creating default 'basic' HTTP authenticator for
realm 'mesos-agent-readonly'
I1002 16:44:10.262832  5813 http.cpp:1045] Creating default 'basic' HTTP authenticator for
realm 'mesos-agent-readwrite'
I1002 16:44:10.264189  5813 slave.cpp:585] Agent resources: [{"name":"cpus","scalar":{"value":2.0},"type":"SCALAR"},{"name":"mem","scalar":{"value":1024.0},"type":"SCALAR"},{"name":"disk","scalar":{"value":1024.0},"type":"SCALAR"},{"name":"ports","ranges":{"range":[{"begin":31000,"end":32000}]},"type":"RANGES"}]
I1002 16:44:10.264415  5813 slave.cpp:593] Agent attributes: [  ]
I1002 16:44:10.264426  5813 slave.cpp:602] Agent hostname: f96be2ba668f
I1002 16:44:10.264561  5810 status_update_manager.cpp:177] Pausing sending status updates
I1002 16:44:10.265867  5803 state.cpp:64] Recovering state from '/tmp/Endpoint_SlaveEndpointTest_NoAuthorizer_0_UXgQF7/meta'
I1002 16:44:10.266186  5820 status_update_manager.cpp:203] Recovering status update manager
I1002 16:44:10.266386  5818 containerizer.cpp:648] Recovering containerizer
I1002 16:44:10.267901  5815 provisioner.cpp:416] Provisioner recovery complete
I1002 16:44:10.268312  5802 slave.cpp:6313] Finished recovery
I1002 16:44:10.268744  5802 slave.cpp:6495] Querying resource estimator for oversubscribable
resources
I1002 16:44:10.268968  5809 slave.cpp:6509] Received oversubscribable resources {} from the
resource estimator
I1002 16:44:10.271571  5797 process.cpp:3929] Handling HTTP event for process 'slave(824)'
with path: '/slave(824)/monitor/statistics'
I1002 16:44:10.273433  5799 http.cpp:1185] HTTP GET for /slave(824)/monitor/statistics from
172.17.0.2:47114
I1002 16:44:10.273555  5799 http.cpp:976] Authorizing principal 'test-principal' to GET the
'/monitor/statistics' endpoint
I1002 16:44:10.278048  5778 slave.cpp:869] Agent terminating
[       OK ] Endpoint/SlaveEndpointTest.NoAuthorizer/0 (33 ms)
[ RUN      ] Endpoint/SlaveEndpointTest.NoAuthorizer/1
I1002 16:44:10.290802  5778 containerizer.cpp:292] Using isolation { environment_secret, posix/cpu,
posix/mem, filesystem/posix, network/cni }
W1002 16:44:10.291667  5778 backend.cpp:76] Failed to create 'aufs' backend: AufsBackend requires
root privileges
W1002 16:44:10.291851  5778 backend.cpp:76] Failed to create 'bind' backend: BindBackend requires
root privileges
I1002 16:44:10.291913  5778 provisioner.cpp:255] Using default backend 'copy'
I1002 16:44:10.294909  5778 cluster.cpp:448] Creating default 'local' authorizer
I1002 16:44:10.297863  5818 slave.cpp:254] Mesos agent started on (825)@172.17.0.2:42511
I1002 16:44:10.297890  5818 slave.cpp:255] Flags at startup: --acls="" --appc_simple_discovery_uri_prefix="http://"
--appc_store_dir="/tmp/Endpoint_SlaveEndpointTest_NoAuthorizer_1_4tClhu/store/appc" --authenticate_http_readonly="true"
--authenticate_http_readwrite="true" --authenticatee="crammd5" --authentication_backoff_factor="1secs"
--authorizer="local" --cgroups_cpu_enable_pids_and_tids_count="false" --cgroups_enable_cfs="false"
--cgroups_hierarchy="/sys/fs/cgroup" --cgroups_limit_swap="false" --cgroups_root="mesos" --container_disk_watch_interval="15secs"
--containerizers="mesos" --credential="/tmp/Endpoint_SlaveEndpointTest_NoAuthorizer_1_4tClhu/credential"
--default_role="*" --disallow_sharing_agent_pid_namespace="false" --disk_watch_interval="1mins"
--docker="docker" --docker_kill_orphans="true" --docker_registry="https://registry-1.docker.io"
--docker_remove_delay="6hrs" --docker_socket="/var/run/docker.sock" --docker_stop_timeout="0ns"
--docker_store_dir="/tmp/Endpoint_SlaveEndpointTest_NoAuthorizer_1_4tClhu/store/docker" --docker_volume_checkpoint_dir="/var/run/mesos/isolators/docker/volume"
--enforce_container_disk_quota="false" --executor_registration_timeout="1mins" --executor_reregistration_timeout="2secs"
--executor_shutdown_grace_period="5secs" --fetcher_cache_dir="/tmp/Endpoint_SlaveEndpointTest_NoAuthorizer_1_4tClhu/fetch"
--fetcher_cache_size="2GB" --frameworks_home="" --gc_delay="1weeks" --gc_disk_headroom="0.1"
--hadoop_home="" --help="false" --hostname_lookup="true" --http_command_executor="false" --http_credentials="/tmp/Endpoint_SlaveEndpointTest_NoAuthorizer_1_4tClhu/http_credentials"
--http_heartbeat_interval="30secs" --initialize_driver_logging="true" --isolation="posix/cpu,posix/mem"
--launcher="posix" --launcher_dir="/mesos/mesos-1.5.0/_build/src" --logbufsecs="0" --logging_level="INFO"
--max_completed_executors_per_framework="150" --oversubscribed_resources_interval="15secs"
--perf_duration="10secs" --perf_interval="1mins" --port="5051" --qos_correction_interval_min="0ns"
--quiet="false" --recover="reconnect" --recovery_timeout="15mins" --registration_backoff_factor="10ms"
--resources="cpus:2;gpus:0;mem:1024;disk:1024;ports:[31000-32000]" --revocable_cpu_low_priority="true"
--runtime_dir="/tmp/Endpoint_SlaveEndpointTest_NoAuthorizer_1_4tClhu" --sandbox_directory="/mnt/mesos/sandbox"
--strict="true" --switch_user="true" --systemd_enable_support="true" --systemd_runtime_directory="/run/systemd/system"
--version="false" --work_dir="/tmp/Endpoint_SlaveEndpointTest_NoAuthorizer_1_AgDd8B" --zk_session_timeout="10secs"
I1002 16:44:10.298456  5818 credentials.hpp:86] Loading credential for authentication from
'/tmp/Endpoint_SlaveEndpointTest_NoAuthorizer_1_4tClhu/credential'
I1002 16:44:10.298671  5818 slave.cpp:287] Agent using credential for: test-principal
I1002 16:44:10.298712  5818 credentials.hpp:37] Loading credentials for authentication from
'/tmp/Endpoint_SlaveEndpointTest_NoAuthorizer_1_4tClhu/http_credentials'
I1002 16:44:10.299109  5818 http.cpp:1045] Creating default 'basic' HTTP authenticator for
realm 'mesos-agent-readonly'
I1002 16:44:10.299332  5818 http.cpp:1045] Creating default 'basic' HTTP authenticator for
realm 'mesos-agent-readwrite'
I1002 16:44:10.301697  5818 slave.cpp:585] Agent resources: [{"name":"cpus","scalar":{"value":2.0},"type":"SCALAR"},{"name":"mem","scalar":{"value":1024.0},"type":"SCALAR"},{"name":"disk","scalar":{"value":1024.0},"type":"SCALAR"},{"name":"ports","ranges":{"range":[{"begin":31000,"end":32000}]},"type":"RANGES"}]
I1002 16:44:10.302101  5818 slave.cpp:593] Agent attributes: [  ]
I1002 16:44:10.302129  5818 slave.cpp:602] Agent hostname: f96be2ba668f
I1002 16:44:10.302279  5809 status_update_manager.cpp:177] Pausing sending status updates
I1002 16:44:10.303803  5803 state.cpp:64] Recovering state from '/tmp/Endpoint_SlaveEndpointTest_NoAuthorizer_1_AgDd8B/meta'
I1002 16:44:10.304062  5808 status_update_manager.cpp:203] Recovering status update manager
I1002 16:44:10.304267  5808 containerizer.cpp:648] Recovering containerizer
I1002 16:44:10.305554  5799 provisioner.cpp:416] Provisioner recovery complete
I1002 16:44:10.306076  5820 slave.cpp:6313] Finished recovery
I1002 16:44:10.306615  5820 slave.cpp:6495] Querying resource estimator for oversubscribable
resources
I1002 16:44:10.306906  5802 slave.cpp:6509] Received oversubscribable resources {} from the
resource estimator
I1002 16:44:10.309942  5798 process.cpp:3929] Handling HTTP event for process 'slave(825)'
with path: '/slave(825)/monitor/statistics.json'
I1002 16:44:10.311414  5801 http.cpp:1185] HTTP GET for /slave(825)/monitor/statistics.json
from 172.17.0.2:47116
I1002 16:44:10.311483  5801 http.cpp:976] Authorizing principal 'test-principal' to GET the
'/monitor/statistics.json' endpoint
I1002 16:44:10.315822  5778 slave.cpp:869] Agent terminating
[       OK ] Endpoint/SlaveEndpointTest.NoAuthorizer/1 (37 ms)
[ RUN      ] Endpoint/SlaveEndpointTest.NoAuthorizer/2
I1002 16:44:10.328892  5778 containerizer.cpp:292] Using isolation { environment_secret, posix/cpu,
posix/mem, filesystem/posix, network/cni }
W1002 16:44:10.329375  5778 backend.cpp:76] Failed to create 'aufs' backend: AufsBackend requires
root privileges
W1002 16:44:10.329479  5778 backend.cpp:76] Failed to create 'bind' backend: BindBackend requires
root privileges
I1002 16:44:10.329511  5778 provisioner.cpp:255] Using default backend 'copy'
I1002 16:44:10.331486  5778 cluster.cpp:448] Creating default 'local' authorizer
I1002 16:44:10.333725  5811 slave.cpp:254] Mesos agent started on (826)@172.17.0.2:42511
I1002 16:44:10.333753  5811 slave.cpp:255] Flags at startup: --acls="" --appc_simple_discovery_uri_prefix="http://"
--appc_store_dir="/tmp/Endpoint_SlaveEndpointTest_NoAuthorizer_2_wJzrbZ/store/appc" --authenticate_http_readonly="true"
--authenticate_http_readwrite="true" --authenticatee="crammd5" --authentication_backoff_factor="1secs"
--authorizer="local" --cgroups_cpu_enable_pids_and_tids_count="false" --cgroups_enable_cfs="false"
--cgroups_hierarchy="/sys/fs/cgroup" --cgroups_limit_swap="false" --cgroups_root="mesos" --container_disk_watch_interval="15secs"
--containerizers="mesos" --credential="/tmp/Endpoint_SlaveEndpointTest_NoAuthorizer_2_wJzrbZ/credential"
--default_role="*" --disallow_sharing_agent_pid_namespace="false" --disk_watch_interval="1mins"
--docker="docker" --docker_kill_orphans="true" --docker_registry="https://registry-1.docker.io"
--docker_remove_delay="6hrs" --docker_socket="/var/run/docker.sock" --docker_stop_timeout="0ns"
--docker_store_dir="/tmp/Endpoint_SlaveEndpointTest_NoAuthorizer_2_wJzrbZ/store/docker" --docker_volume_checkpoint_dir="/var/run/mesos/isolators/docker/volume"
--enforce_container_disk_quota="false" --executor_registration_timeout="1mins" --executor_reregistration_timeout="2secs"
--executor_shutdown_grace_period="5secs" --fetcher_cache_dir="/tmp/Endpoint_SlaveEndpointTest_NoAuthorizer_2_wJzrbZ/fetch"
--fetcher_cache_size="2GB" --frameworks_home="" --gc_delay="1weeks" --gc_disk_headroom="0.1"
--hadoop_home="" --help="false" --hostname_lookup="true" --http_command_executor="false" --http_credentials="/tmp/Endpoint_SlaveEndpointTest_NoAuthorizer_2_wJzrbZ/http_credentials"
--http_heartbeat_interval="30secs" --initialize_driver_logging="true" --isolation="posix/cpu,posix/mem"
--launcher="posix" --launcher_dir="/mesos/mesos-1.5.0/_build/src" --logbufsecs="0" --logging_level="INFO"
--max_completed_executors_per_framework="150" --oversubscribed_resources_interval="15secs"
--perf_duration="10secs" --perf_interval="1mins" --port="5051" --qos_correction_interval_min="0ns"
--quiet="false" --recover="reconnect" --recovery_timeout="15mins" --registration_backoff_factor="10ms"
--resources="cpus:2;gpus:0;mem:1024;disk:1024;ports:[31000-32000]" --revocable_cpu_low_priority="true"
--runtime_dir="/tmp/Endpoint_SlaveEndpointTest_NoAuthorizer_2_wJzrbZ" --sandbox_directory="/mnt/mesos/sandbox"
--strict="true" --switch_user="true" --systemd_enable_support="true" --systemd_runtime_directory="/run/systemd/system"
--version="false" --work_dir="/tmp/Endpoint_SlaveEndpointTest_NoAuthorizer_2_07tCW6" --zk_session_timeout="10secs"
I1002 16:44:10.334206  5811 credentials.hpp:86] Loading credential for authentication from
'/tmp/Endpoint_SlaveEndpointTest_NoAuthorizer_2_wJzrbZ/credential'
I1002 16:44:10.334391  5811 slave.cpp:287] Agent using credential for: test-principal
I1002 16:44:10.334427  5811 credentials.hpp:37] Loading credentials for authentication from
'/tmp/Endpoint_SlaveEndpointTest_NoAuthorizer_2_wJzrbZ/http_credentials'
I1002 16:44:10.334674  5811 http.cpp:1045] Creating default 'basic' HTTP authenticator for
realm 'mesos-agent-readonly'
I1002 16:44:10.334834  5811 http.cpp:1045] Creating default 'basic' HTTP authenticator for
realm 'mesos-agent-readwrite'
I1002 16:44:10.336272  5811 slave.cpp:585] Agent resources: [{"name":"cpus","scalar":{"value":2.0},"type":"SCALAR"},{"name":"mem","scalar":{"value":1024.0},"type":"SCALAR"},{"name":"disk","scalar":{"value":1024.0},"type":"SCALAR"},{"name":"ports","ranges":{"range":[{"begin":31000,"end":32000}]},"type":"RANGES"}]
I1002 16:44:10.336510  5811 slave.cpp:593] Agent attributes: [  ]
I1002 16:44:10.336524  5811 slave.cpp:602] Agent hostname: f96be2ba668f
I1002 16:44:10.336693  5809 status_update_manager.cpp:177] Pausing sending status updates
I1002 16:44:10.338345  5819 state.cpp:64] Recovering state from '/tmp/Endpoint_SlaveEndpointTest_NoAuthorizer_2_07tCW6/meta'
I1002 16:44:10.338840  5819 status_update_manager.cpp:203] Recovering status update manager
I1002 16:44:10.339090  5808 containerizer.cpp:648] Recovering containerizer
I1002 16:44:10.340531  5801 provisioner.cpp:416] Provisioner recovery complete
I1002 16:44:10.340929  5801 slave.cpp:6313] Finished recovery
I1002 16:44:10.341393  5801 slave.cpp:6495] Querying resource estimator for oversubscribable
resources
I1002 16:44:10.341687  5817 slave.cpp:6509] Received oversubscribable resources {} from the
resource estimator
I1002 16:44:10.344076  5812 process.cpp:3929] Handling HTTP event for process 'slave(826)'
with path: '/slave(826)/containers'
I1002 16:44:10.345420  5799 http.cpp:1185] HTTP GET for /slave(826)/containers from 172.17.0.2:47118
I1002 16:44:10.345486  5799 http.cpp:976] Authorizing principal 'test-principal' to GET the
'/containers' endpoint
I1002 16:44:10.349542  5778 slave.cpp:869] Agent terminating
[       OK ] Endpoint/SlaveEndpointTest.NoAuthorizer/2 (34 ms)
[----------] 9 tests from Endpoint/SlaveEndpointTest (313 ms total)

[----------] 2 tests from ContainerizerType/DefaultContainerDNSFlagTest
[ RUN      ] ContainerizerType/DefaultContainerDNSFlagTest.ValidateFlag/0
[       OK ] ContainerizerType/DefaultContainerDNSFlagTest.ValidateFlag/0 (16 ms)
[ RUN      ] ContainerizerType/DefaultContainerDNSFlagTest.ValidateFlag/1
[       OK ] ContainerizerType/DefaultContainerDNSFlagTest.ValidateFlag/1 (12 ms)
[----------] 2 tests from ContainerizerType/DefaultContainerDNSFlagTest (28 ms total)

[----------] Global test environment tear-down
[==========] 1685 tests from 184 test cases ran. (632377 ms total)
[  PASSED  ] 1684 tests.
[  FAILED  ] 1 test, listed below:
[  FAILED  ] ExamplesTest.JavaFramework

 1 FAILED TEST
  YOU HAVE 21 DISABLED TESTS

I1002 16:44:10.452718  5821 process.cpp:1068] Failed to accept socket: future discarded
make[4]: *** [check-local] Error 1
make[4]: Leaving directory `/mesos/mesos-1.5.0/_build/src'
make[3]: *** [check-am] Error 2
make[3]: Leaving directory `/mesos/mesos-1.5.0/_build/src'
make[2]: *** [check] Error 2
make[2]: Leaving directory `/mesos/mesos-1.5.0/_build/src'
make[1]: *** [check-recursive] Error 1
make[1]: Leaving directory `/mesos/mesos-1.5.0/_build'
make: *** [distcheck] Error 1
+ docker rmi mesos-1506958890-17727
Untagged: mesos-1506958890-17727:latest
Deleted: sha256:18b47c16bb06728630725d0733e2b3a82d87664e43cea98fc1609f67ff0c1ac5
Deleted: sha256:16ee509a482f3dcae859e5b3907bff5e5a276ca5f45aefa87e08812bc17e27d8
Deleted: sha256:7943af216291303c877985c6e68417da7591da60ae05a834508f5d72cc1f0142
Deleted: sha256:78a4743974ef945a015c546fedff629b38b580025d09706d9efba0a688ab4df1
Deleted: sha256:dbfe83001d1cc7c540e67815a57ea3f653bde5131e3746a0157d07aa4162ef94
Deleted: sha256:e5673dc97d3d8f2ab067518bb6fd19daf5a64ceba941e0dde7c0af5adfc7792a
Deleted: sha256:1cee16e19a7106eacdaca53cd7f5a2ef5ea8c2a3bd24349681a9c4e6015466ce
Deleted: sha256:8136d7ccc2a9456841d0a810fe9301e73eaca32cc1f62fd3d7408e70123759fc
Deleted: sha256:31a4908895f79e1a938a81c2ff600223874bfbc1abcbab3689e239f192cf15f3
Deleted: sha256:f32675c40e54faeea7a1668f2e6ba9c4780d12766aae2c20a19baf1cc04f9b15
Deleted: sha256:8e7a3aa74d2a28f923ac0f502a9e156f525858a0b7f35a2fb738a28361c8fdde
Deleted: sha256:a8f277841e1b4010836e0a27bb562a9092a39a3958fd57e71de9ccf03725d399
Deleted: sha256:be78ec19b9a8f1390629d41262bd8bf0dcbb288a9cd8b0950be33e4ebcb36901
Deleted: sha256:2f13b8f53e2ffe1c48b9a8a913b27d53a2d99d27e19756b767a88afceef5c099
Deleted: sha256:56de3d63bcd3c7ac3521a6b3c7591181d153ad6944d0fa2645c4381bc0ae9645
Deleted: sha256:811b5925307dc1b27c5aee4cc3632944e477241b5349a59688b4903ce35e703d
Deleted: sha256:97e0ee455be42b68192f6f21f9f43b32389f4e9abcbe55e178f3473e4e818250
Deleted: sha256:518fe2ca7d975f633ddfd319fa6ee3fbe713c62a2a7443b8bdd16e81bd558971
Deleted: sha256:c06a089ed67afb4fd0c5d475f5ec54a3e94a9b36d204392efcefab6b0220e0bf
Deleted: sha256:ea16a15c9a925006904260012b762aa720b5deb88412406c9a7025c6f51c1dc6
Deleted: sha256:48a54c1627efc576f38c5dba273b4d5fe53412c1f4fbe8f654372ed287a091ef
Deleted: sha256:61cfeb6c54e07aca585e650e1430693e42a05cd09536b8b92d892333c02c382f
Deleted: sha256:5696634bea11a2ebaad9a8ec71346059b41e83c7f6479ab0f74de3747d39eb07
Deleted: sha256:954b9719e2b50b97902dabcbd356c19d44f0e81bc1273d35c874c995cb489138
Deleted: sha256:2a095fa60c5315400660f02f8720a010aa9e11da73f7b90db984f6fb119d5830
Deleted: sha256:5134e259b8a267c1a5216e65ebe80e703dfa0530e761db08c0f587c3ece0b1a1
Deleted: sha256:a4941a2475bb513c6c2e2d42fc26c47c80082a1f6bb319d914a20ac1721cd0f7
Deleted: sha256:87121ecce9023281a9aa1f196f9b3cfa40798088c9eab31db11cce809e1bb388
Build step 'Execute shell' marked build as failure

Mime
View raw message