mesos-builds mailing list archives

Site index · List index
Message view « Date » · « Thread »
Top « Date » · « Thread »
From Apache Jenkins Server <jenk...@builds.apache.org>
Subject Build failed in Jenkins: Mesos-Buildbot » autotools,gcc,--verbose --disable-libtool-wrappers --enable-libevent --enable-ssl,GLOG_v=1 MESOS_VERBOSE=1,ubuntu:14.04,(ubuntu)&&(!ubuntu-us1)&&(!ubuntu-eu2)&&(!qnode3)&&(!H23) #4318
Date Fri, 13 Oct 2017 07:20:56 GMT
See <https://builds.apache.org/job/Mesos-Buildbot/BUILDTOOL=autotools,COMPILER=gcc,CONFIGURATION=--verbose%20--disable-libtool-wrappers%20--enable-libevent%20--enable-ssl,ENVIRONMENT=GLOG_v=1%20MESOS_VERBOSE=1,OS=ubuntu%3A14.04,label_exp=(ubuntu)&&(!ubuntu-us1)&&(!ubuntu-eu2)&&(!qnode3)&&(!H23)/4318/display/redirect?page=changes>

Changes:

[yujie.jay] Added doc for cgroups/cpu isolator.

[songzihao1990] Added Linux Namespaces semantic doc.

[songzihao1990] Added documentation for the `cgroups/blkio` isolator.

[bmahler] Re-organized the documentation table of contents.

------------------------------------------
[...truncated 33.39 MB...]
I1013 07:20:29.470516 18686 slave.cpp:287] Agent using credential for: test-principal
I1013 07:20:29.470538 18686 credentials.hpp:37] Loading credentials for authentication from
'/tmp/Endpoint_SlaveEndpointTest_UnauthorizedRequest_0_Ev5KFQ/http_credentials'
I1013 07:20:29.470824 18686 http.cpp:1045] Creating default 'basic' HTTP authenticator for
realm 'mesos-agent-executor'
I1013 07:20:29.470937 18686 http.cpp:1066] Creating default 'jwt' HTTP authenticator for realm
'mesos-agent-executor'
I1013 07:20:29.471153 18686 http.cpp:1045] Creating default 'basic' HTTP authenticator for
realm 'mesos-agent-readonly'
I1013 07:20:29.471266 18686 http.cpp:1066] Creating default 'jwt' HTTP authenticator for realm
'mesos-agent-readonly'
I1013 07:20:29.471472 18686 http.cpp:1045] Creating default 'basic' HTTP authenticator for
realm 'mesos-agent-readwrite'
I1013 07:20:29.471571 18686 http.cpp:1066] Creating default 'jwt' HTTP authenticator for realm
'mesos-agent-readwrite'
I1013 07:20:29.472982 18686 slave.cpp:585] Agent resources: [{"name":"cpus","scalar":{"value":2.0},"type":"SCALAR"},{"name":"mem","scalar":{"value":1024.0},"type":"SCALAR"},{"name":"disk","scalar":{"value":1024.0},"type":"SCALAR"},{"name":"ports","ranges":{"range":[{"begin":31000,"end":32000}]},"type":"RANGES"}]
I1013 07:20:29.473222 18686 slave.cpp:593] Agent attributes: [  ]
I1013 07:20:29.473234 18686 slave.cpp:602] Agent hostname: 2d14e7cb84b1
I1013 07:20:29.473361 18675 status_update_manager.cpp:177] Pausing sending status updates
I1013 07:20:29.474629 18681 state.cpp:64] Recovering state from '/tmp/Endpoint_SlaveEndpointTest_UnauthorizedRequest_0_tTfgcD/meta'
I1013 07:20:29.474907 18681 status_update_manager.cpp:203] Recovering status update manager
I1013 07:20:29.475075 18685 containerizer.cpp:648] Recovering containerizer
I1013 07:20:29.476191 18671 provisioner.cpp:416] Provisioner recovery complete
I1013 07:20:29.476442 18682 slave.cpp:6310] Finished recovery
I1013 07:20:29.476869 18682 slave.cpp:6492] Querying resource estimator for oversubscribable
resources
I1013 07:20:29.477083 18681 slave.cpp:6506] Received oversubscribable resources {} from the
resource estimator
I1013 07:20:29.478770 18669 process.cpp:3929] Handling HTTP event for process 'slave(828)'
with path: '/slave(828)/monitor/statistics'
I1013 07:20:29.480317 18671 http.cpp:1185] HTTP GET for /slave(828)/monitor/statistics from
172.17.0.2:48000
I1013 07:20:29.480378 18671 http.cpp:976] Authorizing principal 'test-principal' to GET the
'/monitor/statistics' endpoint
I1013 07:20:29.481858 18674 slave.cpp:869] Agent terminating
[       OK ] Endpoint/SlaveEndpointTest.UnauthorizedRequest/0 (25 ms)
[ RUN      ] Endpoint/SlaveEndpointTest.UnauthorizedRequest/1
I1013 07:20:29.492154  8529 containerizer.cpp:292] Using isolation { environment_secret, posix/cpu,
posix/mem, filesystem/posix, network/cni }
W1013 07:20:29.492645  8529 backend.cpp:76] Failed to create 'aufs' backend: AufsBackend requires
root privileges
W1013 07:20:29.492750  8529 backend.cpp:76] Failed to create 'bind' backend: BindBackend requires
root privileges
I1013 07:20:29.492789  8529 provisioner.cpp:255] Using default backend 'copy'
I1013 07:20:29.496222 18668 slave.cpp:254] Mesos agent started on (829)@172.17.0.2:38010
I1013 07:20:29.496248 18668 slave.cpp:255] Flags at startup: --acls="" --appc_simple_discovery_uri_prefix="http://"
--appc_store_dir="/tmp/Endpoint_SlaveEndpointTest_UnauthorizedRequest_1_KAg8MI/store/appc"
--authenticate_http_executors="true" --authenticate_http_readonly="true" --authenticate_http_readwrite="true"
--authenticatee="crammd5" --authentication_backoff_factor="1secs" --authorizer="local" --cgroups_cpu_enable_pids_and_tids_count="false"
--cgroups_enable_cfs="false" --cgroups_hierarchy="/sys/fs/cgroup" --cgroups_limit_swap="false"
--cgroups_root="mesos" --container_disk_watch_interval="15secs" --containerizers="mesos" --credential="/tmp/Endpoint_SlaveEndpointTest_UnauthorizedRequest_1_KAg8MI/credential"
--default_role="*" --disallow_sharing_agent_pid_namespace="false" --disk_watch_interval="1mins"
--docker="docker" --docker_kill_orphans="true" --docker_registry="https://registry-1.docker.io"
--docker_remove_delay="6hrs" --docker_socket="/var/run/docker.sock" --docker_stop_timeout="0ns"
--docker_store_dir="/tmp/Endpoint_SlaveEndpointTest_UnauthorizedRequest_1_KAg8MI/store/docker"
--docker_volume_checkpoint_dir="/var/run/mesos/isolators/docker/volume" --enforce_container_disk_quota="false"
--executor_registration_timeout="1mins" --executor_reregistration_timeout="2secs" --executor_secret_key="/tmp/Endpoint_SlaveEndpointTest_UnauthorizedRequest_1_KAg8MI/executor_secret_key"
--executor_shutdown_grace_period="5secs" --fetcher_cache_dir="/tmp/Endpoint_SlaveEndpointTest_UnauthorizedRequest_1_KAg8MI/fetch"
--fetcher_cache_size="2GB" --frameworks_home="" --gc_delay="1weeks" --gc_disk_headroom="0.1"
--hadoop_home="" --help="false" --hostname_lookup="true" --http_command_executor="false" --http_credentials="/tmp/Endpoint_SlaveEndpointTest_UnauthorizedRequest_1_KAg8MI/http_credentials"
--http_heartbeat_interval="30secs" --initialize_driver_logging="true" --isolation="posix/cpu,posix/mem"
--launcher="posix" --launcher_dir="/mesos/mesos-1.5.0/_build/src" --logbufsecs="0" --logging_level="INFO"
--max_completed_executors_per_framework="150" --oversubscribed_resources_interval="15secs"
--perf_duration="10secs" --perf_interval="1mins" --port="5051" --qos_correction_interval_min="0ns"
--quiet="false" --recover="reconnect" --recovery_timeout="15mins" --registration_backoff_factor="10ms"
--resources="cpus:2;gpus:0;mem:1024;disk:1024;ports:[31000-32000]" --revocable_cpu_low_priority="true"
--runtime_dir="/tmp/Endpoint_SlaveEndpointTest_UnauthorizedRequest_1_KAg8MI" --sandbox_directory="/mnt/mesos/sandbox"
--strict="true" --switch_user="true" --systemd_enable_support="true" --systemd_runtime_directory="/run/systemd/system"
--version="false" --work_dir="/tmp/Endpoint_SlaveEndpointTest_UnauthorizedRequest_1_v9tJfv"
--zk_session_timeout="10secs"
I1013 07:20:29.496614 18668 credentials.hpp:86] Loading credential for authentication from
'/tmp/Endpoint_SlaveEndpointTest_UnauthorizedRequest_1_KAg8MI/credential'
I1013 07:20:29.496752 18668 slave.cpp:287] Agent using credential for: test-principal
I1013 07:20:29.496773 18668 credentials.hpp:37] Loading credentials for authentication from
'/tmp/Endpoint_SlaveEndpointTest_UnauthorizedRequest_1_KAg8MI/http_credentials'
I1013 07:20:29.497038 18668 http.cpp:1045] Creating default 'basic' HTTP authenticator for
realm 'mesos-agent-executor'
I1013 07:20:29.497162 18668 http.cpp:1066] Creating default 'jwt' HTTP authenticator for realm
'mesos-agent-executor'
I1013 07:20:29.497357 18668 http.cpp:1045] Creating default 'basic' HTTP authenticator for
realm 'mesos-agent-readonly'
I1013 07:20:29.497457 18668 http.cpp:1066] Creating default 'jwt' HTTP authenticator for realm
'mesos-agent-readonly'
I1013 07:20:29.497629 18668 http.cpp:1045] Creating default 'basic' HTTP authenticator for
realm 'mesos-agent-readwrite'
I1013 07:20:29.497726 18668 http.cpp:1066] Creating default 'jwt' HTTP authenticator for realm
'mesos-agent-readwrite'
I1013 07:20:29.499104 18668 slave.cpp:585] Agent resources: [{"name":"cpus","scalar":{"value":2.0},"type":"SCALAR"},{"name":"mem","scalar":{"value":1024.0},"type":"SCALAR"},{"name":"disk","scalar":{"value":1024.0},"type":"SCALAR"},{"name":"ports","ranges":{"range":[{"begin":31000,"end":32000}]},"type":"RANGES"}]
I1013 07:20:29.499323 18668 slave.cpp:593] Agent attributes: [  ]
I1013 07:20:29.499336 18668 slave.cpp:602] Agent hostname: 2d14e7cb84b1
I1013 07:20:29.499466 18680 status_update_manager.cpp:177] Pausing sending status updates
I1013 07:20:29.500759 18665 state.cpp:64] Recovering state from '/tmp/Endpoint_SlaveEndpointTest_UnauthorizedRequest_1_v9tJfv/meta'
I1013 07:20:29.500998 18665 status_update_manager.cpp:203] Recovering status update manager
I1013 07:20:29.501215 18686 containerizer.cpp:648] Recovering containerizer
I1013 07:20:29.502282 18669 provisioner.cpp:416] Provisioner recovery complete
I1013 07:20:29.502627 18677 slave.cpp:6310] Finished recovery
I1013 07:20:29.503023 18677 slave.cpp:6492] Querying resource estimator for oversubscribable
resources
I1013 07:20:29.503250 18674 slave.cpp:6506] Received oversubscribable resources {} from the
resource estimator
I1013 07:20:29.505172 18682 process.cpp:3929] Handling HTTP event for process 'slave(829)'
with path: '/slave(829)/monitor/statistics.json'
I1013 07:20:29.506726 18669 http.cpp:1185] HTTP GET for /slave(829)/monitor/statistics.json
from 172.17.0.2:48002
I1013 07:20:29.506784 18669 http.cpp:976] Authorizing principal 'test-principal' to GET the
'/monitor/statistics.json' endpoint
I1013 07:20:29.508378 18676 slave.cpp:869] Agent terminating
[       OK ] Endpoint/SlaveEndpointTest.UnauthorizedRequest/1 (26 ms)
[ RUN      ] Endpoint/SlaveEndpointTest.UnauthorizedRequest/2
I1013 07:20:29.518622  8529 containerizer.cpp:292] Using isolation { environment_secret, posix/cpu,
posix/mem, filesystem/posix, network/cni }
W1013 07:20:29.519120  8529 backend.cpp:76] Failed to create 'aufs' backend: AufsBackend requires
root privileges
W1013 07:20:29.519224  8529 backend.cpp:76] Failed to create 'bind' backend: BindBackend requires
root privileges
I1013 07:20:29.519263  8529 provisioner.cpp:255] Using default backend 'copy'
I1013 07:20:29.522680 18686 slave.cpp:254] Mesos agent started on (830)@172.17.0.2:38010
I1013 07:20:29.522701 18686 slave.cpp:255] Flags at startup: --acls="" --appc_simple_discovery_uri_prefix="http://"
--appc_store_dir="/tmp/Endpoint_SlaveEndpointTest_UnauthorizedRequest_2_6v1daB/store/appc"
--authenticate_http_executors="true" --authenticate_http_readonly="true" --authenticate_http_readwrite="true"
--authenticatee="crammd5" --authentication_backoff_factor="1secs" --authorizer="local" --cgroups_cpu_enable_pids_and_tids_count="false"
--cgroups_enable_cfs="false" --cgroups_hierarchy="/sys/fs/cgroup" --cgroups_limit_swap="false"
--cgroups_root="mesos" --container_disk_watch_interval="15secs" --containerizers="mesos" --credential="/tmp/Endpoint_SlaveEndpointTest_UnauthorizedRequest_2_6v1daB/credential"
--default_role="*" --disallow_sharing_agent_pid_namespace="false" --disk_watch_interval="1mins"
--docker="docker" --docker_kill_orphans="true" --docker_registry="https://registry-1.docker.io"
--docker_remove_delay="6hrs" --docker_socket="/var/run/docker.sock" --docker_stop_timeout="0ns"
--docker_store_dir="/tmp/Endpoint_SlaveEndpointTest_UnauthorizedRequest_2_6v1daB/store/docker"
--docker_volume_checkpoint_dir="/var/run/mesos/isolators/docker/volume" --enforce_container_disk_quota="false"
--executor_registration_timeout="1mins" --executor_reregistration_timeout="2secs" --executor_secret_key="/tmp/Endpoint_SlaveEndpointTest_UnauthorizedRequest_2_6v1daB/executor_secret_key"
--executor_shutdown_grace_period="5secs" --fetcher_cache_dir="/tmp/Endpoint_SlaveEndpointTest_UnauthorizedRequest_2_6v1daB/fetch"
--fetcher_cache_size="2GB" --frameworks_home="" --gc_delay="1weeks" --gc_disk_headroom="0.1"
--hadoop_home="" --help="false" --hostname_lookup="true" --http_command_executor="false" --http_credentials="/tmp/Endpoint_SlaveEndpointTest_UnauthorizedRequest_2_6v1daB/http_credentials"
--http_heartbeat_interval="30secs" --initialize_driver_logging="true" --isolation="posix/cpu,posix/mem"
--launcher="posix" --launcher_dir="/mesos/mesos-1.5.0/_build/src" --logbufsecs="0" --logging_level="INFO"
--max_completed_executors_per_framework="150" --oversubscribed_resources_interval="15secs"
--perf_duration="10secs" --perf_interval="1mins" --port="5051" --qos_correction_interval_min="0ns"
--quiet="false" --recover="reconnect" --recovery_timeout="15mins" --registration_backoff_factor="10ms"
--resources="cpus:2;gpus:0;mem:1024;disk:1024;ports:[31000-32000]" --revocable_cpu_low_priority="true"
--runtime_dir="/tmp/Endpoint_SlaveEndpointTest_UnauthorizedRequest_2_6v1daB" --sandbox_directory="/mnt/mesos/sandbox"
--strict="true" --switch_user="true" --systemd_enable_support="true" --systemd_runtime_directory="/run/systemd/system"
--version="false" --work_dir="/tmp/Endpoint_SlaveEndpointTest_UnauthorizedRequest_2_xW0Syn"
--zk_session_timeout="10secs"
I1013 07:20:29.523063 18686 credentials.hpp:86] Loading credential for authentication from
'/tmp/Endpoint_SlaveEndpointTest_UnauthorizedRequest_2_6v1daB/credential'
I1013 07:20:29.523216 18686 slave.cpp:287] Agent using credential for: test-principal
I1013 07:20:29.523238 18686 credentials.hpp:37] Loading credentials for authentication from
'/tmp/Endpoint_SlaveEndpointTest_UnauthorizedRequest_2_6v1daB/http_credentials'
I1013 07:20:29.523530 18686 http.cpp:1045] Creating default 'basic' HTTP authenticator for
realm 'mesos-agent-executor'
I1013 07:20:29.523654 18686 http.cpp:1066] Creating default 'jwt' HTTP authenticator for realm
'mesos-agent-executor'
I1013 07:20:29.523867 18686 http.cpp:1045] Creating default 'basic' HTTP authenticator for
realm 'mesos-agent-readonly'
I1013 07:20:29.523983 18686 http.cpp:1066] Creating default 'jwt' HTTP authenticator for realm
'mesos-agent-readonly'
I1013 07:20:29.524211 18686 http.cpp:1045] Creating default 'basic' HTTP authenticator for
realm 'mesos-agent-readwrite'
I1013 07:20:29.524314 18686 http.cpp:1066] Creating default 'jwt' HTTP authenticator for realm
'mesos-agent-readwrite'
I1013 07:20:29.525728 18686 slave.cpp:585] Agent resources: [{"name":"cpus","scalar":{"value":2.0},"type":"SCALAR"},{"name":"mem","scalar":{"value":1024.0},"type":"SCALAR"},{"name":"disk","scalar":{"value":1024.0},"type":"SCALAR"},{"name":"ports","ranges":{"range":[{"begin":31000,"end":32000}]},"type":"RANGES"}]
I1013 07:20:29.525949 18686 slave.cpp:593] Agent attributes: [  ]
I1013 07:20:29.525964 18686 slave.cpp:602] Agent hostname: 2d14e7cb84b1
I1013 07:20:29.526098 18675 status_update_manager.cpp:177] Pausing sending status updates
I1013 07:20:29.527338 18667 state.cpp:64] Recovering state from '/tmp/Endpoint_SlaveEndpointTest_UnauthorizedRequest_2_xW0Syn/meta'
I1013 07:20:29.527660 18663 status_update_manager.cpp:203] Recovering status update manager
I1013 07:20:29.527825 18676 containerizer.cpp:648] Recovering containerizer
I1013 07:20:29.528981 18677 provisioner.cpp:416] Provisioner recovery complete
I1013 07:20:29.529367 18675 slave.cpp:6310] Finished recovery
I1013 07:20:29.529791 18675 slave.cpp:6492] Querying resource estimator for oversubscribable
resources
I1013 07:20:29.530006 18682 slave.cpp:6506] Received oversubscribable resources {} from the
resource estimator
I1013 07:20:29.531886 18670 process.cpp:3929] Handling HTTP event for process 'slave(830)'
with path: '/slave(830)/containers'
I1013 07:20:29.533435 18678 http.cpp:1185] HTTP GET for /slave(830)/containers from 172.17.0.2:48004
I1013 07:20:29.533499 18678 http.cpp:976] Authorizing principal 'test-principal' to GET the
'/containers' endpoint
I1013 07:20:29.535279  8529 slave.cpp:869] Agent terminating
[       OK ] Endpoint/SlaveEndpointTest.UnauthorizedRequest/2 (27 ms)
[ RUN      ] Endpoint/SlaveEndpointTest.NoAuthorizer/0
I1013 07:20:29.545641  8529 containerizer.cpp:292] Using isolation { environment_secret, posix/cpu,
posix/mem, filesystem/posix, network/cni }
W1013 07:20:29.546128  8529 backend.cpp:76] Failed to create 'aufs' backend: AufsBackend requires
root privileges
W1013 07:20:29.546241  8529 backend.cpp:76] Failed to create 'bind' backend: BindBackend requires
root privileges
I1013 07:20:29.546272  8529 provisioner.cpp:255] Using default backend 'copy'
I1013 07:20:29.547894  8529 cluster.cpp:448] Creating default 'local' authorizer
I1013 07:20:29.549839 18665 slave.cpp:254] Mesos agent started on (831)@172.17.0.2:38010
I1013 07:20:29.549860 18665 slave.cpp:255] Flags at startup: --acls="" --appc_simple_discovery_uri_prefix="http://"
--appc_store_dir="/tmp/Endpoint_SlaveEndpointTest_NoAuthorizer_0_uxCeNt/store/appc" --authenticate_http_executors="true"
--authenticate_http_readonly="true" --authenticate_http_readwrite="true" --authenticatee="crammd5"
--authentication_backoff_factor="1secs" --authorizer="local" --cgroups_cpu_enable_pids_and_tids_count="false"
--cgroups_enable_cfs="false" --cgroups_hierarchy="/sys/fs/cgroup" --cgroups_limit_swap="false"
--cgroups_root="mesos" --container_disk_watch_interval="15secs" --containerizers="mesos" --credential="/tmp/Endpoint_SlaveEndpointTest_NoAuthorizer_0_uxCeNt/credential"
--default_role="*" --disallow_sharing_agent_pid_namespace="false" --disk_watch_interval="1mins"
--docker="docker" --docker_kill_orphans="true" --docker_registry="https://registry-1.docker.io"
--docker_remove_delay="6hrs" --docker_socket="/var/run/docker.sock" --docker_stop_timeout="0ns"
--docker_store_dir="/tmp/Endpoint_SlaveEndpointTest_NoAuthorizer_0_uxCeNt/store/docker" --docker_volume_checkpoint_dir="/var/run/mesos/isolators/docker/volume"
--enforce_container_disk_quota="false" --executor_registration_timeout="1mins" --executor_reregistration_timeout="2secs"
--executor_secret_key="/tmp/Endpoint_SlaveEndpointTest_NoAuthorizer_0_uxCeNt/executor_secret_key"
--executor_shutdown_grace_period="5secs" --fetcher_cache_dir="/tmp/Endpoint_SlaveEndpointTest_NoAuthorizer_0_uxCeNt/fetch"
--fetcher_cache_size="2GB" --frameworks_home="" --gc_delay="1weeks" --gc_disk_headroom="0.1"
--hadoop_home="" --help="false" --hostname_lookup="true" --http_command_executor="false" --http_credentials="/tmp/Endpoint_SlaveEndpointTest_NoAuthorizer_0_uxCeNt/http_credentials"
--http_heartbeat_interval="30secs" --initialize_driver_logging="true" --isolation="posix/cpu,posix/mem"
--launcher="posix" --launcher_dir="/mesos/mesos-1.5.0/_build/src" --logbufsecs="0" --logging_level="INFO"
--max_completed_executors_per_framework="150" --oversubscribed_resources_interval="15secs"
--perf_duration="10secs" --perf_interval="1mins" --port="5051" --qos_correction_interval_min="0ns"
--quiet="false" --recover="reconnect" --recovery_timeout="15mins" --registration_backoff_factor="10ms"
--resources="cpus:2;gpus:0;mem:1024;disk:1024;ports:[31000-32000]" --revocable_cpu_low_priority="true"
--runtime_dir="/tmp/Endpoint_SlaveEndpointTest_NoAuthorizer_0_uxCeNt" --sandbox_directory="/mnt/mesos/sandbox"
--strict="true" --switch_user="true" --systemd_enable_support="true" --systemd_runtime_directory="/run/systemd/system"
--version="false" --work_dir="/tmp/Endpoint_SlaveEndpointTest_NoAuthorizer_0_tF2U7f" --zk_session_timeout="10secs"
I1013 07:20:29.550210 18665 credentials.hpp:86] Loading credential for authentication from
'/tmp/Endpoint_SlaveEndpointTest_NoAuthorizer_0_uxCeNt/credential'
I1013 07:20:29.550345 18665 slave.cpp:287] Agent using credential for: test-principal
I1013 07:20:29.550366 18665 credentials.hpp:37] Loading credentials for authentication from
'/tmp/Endpoint_SlaveEndpointTest_NoAuthorizer_0_uxCeNt/http_credentials'
I1013 07:20:29.550640 18665 http.cpp:1045] Creating default 'basic' HTTP authenticator for
realm 'mesos-agent-executor'
I1013 07:20:29.550750 18665 http.cpp:1066] Creating default 'jwt' HTTP authenticator for realm
'mesos-agent-executor'
I1013 07:20:29.550946 18665 http.cpp:1045] Creating default 'basic' HTTP authenticator for
realm 'mesos-agent-readonly'
I1013 07:20:29.551044 18665 http.cpp:1066] Creating default 'jwt' HTTP authenticator for realm
'mesos-agent-readonly'
I1013 07:20:29.551216 18665 http.cpp:1045] Creating default 'basic' HTTP authenticator for
realm 'mesos-agent-readwrite'
I1013 07:20:29.551312 18665 http.cpp:1066] Creating default 'jwt' HTTP authenticator for realm
'mesos-agent-readwrite'
I1013 07:20:29.552681 18665 slave.cpp:585] Agent resources: [{"name":"cpus","scalar":{"value":2.0},"type":"SCALAR"},{"name":"mem","scalar":{"value":1024.0},"type":"SCALAR"},{"name":"disk","scalar":{"value":1024.0},"type":"SCALAR"},{"name":"ports","ranges":{"range":[{"begin":31000,"end":32000}]},"type":"RANGES"}]
I1013 07:20:29.552903 18665 slave.cpp:593] Agent attributes: [  ]
I1013 07:20:29.552917 18665 slave.cpp:602] Agent hostname: 2d14e7cb84b1
I1013 07:20:29.553020 18682 status_update_manager.cpp:177] Pausing sending status updates
I1013 07:20:29.554313 18668 state.cpp:64] Recovering state from '/tmp/Endpoint_SlaveEndpointTest_NoAuthorizer_0_tF2U7f/meta'
I1013 07:20:29.554572 18678 status_update_manager.cpp:203] Recovering status update manager
I1013 07:20:29.554751 18672 containerizer.cpp:648] Recovering containerizer
I1013 07:20:29.555930 18685 provisioner.cpp:416] Provisioner recovery complete
I1013 07:20:29.556208 18682 slave.cpp:6310] Finished recovery
I1013 07:20:29.556620 18682 slave.cpp:6492] Querying resource estimator for oversubscribable
resources
I1013 07:20:29.556840 18677 slave.cpp:6506] Received oversubscribable resources {} from the
resource estimator
I1013 07:20:29.558830 18680 process.cpp:3929] Handling HTTP event for process 'slave(831)'
with path: '/slave(831)/monitor/statistics'
I1013 07:20:29.560864 18685 http.cpp:1185] HTTP GET for /slave(831)/monitor/statistics from
172.17.0.2:48006
I1013 07:20:29.560926 18685 http.cpp:976] Authorizing principal 'test-principal' to GET the
'/monitor/statistics' endpoint
I1013 07:20:29.563621 18670 slave.cpp:869] Agent terminating
[       OK ] Endpoint/SlaveEndpointTest.NoAuthorizer/0 (29 ms)
[ RUN      ] Endpoint/SlaveEndpointTest.NoAuthorizer/1
I1013 07:20:29.574946  8529 containerizer.cpp:292] Using isolation { environment_secret, posix/cpu,
posix/mem, filesystem/posix, network/cni }
W1013 07:20:29.575407  8529 backend.cpp:76] Failed to create 'aufs' backend: AufsBackend requires
root privileges
W1013 07:20:29.575516  8529 backend.cpp:76] Failed to create 'bind' backend: BindBackend requires
root privileges
I1013 07:20:29.575547  8529 provisioner.cpp:255] Using default backend 'copy'
I1013 07:20:29.577142  8529 cluster.cpp:448] Creating default 'local' authorizer
I1013 07:20:29.578996 18670 slave.cpp:254] Mesos agent started on (832)@172.17.0.2:38010
I1013 07:20:29.579021 18670 slave.cpp:255] Flags at startup: --acls="" --appc_simple_discovery_uri_prefix="http://"
--appc_store_dir="/tmp/Endpoint_SlaveEndpointTest_NoAuthorizer_1_qz8kHm/store/appc" --authenticate_http_executors="true"
--authenticate_http_readonly="true" --authenticate_http_readwrite="true" --authenticatee="crammd5"
--authentication_backoff_factor="1secs" --authorizer="local" --cgroups_cpu_enable_pids_and_tids_count="false"
--cgroups_enable_cfs="false" --cgroups_hierarchy="/sys/fs/cgroup" --cgroups_limit_swap="false"
--cgroups_root="mesos" --container_disk_watch_interval="15secs" --containerizers="mesos" --credential="/tmp/Endpoint_SlaveEndpointTest_NoAuthorizer_1_qz8kHm/credential"
--default_role="*" --disallow_sharing_agent_pid_namespace="false" --disk_watch_interval="1mins"
--docker="docker" --docker_kill_orphans="true" --docker_registry="https://registry-1.docker.io"
--docker_remove_delay="6hrs" --docker_socket="/var/run/docker.sock" --docker_stop_timeout="0ns"
--docker_store_dir="/tmp/Endpoint_SlaveEndpointTest_NoAuthorizer_1_qz8kHm/store/docker" --docker_volume_checkpoint_dir="/var/run/mesos/isolators/docker/volume"
--enforce_container_disk_quota="false" --executor_registration_timeout="1mins" --executor_reregistration_timeout="2secs"
--executor_secret_key="/tmp/Endpoint_SlaveEndpointTest_NoAuthorizer_1_qz8kHm/executor_secret_key"
--executor_shutdown_grace_period="5secs" --fetcher_cache_dir="/tmp/Endpoint_SlaveEndpointTest_NoAuthorizer_1_qz8kHm/fetch"
--fetcher_cache_size="2GB" --frameworks_home="" --gc_delay="1weeks" --gc_disk_headroom="0.1"
--hadoop_home="" --help="false" --hostname_lookup="true" --http_command_executor="false" --http_credentials="/tmp/Endpoint_SlaveEndpointTest_NoAuthorizer_1_qz8kHm/http_credentials"
--http_heartbeat_interval="30secs" --initialize_driver_logging="true" --isolation="posix/cpu,posix/mem"
--launcher="posix" --launcher_dir="/mesos/mesos-1.5.0/_build/src" --logbufsecs="0" --logging_level="INFO"
--max_completed_executors_per_framework="150" --oversubscribed_resources_interval="15secs"
--perf_duration="10secs" --perf_interval="1mins" --port="5051" --qos_correction_interval_min="0ns"
--quiet="false" --recover="reconnect" --recovery_timeout="15mins" --registration_backoff_factor="10ms"
--resources="cpus:2;gpus:0;mem:1024;disk:1024;ports:[31000-32000]" --revocable_cpu_low_priority="true"
--runtime_dir="/tmp/Endpoint_SlaveEndpointTest_NoAuthorizer_1_qz8kHm" --sandbox_directory="/mnt/mesos/sandbox"
--strict="true" --switch_user="true" --systemd_enable_support="true" --systemd_runtime_directory="/run/systemd/system"
--version="false" --work_dir="/tmp/Endpoint_SlaveEndpointTest_NoAuthorizer_1_bX3EX8" --zk_session_timeout="10secs"
I1013 07:20:29.579360 18670 credentials.hpp:86] Loading credential for authentication from
'/tmp/Endpoint_SlaveEndpointTest_NoAuthorizer_1_qz8kHm/credential'
I1013 07:20:29.579497 18670 slave.cpp:287] Agent using credential for: test-principal
I1013 07:20:29.579519 18670 credentials.hpp:37] Loading credentials for authentication from
'/tmp/Endpoint_SlaveEndpointTest_NoAuthorizer_1_qz8kHm/http_credentials'
I1013 07:20:29.579783 18670 http.cpp:1045] Creating default 'basic' HTTP authenticator for
realm 'mesos-agent-executor'
I1013 07:20:29.579895 18670 http.cpp:1066] Creating default 'jwt' HTTP authenticator for realm
'mesos-agent-executor'
I1013 07:20:29.580081 18670 http.cpp:1045] Creating default 'basic' HTTP authenticator for
realm 'mesos-agent-readonly'
I1013 07:20:29.580180 18670 http.cpp:1066] Creating default 'jwt' HTTP authenticator for realm
'mesos-agent-readonly'
I1013 07:20:29.580365 18670 http.cpp:1045] Creating default 'basic' HTTP authenticator for
realm 'mesos-agent-readwrite'
I1013 07:20:29.580466 18670 http.cpp:1066] Creating default 'jwt' HTTP authenticator for realm
'mesos-agent-readwrite'
I1013 07:20:29.581866 18670 slave.cpp:585] Agent resources: [{"name":"cpus","scalar":{"value":2.0},"type":"SCALAR"},{"name":"mem","scalar":{"value":1024.0},"type":"SCALAR"},{"name":"disk","scalar":{"value":1024.0},"type":"SCALAR"},{"name":"ports","ranges":{"range":[{"begin":31000,"end":32000}]},"type":"RANGES"}]
I1013 07:20:29.582087 18670 slave.cpp:593] Agent attributes: [  ]
I1013 07:20:29.582101 18670 slave.cpp:602] Agent hostname: 2d14e7cb84b1
I1013 07:20:29.582223 18679 status_update_manager.cpp:177] Pausing sending status updates
I1013 07:20:29.583524 18682 state.cpp:64] Recovering state from '/tmp/Endpoint_SlaveEndpointTest_NoAuthorizer_1_bX3EX8/meta'
I1013 07:20:29.583782 18666 status_update_manager.cpp:203] Recovering status update manager
I1013 07:20:29.583977 18674 containerizer.cpp:648] Recovering containerizer
I1013 07:20:29.585151 18686 provisioner.cpp:416] Provisioner recovery complete
I1013 07:20:29.585485 18686 slave.cpp:6310] Finished recovery
I1013 07:20:29.585891 18686 slave.cpp:6492] Querying resource estimator for oversubscribable
resources
I1013 07:20:29.586108 18677 slave.cpp:6506] Received oversubscribable resources {} from the
resource estimator
I1013 07:20:29.587916 18678 process.cpp:3929] Handling HTTP event for process 'slave(832)'
with path: '/slave(832)/monitor/statistics.json'
I1013 07:20:29.589476 18679 http.cpp:1185] HTTP GET for /slave(832)/monitor/statistics.json
from 172.17.0.2:48008
I1013 07:20:29.589538 18679 http.cpp:976] Authorizing principal 'test-principal' to GET the
'/monitor/statistics.json' endpoint
I1013 07:20:29.592245  8529 slave.cpp:869] Agent terminating
[       OK ] Endpoint/SlaveEndpointTest.NoAuthorizer/1 (28 ms)
[ RUN      ] Endpoint/SlaveEndpointTest.NoAuthorizer/2
I1013 07:20:29.602774  8529 containerizer.cpp:292] Using isolation { environment_secret, posix/cpu,
posix/mem, filesystem/posix, network/cni }
W1013 07:20:29.603256  8529 backend.cpp:76] Failed to create 'aufs' backend: AufsBackend requires
root privileges
W1013 07:20:29.603359  8529 backend.cpp:76] Failed to create 'bind' backend: BindBackend requires
root privileges
I1013 07:20:29.603390  8529 provisioner.cpp:255] Using default backend 'copy'
I1013 07:20:29.605031  8529 cluster.cpp:448] Creating default 'local' authorizer
I1013 07:20:29.606922 18668 slave.cpp:254] Mesos agent started on (833)@172.17.0.2:38010
I1013 07:20:29.606950 18668 slave.cpp:255] Flags at startup: --acls="" --appc_simple_discovery_uri_prefix="http://"
--appc_store_dir="/tmp/Endpoint_SlaveEndpointTest_NoAuthorizer_2_0CZdSf/store/appc" --authenticate_http_executors="true"
--authenticate_http_readonly="true" --authenticate_http_readwrite="true" --authenticatee="crammd5"
--authentication_backoff_factor="1secs" --authorizer="local" --cgroups_cpu_enable_pids_and_tids_count="false"
--cgroups_enable_cfs="false" --cgroups_hierarchy="/sys/fs/cgroup" --cgroups_limit_swap="false"
--cgroups_root="mesos" --container_disk_watch_interval="15secs" --containerizers="mesos" --credential="/tmp/Endpoint_SlaveEndpointTest_NoAuthorizer_2_0CZdSf/credential"
--default_role="*" --disallow_sharing_agent_pid_namespace="false" --disk_watch_interval="1mins"
--docker="docker" --docker_kill_orphans="true" --docker_registry="https://registry-1.docker.io"
--docker_remove_delay="6hrs" --docker_socket="/var/run/docker.sock" --docker_stop_timeout="0ns"
--docker_store_dir="/tmp/Endpoint_SlaveEndpointTest_NoAuthorizer_2_0CZdSf/store/docker" --docker_volume_checkpoint_dir="/var/run/mesos/isolators/docker/volume"
--enforce_container_disk_quota="false" --executor_registration_timeout="1mins" --executor_reregistration_timeout="2secs"
--executor_secret_key="/tmp/Endpoint_SlaveEndpointTest_NoAuthorizer_2_0CZdSf/executor_secret_key"
--executor_shutdown_grace_period="5secs" --fetcher_cache_dir="/tmp/Endpoint_SlaveEndpointTest_NoAuthorizer_2_0CZdSf/fetch"
--fetcher_cache_size="2GB" --frameworks_home="" --gc_delay="1weeks" --gc_disk_headroom="0.1"
--hadoop_home="" --help="false" --hostname_lookup="true" --http_command_executor="false" --http_credentials="/tmp/Endpoint_SlaveEndpointTest_NoAuthorizer_2_0CZdSf/http_credentials"
--http_heartbeat_interval="30secs" --initialize_driver_logging="true" --isolation="posix/cpu,posix/mem"
--launcher="posix" --launcher_dir="/mesos/mesos-1.5.0/_build/src" --logbufsecs="0" --logging_level="INFO"
--max_completed_executors_per_framework="150" --oversubscribed_resources_interval="15secs"
--perf_duration="10secs" --perf_interval="1mins" --port="5051" --qos_correction_interval_min="0ns"
--quiet="false" --recover="reconnect" --recovery_timeout="15mins" --registration_backoff_factor="10ms"
--resources="cpus:2;gpus:0;mem:1024;disk:1024;ports:[31000-32000]" --revocable_cpu_low_priority="true"
--runtime_dir="/tmp/Endpoint_SlaveEndpointTest_NoAuthorizer_2_0CZdSf" --sandbox_directory="/mnt/mesos/sandbox"
--strict="true" --switch_user="true" --systemd_enable_support="true" --systemd_runtime_directory="/run/systemd/system"
--version="false" --work_dir="/tmp/Endpoint_SlaveEndpointTest_NoAuthorizer_2_BD4o41" --zk_session_timeout="10secs"
I1013 07:20:29.607292 18668 credentials.hpp:86] Loading credential for authentication from
'/tmp/Endpoint_SlaveEndpointTest_NoAuthorizer_2_0CZdSf/credential'
I1013 07:20:29.607429 18668 slave.cpp:287] Agent using credential for: test-principal
I1013 07:20:29.607450 18668 credentials.hpp:37] Loading credentials for authentication from
'/tmp/Endpoint_SlaveEndpointTest_NoAuthorizer_2_0CZdSf/http_credentials'
I1013 07:20:29.607712 18668 http.cpp:1045] Creating default 'basic' HTTP authenticator for
realm 'mesos-agent-executor'
I1013 07:20:29.607825 18668 http.cpp:1066] Creating default 'jwt' HTTP authenticator for realm
'mesos-agent-executor'
I1013 07:20:29.608012 18668 http.cpp:1045] Creating default 'basic' HTTP authenticator for
realm 'mesos-agent-readonly'
I1013 07:20:29.608110 18668 http.cpp:1066] Creating default 'jwt' HTTP authenticator for realm
'mesos-agent-readonly'
I1013 07:20:29.608286 18668 http.cpp:1045] Creating default 'basic' HTTP authenticator for
realm 'mesos-agent-readwrite'
I1013 07:20:29.608386 18668 http.cpp:1066] Creating default 'jwt' HTTP authenticator for realm
'mesos-agent-readwrite'
I1013 07:20:29.609762 18668 slave.cpp:585] Agent resources: [{"name":"cpus","scalar":{"value":2.0},"type":"SCALAR"},{"name":"mem","scalar":{"value":1024.0},"type":"SCALAR"},{"name":"disk","scalar":{"value":1024.0},"type":"SCALAR"},{"name":"ports","ranges":{"range":[{"begin":31000,"end":32000}]},"type":"RANGES"}]
I1013 07:20:29.609985 18668 slave.cpp:593] Agent attributes: [  ]
I1013 07:20:29.609997 18668 slave.cpp:602] Agent hostname: 2d14e7cb84b1
I1013 07:20:29.610100 18681 status_update_manager.cpp:177] Pausing sending status updates
I1013 07:20:29.611338 18670 state.cpp:64] Recovering state from '/tmp/Endpoint_SlaveEndpointTest_NoAuthorizer_2_BD4o41/meta'
I1013 07:20:29.611572 18685 status_update_manager.cpp:203] Recovering status update manager
I1013 07:20:29.611759 18682 containerizer.cpp:648] Recovering containerizer
I1013 07:20:29.612948 18671 provisioner.cpp:416] Provisioner recovery complete
I1013 07:20:29.613258 18681 slave.cpp:6310] Finished recovery
I1013 07:20:29.613677 18681 slave.cpp:6492] Querying resource estimator for oversubscribable
resources
I1013 07:20:29.613905 18670 slave.cpp:6506] Received oversubscribable resources {} from the
resource estimator
I1013 07:20:29.615814 18683 process.cpp:3929] Handling HTTP event for process 'slave(833)'
with path: '/slave(833)/containers'
I1013 07:20:29.617604 18671 http.cpp:1185] HTTP GET for /slave(833)/containers from 172.17.0.2:48010
I1013 07:20:29.617666 18671 http.cpp:976] Authorizing principal 'test-principal' to GET the
'/containers' endpoint
I1013 07:20:29.620525 18670 slave.cpp:869] Agent terminating
[       OK ] Endpoint/SlaveEndpointTest.NoAuthorizer/2 (28 ms)
[----------] 9 tests from Endpoint/SlaveEndpointTest (251 ms total)

[----------] 2 tests from ContainerizerType/DefaultContainerDNSFlagTest
[ RUN      ] ContainerizerType/DefaultContainerDNSFlagTest.ValidateFlag/0
[       OK ] ContainerizerType/DefaultContainerDNSFlagTest.ValidateFlag/0 (10 ms)
[ RUN      ] ContainerizerType/DefaultContainerDNSFlagTest.ValidateFlag/1
[       OK ] ContainerizerType/DefaultContainerDNSFlagTest.ValidateFlag/1 (9 ms)
[----------] 2 tests from ContainerizerType/DefaultContainerDNSFlagTest (19 ms total)

[----------] Global test environment tear-down
[==========] 1703 tests from 187 test cases ran. (623533 ms total)
[  PASSED  ] 1702 tests.
[  FAILED  ] 1 test, listed below:
[  FAILED  ] MasterTest.IgnoreOldAgentReregistration

 1 FAILED TEST
  YOU HAVE 21 DISABLED TESTS

I1013 07:20:29.708969 18687 process.cpp:1068] Failed to accept socket: future discarded
make[4]: *** [check-local] Error 1
make[4]: Leaving directory `/mesos/mesos-1.5.0/_build/src'
make[3]: *** [check-am] Error 2
make[3]: Leaving directory `/mesos/mesos-1.5.0/_build/src'
make[2]: *** [check] Error 2
make[2]: Leaving directory `/mesos/mesos-1.5.0/_build/src'
make[1]: *** [check-recursive] Error 1
make[1]: Leaving directory `/mesos/mesos-1.5.0/_build'
make: *** [distcheck] Error 1
+ docker rmi mesos-1507875521-6241
Untagged: mesos-1507875521-6241:latest
Deleted: sha256:8bc3247deda2ae6486991e435034612fa578634965ef86b1e894c5543cc67777
Deleted: sha256:b0f4d86a2a1da344098238d606bcd7f24619121e0874e7c2d2c64d51575daa99
Deleted: sha256:2383b154c27b8fa57df8023eff4075e6cb5348f99beaa4f0925fad09b7a87e09
Deleted: sha256:b0cd04191aaa63e94835978face2304138a4aee2f473512ab54ab135ca31310e
Deleted: sha256:aef3850de0f7d71397b548187d5a0905e73b655aa3ffc1e71f9d85ab85f2e7ba
Deleted: sha256:a7945da704ae95e97c728b9c98a6ad7b3c2599f0028388fb98f89b27ed705648
Deleted: sha256:2342b298a082691821aaa327eac36f646719dc8cdfd5777adf9c51f4d730ce40
Deleted: sha256:8699c9edf405a47a0ea5d2f9a1edda75ff57b1b8d2e4adadf200090e1aa88220
Deleted: sha256:4adc4b8845e74d175da63877d8ed84bad4a5179df9e8eadbe8b96deff70e0d8d
Deleted: sha256:0d2b3356d161485d89c1cecc06def67db20fa19c4f0dd9ab0dc316ad09df8ef6
Deleted: sha256:39036a1e5e58279d138e98f5e3d4cd5e622b3297e9a1df40cf5637f39379f375
Deleted: sha256:361879d673c5e35ccd3951f5a56359be882c8ee1a25f46864f390ee2f2d15917
Deleted: sha256:3166a9eda7279215edc475dae81d920d3a895af46999237c464503d0cf5e946d
Deleted: sha256:ab42f1d2a5b8a78c3c77f16bf0043d7010841c22c0362e5fe70151c432e60353
Deleted: sha256:ed2b4ea46459421757d4311c097c0e5ff127402453346008582dbef06b7054f3
Deleted: sha256:a13517d115ae85ed75411021f3df7cc0d98c1b3b06f4789a69c665747026c6f7
Deleted: sha256:2cb731314538f3f96952fb7827122cd174e785305c0b2ffaf14cf5933c93801b
Deleted: sha256:60bd056179d57f0f4b8ffec4cb14cae3dc1dfb37f2c4eef17cad01153ddf091b
Deleted: sha256:c43627213a265c65f1fd23475f1f37e3fe74b1f26c313e3a1d67f4a8944aed2e
Deleted: sha256:78c3eb1fd9aefc21338e991967abc65e830b9223e945ee3ed725d858924ce28a
Deleted: sha256:3ed331316fc6e6f1bbf11ed5297ba65084bf843d324e0dc7ec44a067e70de4f2
Deleted: sha256:48c11cac60477fb069e8c922ba8c5bb1dc31bd62fafec04e8170ced05cc25969
Deleted: sha256:8faeeb177272d2684d3b5e084591280da39b3b02ba1809a7a7387e41c1823ea1
Deleted: sha256:5effa4e7a1f2e3006f2e8152842be185cadfe219d1f7a4c45599a87fba9ef4e7
Deleted: sha256:71dd31906d3babb92dd90d1670aafac5c5cc9b5fa516af28e35078642b1df073
Deleted: sha256:55af52c8146355df3832dccf3b5260524a9cf93489e2cee93af19ce51447c268
Deleted: sha256:a1ad9ba490990181fafe2f9b6654d1c0331db5f7ca6f09919f125280fe54d6df
Deleted: sha256:3c08bb4c7f483471f1e0f54cedfdfa00d83356e41937e496b86a69f49813e0e4
Build step 'Execute shell' marked build as failure
Not sending mail to unregistered user xujyan@apple.com
Not sending mail to unregistered user yujie.jay@gmail.com
Not sending mail to unregistered user songzihao1990@gmail.com


Mime
View raw message