mesos-builds mailing list archives

Site index · List index
Message view « Date » · « Thread »
Top « Date » · « Thread »
From Apache Jenkins Server <jenk...@builds.apache.org>
Subject Build failed in Jenkins: Mesos-Buildbot » autotools,gcc,--verbose --disable-libtool-wrappers,GLOG_v=1 MESOS_VERBOSE=1,centos:7,(ubuntu)&&(!ubuntu-us1)&&(!ubuntu-eu2)&&(!qnode3)&&(!H23) #4375
Date Mon, 30 Oct 2017 12:18:01 GMT
See <https://builds.apache.org/job/Mesos-Buildbot/BUILDTOOL=autotools,COMPILER=gcc,CONFIGURATION=--verbose%20--disable-libtool-wrappers,ENVIRONMENT=GLOG_v=1%20MESOS_VERBOSE=1,OS=centos%3A7,label_exp=(ubuntu)&&(!ubuntu-us1)&&(!ubuntu-eu2)&&(!qnode3)&&(!H23)/4375/display/redirect?page=changes>

Changes:

[alexr] Fixed the flaky SlaveTest.HTTPSchedulerSlaveRestart.

------------------------------------------
[...truncated 32.17 MB...]
I1030 12:17:28.672405  6139 http.cpp:1185] HTTP GET for /slave(818)/monitor/statistics.json
from 172.17.0.3:45774
I1030 12:17:28.672528  6139 http.cpp:976] Authorizing principal 'test-principal' to GET the
'/monitor/statistics.json' endpoint
I1030 12:17:28.720273  6137 slave.cpp:869] Agent terminating
[       OK ] Endpoint/SlaveEndpointTest.AuthorizedRequest/1 (209 ms)
[ RUN      ] Endpoint/SlaveEndpointTest.AuthorizedRequest/2
I1030 12:17:28.798208  6137 containerizer.cpp:301] Using isolation { environment_secret, posix/cpu,
posix/mem, filesystem/posix, network/cni }
W1030 12:17:28.799556  6137 backend.cpp:76] Failed to create 'aufs' backend: AufsBackend requires
root privileges
W1030 12:17:28.799706  6137 backend.cpp:76] Failed to create 'bind' backend: BindBackend requires
root privileges
I1030 12:17:28.799747  6137 provisioner.cpp:255] Using default backend 'copy'
I1030 12:17:28.812095  6138 slave.cpp:254] Mesos agent started on (819)@172.17.0.3:41346
I1030 12:17:28.812165  6138 slave.cpp:255] Flags at startup: --acls="" --appc_simple_discovery_uri_prefix="http://"
--appc_store_dir="/tmp/Endpoint_SlaveEndpointTest_AuthorizedRequest_2_TcJwUY/store/appc" --authenticate_http_readonly="true"
--authenticate_http_readwrite="true" --authenticatee="crammd5" --authentication_backoff_factor="1secs"
--authorizer="local" --cgroups_cpu_enable_pids_and_tids_count="false" --cgroups_enable_cfs="false"
--cgroups_hierarchy="/sys/fs/cgroup" --cgroups_limit_swap="false" --cgroups_root="mesos" --container_disk_watch_interval="15secs"
--containerizers="mesos" --credential="/tmp/Endpoint_SlaveEndpointTest_AuthorizedRequest_2_TcJwUY/credential"
--default_role="*" --disallow_sharing_agent_pid_namespace="false" --disk_watch_interval="1mins"
--docker="docker" --docker_kill_orphans="true" --docker_registry="https://registry-1.docker.io"
--docker_remove_delay="6hrs" --docker_socket="/var/run/docker.sock" --docker_stop_timeout="0ns"
--docker_store_dir="/tmp/Endpoint_SlaveEndpointTest_AuthorizedRequest_2_TcJwUY/store/docker"
--docker_volume_checkpoint_dir="/var/run/mesos/isolators/docker/volume" --enforce_container_disk_quota="false"
--executor_registration_timeout="1mins" --executor_reregistration_timeout="2secs" --executor_shutdown_grace_period="5secs"
--fetcher_cache_dir="/tmp/Endpoint_SlaveEndpointTest_AuthorizedRequest_2_TcJwUY/fetch" --fetcher_cache_size="2GB"
--frameworks_home="" --gc_delay="1weeks" --gc_disk_headroom="0.1" --hadoop_home="" --help="false"
--hostname_lookup="true" --http_command_executor="false" --http_credentials="/tmp/Endpoint_SlaveEndpointTest_AuthorizedRequest_2_TcJwUY/http_credentials"
--http_heartbeat_interval="30secs" --initialize_driver_logging="true" --isolation="posix/cpu,posix/mem"
--launcher="posix" --launcher_dir="/mesos/mesos-1.5.0/_build/src" --logbufsecs="0" --logging_level="INFO"
--max_completed_executors_per_framework="150" --oversubscribed_resources_interval="15secs"
--perf_duration="10secs" --perf_interval="1mins" --port="5051" --qos_correction_interval_min="0ns"
--quiet="false" --recover="reconnect" --recovery_timeout="15mins" --registration_backoff_factor="10ms"
--resources="cpus:2;gpus:0;mem:1024;disk:1024;ports:[31000-32000]" --revocable_cpu_low_priority="true"
--runtime_dir="/tmp/Endpoint_SlaveEndpointTest_AuthorizedRequest_2_TcJwUY" --sandbox_directory="/mnt/mesos/sandbox"
--strict="true" --switch_user="true" --systemd_enable_support="true" --systemd_runtime_directory="/run/systemd/system"
--version="false" --work_dir="/tmp/Endpoint_SlaveEndpointTest_AuthorizedRequest_2_LEOZxZ"
--zk_session_timeout="10secs"
I1030 12:17:28.812726  6138 credentials.hpp:86] Loading credential for authentication from
'/tmp/Endpoint_SlaveEndpointTest_AuthorizedRequest_2_TcJwUY/credential'
I1030 12:17:28.813014  6138 slave.cpp:287] Agent using credential for: test-principal
I1030 12:17:28.813036  6138 credentials.hpp:37] Loading credentials for authentication from
'/tmp/Endpoint_SlaveEndpointTest_AuthorizedRequest_2_TcJwUY/http_credentials'
I1030 12:17:28.813289  6138 http.cpp:1045] Creating default 'basic' HTTP authenticator for
realm 'mesos-agent-readonly'
I1030 12:17:28.813942  6138 http.cpp:1045] Creating default 'basic' HTTP authenticator for
realm 'mesos-agent-readwrite'
I1030 12:17:28.815681  6138 slave.cpp:585] Agent resources: [{"name":"cpus","scalar":{"value":2.0},"type":"SCALAR"},{"name":"mem","scalar":{"value":1024.0},"type":"SCALAR"},{"name":"disk","scalar":{"value":1024.0},"type":"SCALAR"},{"name":"ports","ranges":{"range":[{"begin":31000,"end":32000}]},"type":"RANGES"}]
I1030 12:17:28.820286  6138 slave.cpp:593] Agent attributes: [  ]
I1030 12:17:28.820405  6138 slave.cpp:602] Agent hostname: b5354a82d111
I1030 12:17:28.821631  6142 status_update_manager.cpp:177] Pausing sending status updates
I1030 12:17:28.823861  6140 state.cpp:64] Recovering state from '/tmp/Endpoint_SlaveEndpointTest_AuthorizedRequest_2_LEOZxZ/meta'
I1030 12:17:28.828320  6138 status_update_manager.cpp:203] Recovering status update manager
I1030 12:17:28.828822  6139 containerizer.cpp:662] Recovering containerizer
I1030 12:17:28.830971  6139 provisioner.cpp:416] Provisioner recovery complete
I1030 12:17:28.831423  6144 slave.cpp:6322] Finished recovery
I1030 12:17:28.839721  6142 process.cpp:3938] Handling HTTP event for process 'slave(819)'
with path: '/slave(819)/containers'
I1030 12:17:28.841858  6142 http.cpp:1185] HTTP GET for /slave(819)/containers from 172.17.0.3:45776
I1030 12:17:28.841956  6142 http.cpp:976] Authorizing principal 'test-principal' to GET the
'/containers' endpoint
I1030 12:17:28.876441  6137 slave.cpp:869] Agent terminating
[       OK ] Endpoint/SlaveEndpointTest.AuthorizedRequest/2 (139 ms)
[ RUN      ] Endpoint/SlaveEndpointTest.UnauthorizedRequest/0
I1030 12:17:28.939425  6137 containerizer.cpp:301] Using isolation { environment_secret, posix/cpu,
posix/mem, filesystem/posix, network/cni }
W1030 12:17:28.940573  6137 backend.cpp:76] Failed to create 'aufs' backend: AufsBackend requires
root privileges
W1030 12:17:28.943711  6137 backend.cpp:76] Failed to create 'bind' backend: BindBackend requires
root privileges
I1030 12:17:28.944085  6137 provisioner.cpp:255] Using default backend 'copy'
I1030 12:17:28.956238  6141 slave.cpp:254] Mesos agent started on (820)@172.17.0.3:41346
I1030 12:17:28.956293  6141 slave.cpp:255] Flags at startup: --acls="" --appc_simple_discovery_uri_prefix="http://"
--appc_store_dir="/tmp/Endpoint_SlaveEndpointTest_UnauthorizedRequest_0_84fwHX/store/appc"
--authenticate_http_readonly="true" --authenticate_http_readwrite="true" --authenticatee="crammd5"
--authentication_backoff_factor="1secs" --authorizer="local" --cgroups_cpu_enable_pids_and_tids_count="false"
--cgroups_enable_cfs="false" --cgroups_hierarchy="/sys/fs/cgroup" --cgroups_limit_swap="false"
--cgroups_root="mesos" --container_disk_watch_interval="15secs" --containerizers="mesos" --credential="/tmp/Endpoint_SlaveEndpointTest_UnauthorizedRequest_0_84fwHX/credential"
--default_role="*" --disallow_sharing_agent_pid_namespace="false" --disk_watch_interval="1mins"
--docker="docker" --docker_kill_orphans="true" --docker_registry="https://registry-1.docker.io"
--docker_remove_delay="6hrs" --docker_socket="/var/run/docker.sock" --docker_stop_timeout="0ns"
--docker_store_dir="/tmp/Endpoint_SlaveEndpointTest_UnauthorizedRequest_0_84fwHX/store/docker"
--docker_volume_checkpoint_dir="/var/run/mesos/isolators/docker/volume" --enforce_container_disk_quota="false"
--executor_registration_timeout="1mins" --executor_reregistration_timeout="2secs" --executor_shutdown_grace_period="5secs"
--fetcher_cache_dir="/tmp/Endpoint_SlaveEndpointTest_UnauthorizedRequest_0_84fwHX/fetch" --fetcher_cache_size="2GB"
--frameworks_home="" --gc_delay="1weeks" --gc_disk_headroom="0.1" --hadoop_home="" --help="false"
--hostname_lookup="true" --http_command_executor="false" --http_credentials="/tmp/Endpoint_SlaveEndpointTest_UnauthorizedRequest_0_84fwHX/http_credentials"
--http_heartbeat_interval="30secs" --initialize_driver_logging="true" --isolation="posix/cpu,posix/mem"
--launcher="posix" --launcher_dir="/mesos/mesos-1.5.0/_build/src" --logbufsecs="0" --logging_level="INFO"
--max_completed_executors_per_framework="150" --oversubscribed_resources_interval="15secs"
--perf_duration="10secs" --perf_interval="1mins" --port="5051" --qos_correction_interval_min="0ns"
--quiet="false" --recover="reconnect" --recovery_timeout="15mins" --registration_backoff_factor="10ms"
--resources="cpus:2;gpus:0;mem:1024;disk:1024;ports:[31000-32000]" --revocable_cpu_low_priority="true"
--runtime_dir="/tmp/Endpoint_SlaveEndpointTest_UnauthorizedRequest_0_84fwHX" --sandbox_directory="/mnt/mesos/sandbox"
--strict="true" --switch_user="true" --systemd_enable_support="true" --systemd_runtime_directory="/run/systemd/system"
--version="false" --work_dir="/tmp/Endpoint_SlaveEndpointTest_UnauthorizedRequest_0_j4mBVX"
--zk_session_timeout="10secs"
I1030 12:17:28.957013  6141 credentials.hpp:86] Loading credential for authentication from
'/tmp/Endpoint_SlaveEndpointTest_UnauthorizedRequest_0_84fwHX/credential'
I1030 12:17:28.957376  6141 slave.cpp:287] Agent using credential for: test-principal
I1030 12:17:28.957428  6141 credentials.hpp:37] Loading credentials for authentication from
'/tmp/Endpoint_SlaveEndpointTest_UnauthorizedRequest_0_84fwHX/http_credentials'
I1030 12:17:28.957799  6141 http.cpp:1045] Creating default 'basic' HTTP authenticator for
realm 'mesos-agent-readonly'
I1030 12:17:28.958287  6141 http.cpp:1045] Creating default 'basic' HTTP authenticator for
realm 'mesos-agent-readwrite'
I1030 12:17:28.961050  6141 slave.cpp:585] Agent resources: [{"name":"cpus","scalar":{"value":2.0},"type":"SCALAR"},{"name":"mem","scalar":{"value":1024.0},"type":"SCALAR"},{"name":"disk","scalar":{"value":1024.0},"type":"SCALAR"},{"name":"ports","ranges":{"range":[{"begin":31000,"end":32000}]},"type":"RANGES"}]
I1030 12:17:28.961302  6141 slave.cpp:593] Agent attributes: [  ]
I1030 12:17:28.961324  6141 slave.cpp:602] Agent hostname: b5354a82d111
I1030 12:17:28.963598  6140 status_update_manager.cpp:177] Pausing sending status updates
I1030 12:17:28.972183  6143 state.cpp:64] Recovering state from '/tmp/Endpoint_SlaveEndpointTest_UnauthorizedRequest_0_j4mBVX/meta'
I1030 12:17:28.972779  6143 status_update_manager.cpp:203] Recovering status update manager
I1030 12:17:28.973059  6142 containerizer.cpp:662] Recovering containerizer
I1030 12:17:28.975458  6142 provisioner.cpp:416] Provisioner recovery complete
I1030 12:17:28.976214  6143 slave.cpp:6322] Finished recovery
I1030 12:17:28.989289  6142 process.cpp:3938] Handling HTTP event for process 'slave(820)'
with path: '/slave(820)/monitor/statistics'
I1030 12:17:28.991657  6138 http.cpp:1185] HTTP GET for /slave(820)/monitor/statistics from
172.17.0.3:45778
I1030 12:17:28.991785  6138 http.cpp:976] Authorizing principal 'test-principal' to GET the
'/monitor/statistics' endpoint
I1030 12:17:29.013537  6139 slave.cpp:869] Agent terminating
[       OK ] Endpoint/SlaveEndpointTest.UnauthorizedRequest/0 (170 ms)
[ RUN      ] Endpoint/SlaveEndpointTest.UnauthorizedRequest/1
I1030 12:17:29.103744  6137 containerizer.cpp:301] Using isolation { environment_secret, posix/cpu,
posix/mem, filesystem/posix, network/cni }
W1030 12:17:29.107905  6137 backend.cpp:76] Failed to create 'aufs' backend: AufsBackend requires
root privileges
W1030 12:17:29.108908  6137 backend.cpp:76] Failed to create 'bind' backend: BindBackend requires
root privileges
I1030 12:17:29.109151  6137 provisioner.cpp:255] Using default backend 'copy'
I1030 12:17:29.121868  6143 slave.cpp:254] Mesos agent started on (821)@172.17.0.3:41346
I1030 12:17:29.122097  6143 slave.cpp:255] Flags at startup: --acls="" --appc_simple_discovery_uri_prefix="http://"
--appc_store_dir="/tmp/Endpoint_SlaveEndpointTest_UnauthorizedRequest_1_fFWnjY/store/appc"
--authenticate_http_readonly="true" --authenticate_http_readwrite="true" --authenticatee="crammd5"
--authentication_backoff_factor="1secs" --authorizer="local" --cgroups_cpu_enable_pids_and_tids_count="false"
--cgroups_enable_cfs="false" --cgroups_hierarchy="/sys/fs/cgroup" --cgroups_limit_swap="false"
--cgroups_root="mesos" --container_disk_watch_interval="15secs" --containerizers="mesos" --credential="/tmp/Endpoint_SlaveEndpointTest_UnauthorizedRequest_1_fFWnjY/credential"
--default_role="*" --disallow_sharing_agent_pid_namespace="false" --disk_watch_interval="1mins"
--docker="docker" --docker_kill_orphans="true" --docker_registry="https://registry-1.docker.io"
--docker_remove_delay="6hrs" --docker_socket="/var/run/docker.sock" --docker_stop_timeout="0ns"
--docker_store_dir="/tmp/Endpoint_SlaveEndpointTest_UnauthorizedRequest_1_fFWnjY/store/docker"
--docker_volume_checkpoint_dir="/var/run/mesos/isolators/docker/volume" --enforce_container_disk_quota="false"
--executor_registration_timeout="1mins" --executor_reregistration_timeout="2secs" --executor_shutdown_grace_period="5secs"
--fetcher_cache_dir="/tmp/Endpoint_SlaveEndpointTest_UnauthorizedRequest_1_fFWnjY/fetch" --fetcher_cache_size="2GB"
--frameworks_home="" --gc_delay="1weeks" --gc_disk_headroom="0.1" --hadoop_home="" --help="false"
--hostname_lookup="true" --http_command_executor="false" --http_credentials="/tmp/Endpoint_SlaveEndpointTest_UnauthorizedRequest_1_fFWnjY/http_credentials"
--http_heartbeat_interval="30secs" --initialize_driver_logging="true" --isolation="posix/cpu,posix/mem"
--launcher="posix" --launcher_dir="/mesos/mesos-1.5.0/_build/src" --logbufsecs="0" --logging_level="INFO"
--max_completed_executors_per_framework="150" --oversubscribed_resources_interval="15secs"
--perf_duration="10secs" --perf_interval="1mins" --port="5051" --qos_correction_interval_min="0ns"
--quiet="false" --recover="reconnect" --recovery_timeout="15mins" --registration_backoff_factor="10ms"
--resources="cpus:2;gpus:0;mem:1024;disk:1024;ports:[31000-32000]" --revocable_cpu_low_priority="true"
--runtime_dir="/tmp/Endpoint_SlaveEndpointTest_UnauthorizedRequest_1_fFWnjY" --sandbox_directory="/mnt/mesos/sandbox"
--strict="true" --switch_user="true" --systemd_enable_support="true" --systemd_runtime_directory="/run/systemd/system"
--version="false" --work_dir="/tmp/Endpoint_SlaveEndpointTest_UnauthorizedRequest_1_Ya4D4X"
--zk_session_timeout="10secs"
I1030 12:17:29.125162  6143 credentials.hpp:86] Loading credential for authentication from
'/tmp/Endpoint_SlaveEndpointTest_UnauthorizedRequest_1_fFWnjY/credential'
I1030 12:17:29.125696  6143 slave.cpp:287] Agent using credential for: test-principal
I1030 12:17:29.126060  6143 credentials.hpp:37] Loading credentials for authentication from
'/tmp/Endpoint_SlaveEndpointTest_UnauthorizedRequest_1_fFWnjY/http_credentials'
I1030 12:17:29.126586  6143 http.cpp:1045] Creating default 'basic' HTTP authenticator for
realm 'mesos-agent-readonly'
I1030 12:17:29.127113  6143 http.cpp:1045] Creating default 'basic' HTTP authenticator for
realm 'mesos-agent-readwrite'
I1030 12:17:29.129436  6143 slave.cpp:585] Agent resources: [{"name":"cpus","scalar":{"value":2.0},"type":"SCALAR"},{"name":"mem","scalar":{"value":1024.0},"type":"SCALAR"},{"name":"disk","scalar":{"value":1024.0},"type":"SCALAR"},{"name":"ports","ranges":{"range":[{"begin":31000,"end":32000}]},"type":"RANGES"}]
I1030 12:17:29.129820  6143 slave.cpp:593] Agent attributes: [  ]
I1030 12:17:29.129971  6143 slave.cpp:602] Agent hostname: b5354a82d111
I1030 12:17:29.130725  6140 status_update_manager.cpp:177] Pausing sending status updates
I1030 12:17:29.133316  6143 state.cpp:64] Recovering state from '/tmp/Endpoint_SlaveEndpointTest_UnauthorizedRequest_1_Ya4D4X/meta'
I1030 12:17:29.134085  6143 status_update_manager.cpp:203] Recovering status update manager
I1030 12:17:29.135059  6140 containerizer.cpp:662] Recovering containerizer
I1030 12:17:29.139308  6144 provisioner.cpp:416] Provisioner recovery complete
I1030 12:17:29.143229  6138 slave.cpp:6322] Finished recovery
I1030 12:17:29.156177  6144 process.cpp:3938] Handling HTTP event for process 'slave(821)'
with path: '/slave(821)/monitor/statistics.json'
I1030 12:17:29.159298  6144 http.cpp:1185] HTTP GET for /slave(821)/monitor/statistics.json
from 172.17.0.3:45780
I1030 12:17:29.160116  6144 http.cpp:976] Authorizing principal 'test-principal' to GET the
'/monitor/statistics.json' endpoint
I1030 12:17:29.177170  6137 slave.cpp:869] Agent terminating
[       OK ] Endpoint/SlaveEndpointTest.UnauthorizedRequest/1 (166 ms)
[ RUN      ] Endpoint/SlaveEndpointTest.UnauthorizedRequest/2
I1030 12:17:29.273617  6137 containerizer.cpp:301] Using isolation { environment_secret, posix/cpu,
posix/mem, filesystem/posix, network/cni }
W1030 12:17:29.276451  6137 backend.cpp:76] Failed to create 'aufs' backend: AufsBackend requires
root privileges
W1030 12:17:29.276826  6137 backend.cpp:76] Failed to create 'bind' backend: BindBackend requires
root privileges
I1030 12:17:29.276906  6137 provisioner.cpp:255] Using default backend 'copy'
I1030 12:17:29.290148  6142 slave.cpp:254] Mesos agent started on (822)@172.17.0.3:41346
I1030 12:17:29.290271  6142 slave.cpp:255] Flags at startup: --acls="" --appc_simple_discovery_uri_prefix="http://"
--appc_store_dir="/tmp/Endpoint_SlaveEndpointTest_UnauthorizedRequest_2_dnIKP0/store/appc"
--authenticate_http_readonly="true" --authenticate_http_readwrite="true" --authenticatee="crammd5"
--authentication_backoff_factor="1secs" --authorizer="local" --cgroups_cpu_enable_pids_and_tids_count="false"
--cgroups_enable_cfs="false" --cgroups_hierarchy="/sys/fs/cgroup" --cgroups_limit_swap="false"
--cgroups_root="mesos" --container_disk_watch_interval="15secs" --containerizers="mesos" --credential="/tmp/Endpoint_SlaveEndpointTest_UnauthorizedRequest_2_dnIKP0/credential"
--default_role="*" --disallow_sharing_agent_pid_namespace="false" --disk_watch_interval="1mins"
--docker="docker" --docker_kill_orphans="true" --docker_registry="https://registry-1.docker.io"
--docker_remove_delay="6hrs" --docker_socket="/var/run/docker.sock" --docker_stop_timeout="0ns"
--docker_store_dir="/tmp/Endpoint_SlaveEndpointTest_UnauthorizedRequest_2_dnIKP0/store/docker"
--docker_volume_checkpoint_dir="/var/run/mesos/isolators/docker/volume" --enforce_container_disk_quota="false"
--executor_registration_timeout="1mins" --executor_reregistration_timeout="2secs" --executor_shutdown_grace_period="5secs"
--fetcher_cache_dir="/tmp/Endpoint_SlaveEndpointTest_UnauthorizedRequest_2_dnIKP0/fetch" --fetcher_cache_size="2GB"
--frameworks_home="" --gc_delay="1weeks" --gc_disk_headroom="0.1" --hadoop_home="" --help="false"
--hostname_lookup="true" --http_command_executor="false" --http_credentials="/tmp/Endpoint_SlaveEndpointTest_UnauthorizedRequest_2_dnIKP0/http_credentials"
--http_heartbeat_interval="30secs" --initialize_driver_logging="true" --isolation="posix/cpu,posix/mem"
--launcher="posix" --launcher_dir="/mesos/mesos-1.5.0/_build/src" --logbufsecs="0" --logging_level="INFO"
--max_completed_executors_per_framework="150" --oversubscribed_resources_interval="15secs"
--perf_duration="10secs" --perf_interval="1mins" --port="5051" --qos_correction_interval_min="0ns"
--quiet="false" --recover="reconnect" --recovery_timeout="15mins" --registration_backoff_factor="10ms"
--resources="cpus:2;gpus:0;mem:1024;disk:1024;ports:[31000-32000]" --revocable_cpu_low_priority="true"
--runtime_dir="/tmp/Endpoint_SlaveEndpointTest_UnauthorizedRequest_2_dnIKP0" --sandbox_directory="/mnt/mesos/sandbox"
--strict="true" --switch_user="true" --systemd_enable_support="true" --systemd_runtime_directory="/run/systemd/system"
--version="false" --work_dir="/tmp/Endpoint_SlaveEndpointTest_UnauthorizedRequest_2_Wf9d7Z"
--zk_session_timeout="10secs"
I1030 12:17:29.291916  6142 credentials.hpp:86] Loading credential for authentication from
'/tmp/Endpoint_SlaveEndpointTest_UnauthorizedRequest_2_dnIKP0/credential'
I1030 12:17:29.292307  6142 slave.cpp:287] Agent using credential for: test-principal
I1030 12:17:29.292366  6142 credentials.hpp:37] Loading credentials for authentication from
'/tmp/Endpoint_SlaveEndpointTest_UnauthorizedRequest_2_dnIKP0/http_credentials'
I1030 12:17:29.292711  6142 http.cpp:1045] Creating default 'basic' HTTP authenticator for
realm 'mesos-agent-readonly'
I1030 12:17:29.293181  6142 http.cpp:1045] Creating default 'basic' HTTP authenticator for
realm 'mesos-agent-readwrite'
I1030 12:17:29.295361  6142 slave.cpp:585] Agent resources: [{"name":"cpus","scalar":{"value":2.0},"type":"SCALAR"},{"name":"mem","scalar":{"value":1024.0},"type":"SCALAR"},{"name":"disk","scalar":{"value":1024.0},"type":"SCALAR"},{"name":"ports","ranges":{"range":[{"begin":31000,"end":32000}]},"type":"RANGES"}]
I1030 12:17:29.300082  6142 slave.cpp:593] Agent attributes: [  ]
I1030 12:17:29.300143  6142 slave.cpp:602] Agent hostname: b5354a82d111
I1030 12:17:29.300606  6144 status_update_manager.cpp:177] Pausing sending status updates
I1030 12:17:29.303642  6142 state.cpp:64] Recovering state from '/tmp/Endpoint_SlaveEndpointTest_UnauthorizedRequest_2_Wf9d7Z/meta'
I1030 12:17:29.304350  6138 status_update_manager.cpp:203] Recovering status update manager
I1030 12:17:29.304785  6143 containerizer.cpp:662] Recovering containerizer
I1030 12:17:29.322839  6138 provisioner.cpp:416] Provisioner recovery complete
I1030 12:17:29.323954  6143 slave.cpp:6322] Finished recovery
I1030 12:17:29.346364  6141 process.cpp:3938] Handling HTTP event for process 'slave(822)'
with path: '/slave(822)/containers'
I1030 12:17:29.348871  6144 http.cpp:1185] HTTP GET for /slave(822)/containers from 172.17.0.3:45782
I1030 12:17:29.349143  6144 http.cpp:976] Authorizing principal 'test-principal' to GET the
'/containers' endpoint
I1030 12:17:29.414474  6137 slave.cpp:869] Agent terminating
[       OK ] Endpoint/SlaveEndpointTest.UnauthorizedRequest/2 (208 ms)
[ RUN      ] Endpoint/SlaveEndpointTest.NoAuthorizer/0
I1030 12:17:29.486212  6137 containerizer.cpp:301] Using isolation { environment_secret, posix/cpu,
posix/mem, filesystem/posix, network/cni }
W1030 12:17:29.492645  6137 backend.cpp:76] Failed to create 'aufs' backend: AufsBackend requires
root privileges
W1030 12:17:29.493041  6137 backend.cpp:76] Failed to create 'bind' backend: BindBackend requires
root privileges
I1030 12:17:29.493111  6137 provisioner.cpp:255] Using default backend 'copy'
I1030 12:17:29.499366  6137 cluster.cpp:448] Creating default 'local' authorizer
I1030 12:17:29.505692  6145 slave.cpp:254] Mesos agent started on (823)@172.17.0.3:41346
I1030 12:17:29.505749  6145 slave.cpp:255] Flags at startup: --acls="" --appc_simple_discovery_uri_prefix="http://"
--appc_store_dir="/tmp/Endpoint_SlaveEndpointTest_NoAuthorizer_0_VchkH5/store/appc" --authenticate_http_readonly="true"
--authenticate_http_readwrite="true" --authenticatee="crammd5" --authentication_backoff_factor="1secs"
--authorizer="local" --cgroups_cpu_enable_pids_and_tids_count="false" --cgroups_enable_cfs="false"
--cgroups_hierarchy="/sys/fs/cgroup" --cgroups_limit_swap="false" --cgroups_root="mesos" --container_disk_watch_interval="15secs"
--containerizers="mesos" --credential="/tmp/Endpoint_SlaveEndpointTest_NoAuthorizer_0_VchkH5/credential"
--default_role="*" --disallow_sharing_agent_pid_namespace="false" --disk_watch_interval="1mins"
--docker="docker" --docker_kill_orphans="true" --docker_registry="https://registry-1.docker.io"
--docker_remove_delay="6hrs" --docker_socket="/var/run/docker.sock" --docker_stop_timeout="0ns"
--docker_store_dir="/tmp/Endpoint_SlaveEndpointTest_NoAuthorizer_0_VchkH5/store/docker" --docker_volume_checkpoint_dir="/var/run/mesos/isolators/docker/volume"
--enforce_container_disk_quota="false" --executor_registration_timeout="1mins" --executor_reregistration_timeout="2secs"
--executor_shutdown_grace_period="5secs" --fetcher_cache_dir="/tmp/Endpoint_SlaveEndpointTest_NoAuthorizer_0_VchkH5/fetch"
--fetcher_cache_size="2GB" --frameworks_home="" --gc_delay="1weeks" --gc_disk_headroom="0.1"
--hadoop_home="" --help="false" --hostname_lookup="true" --http_command_executor="false" --http_credentials="/tmp/Endpoint_SlaveEndpointTest_NoAuthorizer_0_VchkH5/http_credentials"
--http_heartbeat_interval="30secs" --initialize_driver_logging="true" --isolation="posix/cpu,posix/mem"
--launcher="posix" --launcher_dir="/mesos/mesos-1.5.0/_build/src" --logbufsecs="0" --logging_level="INFO"
--max_completed_executors_per_framework="150" --oversubscribed_resources_interval="15secs"
--perf_duration="10secs" --perf_interval="1mins" --port="5051" --qos_correction_interval_min="0ns"
--quiet="false" --recover="reconnect" --recovery_timeout="15mins" --registration_backoff_factor="10ms"
--resources="cpus:2;gpus:0;mem:1024;disk:1024;ports:[31000-32000]" --revocable_cpu_low_priority="true"
--runtime_dir="/tmp/Endpoint_SlaveEndpointTest_NoAuthorizer_0_VchkH5" --sandbox_directory="/mnt/mesos/sandbox"
--strict="true" --switch_user="true" --systemd_enable_support="true" --systemd_runtime_directory="/run/systemd/system"
--version="false" --work_dir="/tmp/Endpoint_SlaveEndpointTest_NoAuthorizer_0_Q3lPn4" --zk_session_timeout="10secs"
I1030 12:17:29.506232  6145 credentials.hpp:86] Loading credential for authentication from
'/tmp/Endpoint_SlaveEndpointTest_NoAuthorizer_0_VchkH5/credential'
I1030 12:17:29.506997  6145 slave.cpp:287] Agent using credential for: test-principal
I1030 12:17:29.507028  6145 credentials.hpp:37] Loading credentials for authentication from
'/tmp/Endpoint_SlaveEndpointTest_NoAuthorizer_0_VchkH5/http_credentials'
I1030 12:17:29.507283  6145 http.cpp:1045] Creating default 'basic' HTTP authenticator for
realm 'mesos-agent-readonly'
I1030 12:17:29.507508  6145 http.cpp:1045] Creating default 'basic' HTTP authenticator for
realm 'mesos-agent-readwrite'
I1030 12:17:29.513154  6145 slave.cpp:585] Agent resources: [{"name":"cpus","scalar":{"value":2.0},"type":"SCALAR"},{"name":"mem","scalar":{"value":1024.0},"type":"SCALAR"},{"name":"disk","scalar":{"value":1024.0},"type":"SCALAR"},{"name":"ports","ranges":{"range":[{"begin":31000,"end":32000}]},"type":"RANGES"}]
I1030 12:17:29.513451  6145 slave.cpp:593] Agent attributes: [  ]
I1030 12:17:29.513474  6145 slave.cpp:602] Agent hostname: b5354a82d111
I1030 12:17:29.513839  6144 status_update_manager.cpp:177] Pausing sending status updates
I1030 12:17:29.515869  6145 state.cpp:64] Recovering state from '/tmp/Endpoint_SlaveEndpointTest_NoAuthorizer_0_Q3lPn4/meta'
I1030 12:17:29.520704  6145 status_update_manager.cpp:203] Recovering status update manager
I1030 12:17:29.520962  6145 containerizer.cpp:662] Recovering containerizer
I1030 12:17:29.523432  6142 provisioner.cpp:416] Provisioner recovery complete
I1030 12:17:29.524111  6142 slave.cpp:6322] Finished recovery
I1030 12:17:29.530356  6143 process.cpp:3938] Handling HTTP event for process 'slave(823)'
with path: '/slave(823)/monitor/statistics'
I1030 12:17:29.534454  6139 http.cpp:1185] HTTP GET for /slave(823)/monitor/statistics from
172.17.0.3:45784
I1030 12:17:29.534579  6139 http.cpp:976] Authorizing principal 'test-principal' to GET the
'/monitor/statistics' endpoint
I1030 12:17:29.564339  6139 slave.cpp:869] Agent terminating
[       OK ] Endpoint/SlaveEndpointTest.NoAuthorizer/0 (162 ms)
[ RUN      ] Endpoint/SlaveEndpointTest.NoAuthorizer/1
I1030 12:17:29.757719  6137 containerizer.cpp:301] Using isolation { environment_secret, posix/cpu,
posix/mem, filesystem/posix, network/cni }
W1030 12:17:29.759727  6137 backend.cpp:76] Failed to create 'aufs' backend: AufsBackend requires
root privileges
W1030 12:17:29.759913  6137 backend.cpp:76] Failed to create 'bind' backend: BindBackend requires
root privileges
I1030 12:17:29.759979  6137 provisioner.cpp:255] Using default backend 'copy'
I1030 12:17:29.764256  6137 cluster.cpp:448] Creating default 'local' authorizer
I1030 12:17:29.767233  6143 slave.cpp:254] Mesos agent started on (824)@172.17.0.3:41346
I1030 12:17:29.767359  6143 slave.cpp:255] Flags at startup: --acls="" --appc_simple_discovery_uri_prefix="http://"
--appc_store_dir="/tmp/Endpoint_SlaveEndpointTest_NoAuthorizer_1_vpUcrd/store/appc" --authenticate_http_readonly="true"
--authenticate_http_readwrite="true" --authenticatee="crammd5" --authentication_backoff_factor="1secs"
--authorizer="local" --cgroups_cpu_enable_pids_and_tids_count="false" --cgroups_enable_cfs="false"
--cgroups_hierarchy="/sys/fs/cgroup" --cgroups_limit_swap="false" --cgroups_root="mesos" --container_disk_watch_interval="15secs"
--containerizers="mesos" --credential="/tmp/Endpoint_SlaveEndpointTest_NoAuthorizer_1_vpUcrd/credential"
--default_role="*" --disallow_sharing_agent_pid_namespace="false" --disk_watch_interval="1mins"
--docker="docker" --docker_kill_orphans="true" --docker_registry="https://registry-1.docker.io"
--docker_remove_delay="6hrs" --docker_socket="/var/run/docker.sock" --docker_stop_timeout="0ns"
--docker_store_dir="/tmp/Endpoint_SlaveEndpointTest_NoAuthorizer_1_vpUcrd/store/docker" --docker_volume_checkpoint_dir="/var/run/mesos/isolators/docker/volume"
--enforce_container_disk_quota="false" --executor_registration_timeout="1mins" --executor_reregistration_timeout="2secs"
--executor_shutdown_grace_period="5secs" --fetcher_cache_dir="/tmp/Endpoint_SlaveEndpointTest_NoAuthorizer_1_vpUcrd/fetch"
--fetcher_cache_size="2GB" --frameworks_home="" --gc_delay="1weeks" --gc_disk_headroom="0.1"
--hadoop_home="" --help="false" --hostname_lookup="true" --http_command_executor="false" --http_credentials="/tmp/Endpoint_SlaveEndpointTest_NoAuthorizer_1_vpUcrd/http_credentials"
--http_heartbeat_interval="30secs" --initialize_driver_logging="true" --isolation="posix/cpu,posix/mem"
--launcher="posix" --launcher_dir="/mesos/mesos-1.5.0/_build/src" --logbufsecs="0" --logging_level="INFO"
--max_completed_executors_per_framework="150" --oversubscribed_resources_interval="15secs"
--perf_duration="10secs" --perf_interval="1mins" --port="5051" --qos_correction_interval_min="0ns"
--quiet="false" --recover="reconnect" --recovery_timeout="15mins" --registration_backoff_factor="10ms"
--resources="cpus:2;gpus:0;mem:1024;disk:1024;ports:[31000-32000]" --revocable_cpu_low_priority="true"
--runtime_dir="/tmp/Endpoint_SlaveEndpointTest_NoAuthorizer_1_vpUcrd" --sandbox_directory="/mnt/mesos/sandbox"
--strict="true" --switch_user="true" --systemd_enable_support="true" --systemd_runtime_directory="/run/systemd/system"
--version="false" --work_dir="/tmp/Endpoint_SlaveEndpointTest_NoAuthorizer_1_pBualb" --zk_session_timeout="10secs"
I1030 12:17:29.768194  6143 credentials.hpp:86] Loading credential for authentication from
'/tmp/Endpoint_SlaveEndpointTest_NoAuthorizer_1_vpUcrd/credential'
I1030 12:17:29.768625  6143 slave.cpp:287] Agent using credential for: test-principal
I1030 12:17:29.768679  6143 credentials.hpp:37] Loading credentials for authentication from
'/tmp/Endpoint_SlaveEndpointTest_NoAuthorizer_1_vpUcrd/http_credentials'
I1030 12:17:29.769062  6143 http.cpp:1045] Creating default 'basic' HTTP authenticator for
realm 'mesos-agent-readonly'
I1030 12:17:29.769435  6143 http.cpp:1045] Creating default 'basic' HTTP authenticator for
realm 'mesos-agent-readwrite'
I1030 12:17:29.773983  6143 slave.cpp:585] Agent resources: [{"name":"cpus","scalar":{"value":2.0},"type":"SCALAR"},{"name":"mem","scalar":{"value":1024.0},"type":"SCALAR"},{"name":"disk","scalar":{"value":1024.0},"type":"SCALAR"},{"name":"ports","ranges":{"range":[{"begin":31000,"end":32000}]},"type":"RANGES"}]
I1030 12:17:29.775094  6143 slave.cpp:593] Agent attributes: [  ]
I1030 12:17:29.775171  6143 slave.cpp:602] Agent hostname: b5354a82d111
I1030 12:17:29.775493  6141 status_update_manager.cpp:177] Pausing sending status updates
I1030 12:17:29.778836  6143 state.cpp:64] Recovering state from '/tmp/Endpoint_SlaveEndpointTest_NoAuthorizer_1_pBualb/meta'
I1030 12:17:29.784462  6139 status_update_manager.cpp:203] Recovering status update manager
I1030 12:17:29.784786  6139 containerizer.cpp:662] Recovering containerizer
I1030 12:17:29.786969  6139 provisioner.cpp:416] Provisioner recovery complete
I1030 12:17:29.787622  6139 slave.cpp:6322] Finished recovery
I1030 12:17:29.802011  6139 process.cpp:3938] Handling HTTP event for process 'slave(824)'
with path: '/slave(824)/monitor/statistics.json'
I1030 12:17:29.804574  6141 http.cpp:1185] HTTP GET for /slave(824)/monitor/statistics.json
from 172.17.0.3:45786
I1030 12:17:29.804811  6141 http.cpp:976] Authorizing principal 'test-principal' to GET the
'/monitor/statistics.json' endpoint
I1030 12:17:29.823436  6137 slave.cpp:869] Agent terminating
[       OK ] Endpoint/SlaveEndpointTest.NoAuthorizer/1 (104 ms)
[ RUN      ] Endpoint/SlaveEndpointTest.NoAuthorizer/2
I1030 12:17:29.868940  6137 containerizer.cpp:301] Using isolation { environment_secret, posix/cpu,
posix/mem, filesystem/posix, network/cni }
W1030 12:17:29.870069  6137 backend.cpp:76] Failed to create 'aufs' backend: AufsBackend requires
root privileges
W1030 12:17:29.870641  6137 backend.cpp:76] Failed to create 'bind' backend: BindBackend requires
root privileges
I1030 12:17:29.870796  6137 provisioner.cpp:255] Using default backend 'copy'
I1030 12:17:29.875660  6137 cluster.cpp:448] Creating default 'local' authorizer
I1030 12:17:29.882026  6144 slave.cpp:254] Mesos agent started on (825)@172.17.0.3:41346
I1030 12:17:29.882144  6144 slave.cpp:255] Flags at startup: --acls="" --appc_simple_discovery_uri_prefix="http://"
--appc_store_dir="/tmp/Endpoint_SlaveEndpointTest_NoAuthorizer_2_8eu5Pm/store/appc" --authenticate_http_readonly="true"
--authenticate_http_readwrite="true" --authenticatee="crammd5" --authentication_backoff_factor="1secs"
--authorizer="local" --cgroups_cpu_enable_pids_and_tids_count="false" --cgroups_enable_cfs="false"
--cgroups_hierarchy="/sys/fs/cgroup" --cgroups_limit_swap="false" --cgroups_root="mesos" --container_disk_watch_interval="15secs"
--containerizers="mesos" --credential="/tmp/Endpoint_SlaveEndpointTest_NoAuthorizer_2_8eu5Pm/credential"
--default_role="*" --disallow_sharing_agent_pid_namespace="false" --disk_watch_interval="1mins"
--docker="docker" --docker_kill_orphans="true" --docker_registry="https://registry-1.docker.io"
--docker_remove_delay="6hrs" --docker_socket="/var/run/docker.sock" --docker_stop_timeout="0ns"
--docker_store_dir="/tmp/Endpoint_SlaveEndpointTest_NoAuthorizer_2_8eu5Pm/store/docker" --docker_volume_checkpoint_dir="/var/run/mesos/isolators/docker/volume"
--enforce_container_disk_quota="false" --executor_registration_timeout="1mins" --executor_reregistration_timeout="2secs"
--executor_shutdown_grace_period="5secs" --fetcher_cache_dir="/tmp/Endpoint_SlaveEndpointTest_NoAuthorizer_2_8eu5Pm/fetch"
--fetcher_cache_size="2GB" --frameworks_home="" --gc_delay="1weeks" --gc_disk_headroom="0.1"
--hadoop_home="" --help="false" --hostname_lookup="true" --http_command_executor="false" --http_credentials="/tmp/Endpoint_SlaveEndpointTest_NoAuthorizer_2_8eu5Pm/http_credentials"
--http_heartbeat_interval="30secs" --initialize_driver_logging="true" --isolation="posix/cpu,posix/mem"
--launcher="posix" --launcher_dir="/mesos/mesos-1.5.0/_build/src" --logbufsecs="0" --logging_level="INFO"
--max_completed_executors_per_framework="150" --oversubscribed_resources_interval="15secs"
--perf_duration="10secs" --perf_interval="1mins" --port="5051" --qos_correction_interval_min="0ns"
--quiet="false" --recover="reconnect" --recovery_timeout="15mins" --registration_backoff_factor="10ms"
--resources="cpus:2;gpus:0;mem:1024;disk:1024;ports:[31000-32000]" --revocable_cpu_low_priority="true"
--runtime_dir="/tmp/Endpoint_SlaveEndpointTest_NoAuthorizer_2_8eu5Pm" --sandbox_directory="/mnt/mesos/sandbox"
--strict="true" --switch_user="true" --systemd_enable_support="true" --systemd_runtime_directory="/run/systemd/system"
--version="false" --work_dir="/tmp/Endpoint_SlaveEndpointTest_NoAuthorizer_2_sJwVqk" --zk_session_timeout="10secs"
I1030 12:17:29.883178  6144 credentials.hpp:86] Loading credential for authentication from
'/tmp/Endpoint_SlaveEndpointTest_NoAuthorizer_2_8eu5Pm/credential'
I1030 12:17:29.883510  6144 slave.cpp:287] Agent using credential for: test-principal
I1030 12:17:29.883699  6144 credentials.hpp:37] Loading credentials for authentication from
'/tmp/Endpoint_SlaveEndpointTest_NoAuthorizer_2_8eu5Pm/http_credentials'
I1030 12:17:29.884183  6144 http.cpp:1045] Creating default 'basic' HTTP authenticator for
realm 'mesos-agent-readonly'
I1030 12:17:29.884963  6144 http.cpp:1045] Creating default 'basic' HTTP authenticator for
realm 'mesos-agent-readwrite'
I1030 12:17:29.890058  6144 slave.cpp:585] Agent resources: [{"name":"cpus","scalar":{"value":2.0},"type":"SCALAR"},{"name":"mem","scalar":{"value":1024.0},"type":"SCALAR"},{"name":"disk","scalar":{"value":1024.0},"type":"SCALAR"},{"name":"ports","ranges":{"range":[{"begin":31000,"end":32000}]},"type":"RANGES"}]
I1030 12:17:29.890696  6144 slave.cpp:593] Agent attributes: [  ]
I1030 12:17:29.890745  6144 slave.cpp:602] Agent hostname: b5354a82d111
I1030 12:17:29.891026  6141 status_update_manager.cpp:177] Pausing sending status updates
I1030 12:17:29.898264  6141 state.cpp:64] Recovering state from '/tmp/Endpoint_SlaveEndpointTest_NoAuthorizer_2_sJwVqk/meta'
I1030 12:17:29.924511  6145 status_update_manager.cpp:203] Recovering status update manager
I1030 12:17:29.924967  6143 containerizer.cpp:662] Recovering containerizer
I1030 12:17:29.927886  6143 provisioner.cpp:416] Provisioner recovery complete
I1030 12:17:29.928562  6143 slave.cpp:6322] Finished recovery
I1030 12:17:29.935220  6139 process.cpp:3938] Handling HTTP event for process 'slave(825)'
with path: '/slave(825)/containers'
I1030 12:17:29.937984  6139 http.cpp:1185] HTTP GET for /slave(825)/containers from 172.17.0.3:45788
I1030 12:17:29.942436  6139 http.cpp:976] Authorizing principal 'test-principal' to GET the
'/containers' endpoint
I1030 12:17:29.987857  6137 slave.cpp:869] Agent terminating
[       OK ] Endpoint/SlaveEndpointTest.NoAuthorizer/2 (175 ms)
[----------] 9 tests from Endpoint/SlaveEndpointTest (1588 ms total)

[----------] 2 tests from ContainerizerType/DefaultContainerDNSFlagTest
[ RUN      ] ContainerizerType/DefaultContainerDNSFlagTest.ValidateFlag/0
[       OK ] ContainerizerType/DefaultContainerDNSFlagTest.ValidateFlag/0 (45 ms)
[ RUN      ] ContainerizerType/DefaultContainerDNSFlagTest.ValidateFlag/1
[       OK ] ContainerizerType/DefaultContainerDNSFlagTest.ValidateFlag/1 (22 ms)
[----------] 2 tests from ContainerizerType/DefaultContainerDNSFlagTest (67 ms total)

[----------] Global test environment tear-down
[==========] 1694 tests from 185 test cases ran. (742646 ms total)
[  PASSED  ] 1693 tests.
[  FAILED  ] 1 test, listed below:
[  FAILED  ] ContentType/AgentAPITest.LaunchNestedContainerSessionDisconnected/0, where GetParam()
= application/x-protobuf

 1 FAILED TEST
  YOU HAVE 21 DISABLED TESTS

I1030 12:17:30.169083  6146 process.cpp:1067] Failed to accept socket: future discarded
make[4]: *** [check-local] Error 1
make[4]: Leaving directory `/mesos/mesos-1.5.0/_build/src'
make[3]: *** [check-am] Error 2
make[3]: Leaving directory `/mesos/mesos-1.5.0/_build/src'
make[2]: *** [check] Error 2
make[2]: Leaving directory `/mesos/mesos-1.5.0/_build/src'
make[1]: *** [check-recursive] Error 1
make[1]: Leaving directory `/mesos/mesos-1.5.0/_build'
make: *** [distcheck] Error 1
+ docker rmi mesos-1509358536-19747
Untagged: mesos-1509358536-19747:latest
Deleted: sha256:dedceee379b6df4ba1ff24f025715066b2248cdc59ba187a799251908557be41
Deleted: sha256:f3a8dad92f0faa666d49849f450b28a66ad5583f6a6ce8b0ca1ca1468976931e
Deleted: sha256:8264a362692f1a258ea12dafa2405a084f9ff9dc930100011cb27b809cd96848
Deleted: sha256:cfe0a2baa616bd1cd7149eeb3174c0e4ec2b8fa85fa0d45d29282697e55a9539
Deleted: sha256:7bc1416214194cf71f9e33888a54ed9c7254e2cec4fd89e8a242e3ed159b7110
Deleted: sha256:782881dce89cddb52c4fbf3884da2655f9d893e83c0e454d3162531cb38bd586
Deleted: sha256:b05a4fe137f9f47b2d2ea612ca07b8671dfa47fc6ebbd27fc9f548c76dc926d4
Deleted: sha256:f687cc710b7d4d5faf042f8665b5d6dffe5fdbd1c56a9089269e46a4dc5d72fc
Deleted: sha256:8fd048a9592a12e37bfbef9d127444d8d8fa499b54460058c6343b0c199a5e48
Deleted: sha256:b4711c2052239928c144a2600ae9ec2cced1a4b76620d5e57f8490987cbedd1d
Deleted: sha256:a408def6c9c9caf30627dd72b54ebada59b34ac4c94c3909682f7555878cebd6
Deleted: sha256:a484ead6d325833a60b2122b5d15d165a91953753d57ffde834d831ad16abada
Deleted: sha256:ed5b62bacf0e92176a8706c6b3b599993eaf9fa0ac49cc8dfd3089eb6986ac21
Deleted: sha256:4a40ad13cb55db0074aed449d51ccd6e21e9b73ac3f536ad1e2cdaf0178b02a5
Deleted: sha256:48c33ec9e9499f2831358f4abf19ff0ecd63c504424aa0113f32374a743cd45e
Deleted: sha256:d404b6cf17ba057eb7be6acfe57f000e65758587b1c482df86b9c80d90728b2b
Deleted: sha256:4e2abcea1126bb3517634bf99cb282254804b1ba9213167872d55dcf7d0da284
Deleted: sha256:29cdef537698a23bc170a374714a3eeadff60c04894c67693bb95b6b849c01ff
Deleted: sha256:b0d278a0b29ed930239631c854da17a441f1970d624f9a77f536ae2b57283df3
Deleted: sha256:a6fd7582ccad1d806c1c3702f9b3bfda13e5f11d8e2d92b06373700f3745921b
Deleted: sha256:506e628cf934d1d1912e7a1a346b066035ea4a372c7139f8188d98eb72e01d22
Deleted: sha256:000dec7ad36deb828c8463fe5a16b608ab16e53ef33441c9572e03011653d391
Deleted: sha256:372be91a83cc850e498b2d429da2321673a760666751a9b103ec75a9a7b774f2
Deleted: sha256:13e3e8b8d2903af42b56c1951de55d31d29fe1f6b456b9666e408658f356a5ee
Deleted: sha256:d6a11adc7852e06aff0f4faa88e8395da28b754f75fa1e3e00f54044c123636b
Deleted: sha256:93a4a72cfcc5cba3492b79a6d54bd4cd902827ba6b1996d97ebe82fcc51d994d
Deleted: sha256:c73fecb935e9a9505b5384e547d01f041c9dd0dfb0a0bd140cabc97d8da42e44
Deleted: sha256:33e4ce8468eba3cbda9f3ff20af807d2868038522c31d786492ef4fdb808292b
Deleted: sha256:bdd60380db1f6a7215e3f14742c11cf4e3896f6f29178ae4edb49e91d88e2b5c
Build step 'Execute shell' marked build as failure


Mime
View raw message