mesos-builds mailing list archives

Site index · List index
Message view « Date » · « Thread »
Top « Date » · « Thread »
From Apache Jenkins Server <jenk...@builds.apache.org>
Subject Build failed in Jenkins: Mesos-Buildbot » autotools,gcc,--verbose,GLOG_v=1 MESOS_VERBOSE=1,centos:7,(ubuntu)&&(!ubuntu-us1)&&(!ubuntu-eu2)&&(!qnode3)&&(!H23) #4278
Date Tue, 03 Oct 2017 00:53:59 GMT
See <https://builds.apache.org/job/Mesos-Buildbot/BUILDTOOL=autotools,COMPILER=gcc,CONFIGURATION=--verbose,ENVIRONMENT=GLOG_v=1%20MESOS_VERBOSE=1,OS=centos%3A7,label_exp=(ubuntu)&&(!ubuntu-us1)&&(!ubuntu-eu2)&&(!qnode3)&&(!H23)/4278/display/redirect?page=changes>

Changes:

[bmahler] Display task health in the Web UI.

[josephwu] Windows: Fixed ordering of system headers.

[josephwu] CMake: Cleaned up `External.cmake`.

[josephwu] CMake: Used `TRUE|FALSE` instead of `ON|OFF` consistently.

[josephwu] CMake: Removed `MESOS_CPPFLAGS` variable.

[josephwu] Windows: Disable some new tests that fetch local URIs.

------------------------------------------
[...truncated 31.92 MB...]
I1003 00:53:45.179417  6814 http.cpp:1045] Creating default 'basic' HTTP authenticator for
realm 'mesos-agent-readonly'
I1003 00:53:45.179613  6814 http.cpp:1045] Creating default 'basic' HTTP authenticator for
realm 'mesos-agent-readwrite'
I1003 00:53:45.181097  6814 slave.cpp:585] Agent resources: [{"name":"cpus","scalar":{"value":2.0},"type":"SCALAR"},{"name":"mem","scalar":{"value":1024.0},"type":"SCALAR"},{"name":"disk","scalar":{"value":1024.0},"type":"SCALAR"},{"name":"ports","ranges":{"range":[{"begin":31000,"end":32000}]},"type":"RANGES"}]
I1003 00:53:45.181365  6814 slave.cpp:593] Agent attributes: [  ]
I1003 00:53:45.181398  6814 slave.cpp:602] Agent hostname: f956d9c3ff7c
I1003 00:53:45.181633  6800 status_update_manager.cpp:177] Pausing sending status updates
I1003 00:53:45.182924  6806 state.cpp:64] Recovering state from '/tmp/Endpoint_SlaveEndpointTest_AuthorizedRequest_2_TzDKPh/meta'
I1003 00:53:45.183219  6822 status_update_manager.cpp:203] Recovering status update manager
I1003 00:53:45.183496  6805 containerizer.cpp:648] Recovering containerizer
I1003 00:53:45.185261  6820 provisioner.cpp:416] Provisioner recovery complete
I1003 00:53:45.185595  6818 slave.cpp:6310] Finished recovery
I1003 00:53:45.185984  6818 slave.cpp:6492] Querying resource estimator for oversubscribable
resources
I1003 00:53:45.186210  6803 slave.cpp:6506] Received oversubscribable resources {} from the
resource estimator
I1003 00:53:45.189107  6817 process.cpp:3929] Handling HTTP event for process 'slave(817)'
with path: '/slave(817)/containers'
I1003 00:53:45.190800  6804 http.cpp:1185] HTTP GET for /slave(817)/containers from 172.17.0.8:34386
I1003 00:53:45.190901  6804 http.cpp:976] Authorizing principal 'test-principal' to GET the
'/containers' endpoint
I1003 00:53:45.195533  6780 slave.cpp:869] Agent terminating
[       OK ] Endpoint/SlaveEndpointTest.AuthorizedRequest/2 (38 ms)
[ RUN      ] Endpoint/SlaveEndpointTest.UnauthorizedRequest/0
I1003 00:53:45.213309  6780 containerizer.cpp:292] Using isolation { environment_secret, posix/cpu,
posix/mem, filesystem/posix, network/cni }
W1003 00:53:45.214216  6780 backend.cpp:76] Failed to create 'aufs' backend: AufsBackend requires
root privileges
W1003 00:53:45.214406  6780 backend.cpp:76] Failed to create 'bind' backend: BindBackend requires
root privileges
I1003 00:53:45.214464  6780 provisioner.cpp:255] Using default backend 'copy'
I1003 00:53:45.220445  6809 slave.cpp:254] Mesos agent started on (818)@172.17.0.8:32814
I1003 00:53:45.220472  6809 slave.cpp:255] Flags at startup: --acls="" --appc_simple_discovery_uri_prefix="http://"
--appc_store_dir="/tmp/Endpoint_SlaveEndpointTest_UnauthorizedRequest_0_xX50tW/store/appc"
--authenticate_http_readonly="true" --authenticate_http_readwrite="true" --authenticatee="crammd5"
--authentication_backoff_factor="1secs" --authorizer="local" --cgroups_cpu_enable_pids_and_tids_count="false"
--cgroups_enable_cfs="false" --cgroups_hierarchy="/sys/fs/cgroup" --cgroups_limit_swap="false"
--cgroups_root="mesos" --container_disk_watch_interval="15secs" --containerizers="mesos" --credential="/tmp/Endpoint_SlaveEndpointTest_UnauthorizedRequest_0_xX50tW/credential"
--default_role="*" --disallow_sharing_agent_pid_namespace="false" --disk_watch_interval="1mins"
--docker="docker" --docker_kill_orphans="true" --docker_registry="https://registry-1.docker.io"
--docker_remove_delay="6hrs" --docker_socket="/var/run/docker.sock" --docker_stop_timeout="0ns"
--docker_store_dir="/tmp/Endpoint_SlaveEndpointTest_UnauthorizedRequest_0_xX50tW/store/docker"
--docker_volume_checkpoint_dir="/var/run/mesos/isolators/docker/volume" --enforce_container_disk_quota="false"
--executor_registration_timeout="1mins" --executor_reregistration_timeout="2secs" --executor_shutdown_grace_period="5secs"
--fetcher_cache_dir="/tmp/Endpoint_SlaveEndpointTest_UnauthorizedRequest_0_xX50tW/fetch" --fetcher_cache_size="2GB"
--frameworks_home="" --gc_delay="1weeks" --gc_disk_headroom="0.1" --hadoop_home="" --help="false"
--hostname_lookup="true" --http_command_executor="false" --http_credentials="/tmp/Endpoint_SlaveEndpointTest_UnauthorizedRequest_0_xX50tW/http_credentials"
--http_heartbeat_interval="30secs" --initialize_driver_logging="true" --isolation="posix/cpu,posix/mem"
--launcher="posix" --launcher_dir="/mesos/mesos-1.5.0/_build/src" --logbufsecs="0" --logging_level="INFO"
--max_completed_executors_per_framework="150" --oversubscribed_resources_interval="15secs"
--perf_duration="10secs" --perf_interval="1mins" --port="5051" --qos_correction_interval_min="0ns"
--quiet="false" --recover="reconnect" --recovery_timeout="15mins" --registration_backoff_factor="10ms"
--resources="cpus:2;gpus:0;mem:1024;disk:1024;ports:[31000-32000]" --revocable_cpu_low_priority="true"
--runtime_dir="/tmp/Endpoint_SlaveEndpointTest_UnauthorizedRequest_0_xX50tW" --sandbox_directory="/mnt/mesos/sandbox"
--strict="true" --switch_user="true" --systemd_enable_support="true" --systemd_runtime_directory="/run/systemd/system"
--version="false" --work_dir="/tmp/Endpoint_SlaveEndpointTest_UnauthorizedRequest_0_t9mA7c"
--zk_session_timeout="10secs"
I1003 00:53:45.220836  6809 credentials.hpp:86] Loading credential for authentication from
'/tmp/Endpoint_SlaveEndpointTest_UnauthorizedRequest_0_xX50tW/credential'
I1003 00:53:45.220990  6809 slave.cpp:287] Agent using credential for: test-principal
I1003 00:53:45.221011  6809 credentials.hpp:37] Loading credentials for authentication from
'/tmp/Endpoint_SlaveEndpointTest_UnauthorizedRequest_0_xX50tW/http_credentials'
I1003 00:53:45.221287  6809 http.cpp:1045] Creating default 'basic' HTTP authenticator for
realm 'mesos-agent-readonly'
I1003 00:53:45.221446  6809 http.cpp:1045] Creating default 'basic' HTTP authenticator for
realm 'mesos-agent-readwrite'
I1003 00:53:45.222851  6809 slave.cpp:585] Agent resources: [{"name":"cpus","scalar":{"value":2.0},"type":"SCALAR"},{"name":"mem","scalar":{"value":1024.0},"type":"SCALAR"},{"name":"disk","scalar":{"value":1024.0},"type":"SCALAR"},{"name":"ports","ranges":{"range":[{"begin":31000,"end":32000}]},"type":"RANGES"}]
I1003 00:53:45.223088  6809 slave.cpp:593] Agent attributes: [  ]
I1003 00:53:45.223104  6809 slave.cpp:602] Agent hostname: f956d9c3ff7c
I1003 00:53:45.223253  6802 status_update_manager.cpp:177] Pausing sending status updates
I1003 00:53:45.224795  6821 state.cpp:64] Recovering state from '/tmp/Endpoint_SlaveEndpointTest_UnauthorizedRequest_0_t9mA7c/meta'
I1003 00:53:45.225072  6821 status_update_manager.cpp:203] Recovering status update manager
I1003 00:53:45.225270  6818 containerizer.cpp:648] Recovering containerizer
I1003 00:53:45.226933  6812 provisioner.cpp:416] Provisioner recovery complete
I1003 00:53:45.227357  6799 slave.cpp:6310] Finished recovery
I1003 00:53:45.228083  6799 slave.cpp:6492] Querying resource estimator for oversubscribable
resources
I1003 00:53:45.228423  6804 slave.cpp:6506] Received oversubscribable resources {} from the
resource estimator
I1003 00:53:45.231497  6819 process.cpp:3929] Handling HTTP event for process 'slave(818)'
with path: '/slave(818)/monitor/statistics'
I1003 00:53:45.232941  6820 http.cpp:1185] HTTP GET for /slave(818)/monitor/statistics from
172.17.0.8:34388
I1003 00:53:45.233079  6820 http.cpp:976] Authorizing principal 'test-principal' to GET the
'/monitor/statistics' endpoint
I1003 00:53:45.236434  6780 slave.cpp:869] Agent terminating
[       OK ] Endpoint/SlaveEndpointTest.UnauthorizedRequest/0 (40 ms)
[ RUN      ] Endpoint/SlaveEndpointTest.UnauthorizedRequest/1
I1003 00:53:45.251054  6780 containerizer.cpp:292] Using isolation { environment_secret, posix/cpu,
posix/mem, filesystem/posix, network/cni }
W1003 00:53:45.251633  6780 backend.cpp:76] Failed to create 'aufs' backend: AufsBackend requires
root privileges
W1003 00:53:45.251760  6780 backend.cpp:76] Failed to create 'bind' backend: BindBackend requires
root privileges
I1003 00:53:45.251806  6780 provisioner.cpp:255] Using default backend 'copy'
I1003 00:53:45.256264  6808 slave.cpp:254] Mesos agent started on (819)@172.17.0.8:32814
I1003 00:53:45.256292  6808 slave.cpp:255] Flags at startup: --acls="" --appc_simple_discovery_uri_prefix="http://"
--appc_store_dir="/tmp/Endpoint_SlaveEndpointTest_UnauthorizedRequest_1_pUYCfS/store/appc"
--authenticate_http_readonly="true" --authenticate_http_readwrite="true" --authenticatee="crammd5"
--authentication_backoff_factor="1secs" --authorizer="local" --cgroups_cpu_enable_pids_and_tids_count="false"
--cgroups_enable_cfs="false" --cgroups_hierarchy="/sys/fs/cgroup" --cgroups_limit_swap="false"
--cgroups_root="mesos" --container_disk_watch_interval="15secs" --containerizers="mesos" --credential="/tmp/Endpoint_SlaveEndpointTest_UnauthorizedRequest_1_pUYCfS/credential"
--default_role="*" --disallow_sharing_agent_pid_namespace="false" --disk_watch_interval="1mins"
--docker="docker" --docker_kill_orphans="true" --docker_registry="https://registry-1.docker.io"
--docker_remove_delay="6hrs" --docker_socket="/var/run/docker.sock" --docker_stop_timeout="0ns"
--docker_store_dir="/tmp/Endpoint_SlaveEndpointTest_UnauthorizedRequest_1_pUYCfS/store/docker"
--docker_volume_checkpoint_dir="/var/run/mesos/isolators/docker/volume" --enforce_container_disk_quota="false"
--executor_registration_timeout="1mins" --executor_reregistration_timeout="2secs" --executor_shutdown_grace_period="5secs"
--fetcher_cache_dir="/tmp/Endpoint_SlaveEndpointTest_UnauthorizedRequest_1_pUYCfS/fetch" --fetcher_cache_size="2GB"
--frameworks_home="" --gc_delay="1weeks" --gc_disk_headroom="0.1" --hadoop_home="" --help="false"
--hostname_lookup="true" --http_command_executor="false" --http_credentials="/tmp/Endpoint_SlaveEndpointTest_UnauthorizedRequest_1_pUYCfS/http_credentials"
--http_heartbeat_interval="30secs" --initialize_driver_logging="true" --isolation="posix/cpu,posix/mem"
--launcher="posix" --launcher_dir="/mesos/mesos-1.5.0/_build/src" --logbufsecs="0" --logging_level="INFO"
--max_completed_executors_per_framework="150" --oversubscribed_resources_interval="15secs"
--perf_duration="10secs" --perf_interval="1mins" --port="5051" --qos_correction_interval_min="0ns"
--quiet="false" --recover="reconnect" --recovery_timeout="15mins" --registration_backoff_factor="10ms"
--resources="cpus:2;gpus:0;mem:1024;disk:1024;ports:[31000-32000]" --revocable_cpu_low_priority="true"
--runtime_dir="/tmp/Endpoint_SlaveEndpointTest_UnauthorizedRequest_1_pUYCfS" --sandbox_directory="/mnt/mesos/sandbox"
--strict="true" --switch_user="true" --systemd_enable_support="true" --systemd_runtime_directory="/run/systemd/system"
--version="false" --work_dir="/tmp/Endpoint_SlaveEndpointTest_UnauthorizedRequest_1_lI1mN8"
--zk_session_timeout="10secs"
I1003 00:53:45.256742  6808 credentials.hpp:86] Loading credential for authentication from
'/tmp/Endpoint_SlaveEndpointTest_UnauthorizedRequest_1_pUYCfS/credential'
I1003 00:53:45.256909  6808 slave.cpp:287] Agent using credential for: test-principal
I1003 00:53:45.256932  6808 credentials.hpp:37] Loading credentials for authentication from
'/tmp/Endpoint_SlaveEndpointTest_UnauthorizedRequest_1_pUYCfS/http_credentials'
I1003 00:53:45.257217  6808 http.cpp:1045] Creating default 'basic' HTTP authenticator for
realm 'mesos-agent-readonly'
I1003 00:53:45.257477  6808 http.cpp:1045] Creating default 'basic' HTTP authenticator for
realm 'mesos-agent-readwrite'
I1003 00:53:45.259698  6808 slave.cpp:585] Agent resources: [{"name":"cpus","scalar":{"value":2.0},"type":"SCALAR"},{"name":"mem","scalar":{"value":1024.0},"type":"SCALAR"},{"name":"disk","scalar":{"value":1024.0},"type":"SCALAR"},{"name":"ports","ranges":{"range":[{"begin":31000,"end":32000}]},"type":"RANGES"}]
I1003 00:53:45.260121  6808 slave.cpp:593] Agent attributes: [  ]
I1003 00:53:45.260155  6808 slave.cpp:602] Agent hostname: f956d9c3ff7c
I1003 00:53:45.260327  6818 status_update_manager.cpp:177] Pausing sending status updates
I1003 00:53:45.262174  6806 state.cpp:64] Recovering state from '/tmp/Endpoint_SlaveEndpointTest_UnauthorizedRequest_1_lI1mN8/meta'
I1003 00:53:45.262516  6801 status_update_manager.cpp:203] Recovering status update manager
I1003 00:53:45.262773  6820 containerizer.cpp:648] Recovering containerizer
I1003 00:53:45.264196  6807 provisioner.cpp:416] Provisioner recovery complete
I1003 00:53:45.264538  6807 slave.cpp:6310] Finished recovery
I1003 00:53:45.264951  6807 slave.cpp:6492] Querying resource estimator for oversubscribable
resources
I1003 00:53:45.265249  6806 slave.cpp:6506] Received oversubscribable resources {} from the
resource estimator
I1003 00:53:45.267494  6812 process.cpp:3929] Handling HTTP event for process 'slave(819)'
with path: '/slave(819)/monitor/statistics.json'
I1003 00:53:45.268842  6821 http.cpp:1185] HTTP GET for /slave(819)/monitor/statistics.json
from 172.17.0.8:34390
I1003 00:53:45.268919  6821 http.cpp:976] Authorizing principal 'test-principal' to GET the
'/monitor/statistics.json' endpoint
I1003 00:53:45.270931  6780 slave.cpp:869] Agent terminating
[       OK ] Endpoint/SlaveEndpointTest.UnauthorizedRequest/1 (33 ms)
[ RUN      ] Endpoint/SlaveEndpointTest.UnauthorizedRequest/2
I1003 00:53:45.282428  6780 containerizer.cpp:292] Using isolation { environment_secret, posix/cpu,
posix/mem, filesystem/posix, network/cni }
W1003 00:53:45.282915  6780 backend.cpp:76] Failed to create 'aufs' backend: AufsBackend requires
root privileges
W1003 00:53:45.283021  6780 backend.cpp:76] Failed to create 'bind' backend: BindBackend requires
root privileges
I1003 00:53:45.283056  6780 provisioner.cpp:255] Using default backend 'copy'
I1003 00:53:45.286449  6803 slave.cpp:254] Mesos agent started on (820)@172.17.0.8:32814
I1003 00:53:45.286473  6803 slave.cpp:255] Flags at startup: --acls="" --appc_simple_discovery_uri_prefix="http://"
--appc_store_dir="/tmp/Endpoint_SlaveEndpointTest_UnauthorizedRequest_2_vNxblO/store/appc"
--authenticate_http_readonly="true" --authenticate_http_readwrite="true" --authenticatee="crammd5"
--authentication_backoff_factor="1secs" --authorizer="local" --cgroups_cpu_enable_pids_and_tids_count="false"
--cgroups_enable_cfs="false" --cgroups_hierarchy="/sys/fs/cgroup" --cgroups_limit_swap="false"
--cgroups_root="mesos" --container_disk_watch_interval="15secs" --containerizers="mesos" --credential="/tmp/Endpoint_SlaveEndpointTest_UnauthorizedRequest_2_vNxblO/credential"
--default_role="*" --disallow_sharing_agent_pid_namespace="false" --disk_watch_interval="1mins"
--docker="docker" --docker_kill_orphans="true" --docker_registry="https://registry-1.docker.io"
--docker_remove_delay="6hrs" --docker_socket="/var/run/docker.sock" --docker_stop_timeout="0ns"
--docker_store_dir="/tmp/Endpoint_SlaveEndpointTest_UnauthorizedRequest_2_vNxblO/store/docker"
--docker_volume_checkpoint_dir="/var/run/mesos/isolators/docker/volume" --enforce_container_disk_quota="false"
--executor_registration_timeout="1mins" --executor_reregistration_timeout="2secs" --executor_shutdown_grace_period="5secs"
--fetcher_cache_dir="/tmp/Endpoint_SlaveEndpointTest_UnauthorizedRequest_2_vNxblO/fetch" --fetcher_cache_size="2GB"
--frameworks_home="" --gc_delay="1weeks" --gc_disk_headroom="0.1" --hadoop_home="" --help="false"
--hostname_lookup="true" --http_command_executor="false" --http_credentials="/tmp/Endpoint_SlaveEndpointTest_UnauthorizedRequest_2_vNxblO/http_credentials"
--http_heartbeat_interval="30secs" --initialize_driver_logging="true" --isolation="posix/cpu,posix/mem"
--launcher="posix" --launcher_dir="/mesos/mesos-1.5.0/_build/src" --logbufsecs="0" --logging_level="INFO"
--max_completed_executors_per_framework="150" --oversubscribed_resources_interval="15secs"
--perf_duration="10secs" --perf_interval="1mins" --port="5051" --qos_correction_interval_min="0ns"
--quiet="false" --recover="reconnect" --recovery_timeout="15mins" --registration_backoff_factor="10ms"
--resources="cpus:2;gpus:0;mem:1024;disk:1024;ports:[31000-32000]" --revocable_cpu_low_priority="true"
--runtime_dir="/tmp/Endpoint_SlaveEndpointTest_UnauthorizedRequest_2_vNxblO" --sandbox_directory="/mnt/mesos/sandbox"
--strict="true" --switch_user="true" --systemd_enable_support="true" --systemd_runtime_directory="/run/systemd/system"
--version="false" --work_dir="/tmp/Endpoint_SlaveEndpointTest_UnauthorizedRequest_2_xbT9N4"
--zk_session_timeout="10secs"
I1003 00:53:45.286856  6803 credentials.hpp:86] Loading credential for authentication from
'/tmp/Endpoint_SlaveEndpointTest_UnauthorizedRequest_2_vNxblO/credential'
I1003 00:53:45.287029  6803 slave.cpp:287] Agent using credential for: test-principal
I1003 00:53:45.287052  6803 credentials.hpp:37] Loading credentials for authentication from
'/tmp/Endpoint_SlaveEndpointTest_UnauthorizedRequest_2_vNxblO/http_credentials'
I1003 00:53:45.287297  6803 http.cpp:1045] Creating default 'basic' HTTP authenticator for
realm 'mesos-agent-readonly'
I1003 00:53:45.287461  6803 http.cpp:1045] Creating default 'basic' HTTP authenticator for
realm 'mesos-agent-readwrite'
I1003 00:53:45.288861  6803 slave.cpp:585] Agent resources: [{"name":"cpus","scalar":{"value":2.0},"type":"SCALAR"},{"name":"mem","scalar":{"value":1024.0},"type":"SCALAR"},{"name":"disk","scalar":{"value":1024.0},"type":"SCALAR"},{"name":"ports","ranges":{"range":[{"begin":31000,"end":32000}]},"type":"RANGES"}]
I1003 00:53:45.289125  6803 slave.cpp:593] Agent attributes: [  ]
I1003 00:53:45.289141  6803 slave.cpp:602] Agent hostname: f956d9c3ff7c
I1003 00:53:45.289269  6822 status_update_manager.cpp:177] Pausing sending status updates
I1003 00:53:45.291039  6809 state.cpp:64] Recovering state from '/tmp/Endpoint_SlaveEndpointTest_UnauthorizedRequest_2_xbT9N4/meta'
I1003 00:53:45.291362  6805 status_update_manager.cpp:203] Recovering status update manager
I1003 00:53:45.291643  6805 containerizer.cpp:648] Recovering containerizer
I1003 00:53:45.293221  6811 provisioner.cpp:416] Provisioner recovery complete
I1003 00:53:45.293581  6806 slave.cpp:6310] Finished recovery
I1003 00:53:45.294059  6806 slave.cpp:6492] Querying resource estimator for oversubscribable
resources
I1003 00:53:45.294325  6812 slave.cpp:6506] Received oversubscribable resources {} from the
resource estimator
I1003 00:53:45.296669  6819 process.cpp:3929] Handling HTTP event for process 'slave(820)'
with path: '/slave(820)/containers'
I1003 00:53:45.298228  6807 http.cpp:1185] HTTP GET for /slave(820)/containers from 172.17.0.8:34392
I1003 00:53:45.298297  6807 http.cpp:976] Authorizing principal 'test-principal' to GET the
'/containers' endpoint
I1003 00:53:45.300532  6780 slave.cpp:869] Agent terminating
[       OK ] Endpoint/SlaveEndpointTest.UnauthorizedRequest/2 (30 ms)
[ RUN      ] Endpoint/SlaveEndpointTest.NoAuthorizer/0
I1003 00:53:45.316541  6780 containerizer.cpp:292] Using isolation { environment_secret, posix/cpu,
posix/mem, filesystem/posix, network/cni }
W1003 00:53:45.317267  6780 backend.cpp:76] Failed to create 'aufs' backend: AufsBackend requires
root privileges
W1003 00:53:45.317430  6780 backend.cpp:76] Failed to create 'bind' backend: BindBackend requires
root privileges
I1003 00:53:45.317476  6780 provisioner.cpp:255] Using default backend 'copy'
I1003 00:53:45.320075  6780 cluster.cpp:448] Creating default 'local' authorizer
I1003 00:53:45.323207  6818 slave.cpp:254] Mesos agent started on (821)@172.17.0.8:32814
I1003 00:53:45.323230  6818 slave.cpp:255] Flags at startup: --acls="" --appc_simple_discovery_uri_prefix="http://"
--appc_store_dir="/tmp/Endpoint_SlaveEndpointTest_NoAuthorizer_0_5bmbJK/store/appc" --authenticate_http_readonly="true"
--authenticate_http_readwrite="true" --authenticatee="crammd5" --authentication_backoff_factor="1secs"
--authorizer="local" --cgroups_cpu_enable_pids_and_tids_count="false" --cgroups_enable_cfs="false"
--cgroups_hierarchy="/sys/fs/cgroup" --cgroups_limit_swap="false" --cgroups_root="mesos" --container_disk_watch_interval="15secs"
--containerizers="mesos" --credential="/tmp/Endpoint_SlaveEndpointTest_NoAuthorizer_0_5bmbJK/credential"
--default_role="*" --disallow_sharing_agent_pid_namespace="false" --disk_watch_interval="1mins"
--docker="docker" --docker_kill_orphans="true" --docker_registry="https://registry-1.docker.io"
--docker_remove_delay="6hrs" --docker_socket="/var/run/docker.sock" --docker_stop_timeout="0ns"
--docker_store_dir="/tmp/Endpoint_SlaveEndpointTest_NoAuthorizer_0_5bmbJK/store/docker" --docker_volume_checkpoint_dir="/var/run/mesos/isolators/docker/volume"
--enforce_container_disk_quota="false" --executor_registration_timeout="1mins" --executor_reregistration_timeout="2secs"
--executor_shutdown_grace_period="5secs" --fetcher_cache_dir="/tmp/Endpoint_SlaveEndpointTest_NoAuthorizer_0_5bmbJK/fetch"
--fetcher_cache_size="2GB" --frameworks_home="" --gc_delay="1weeks" --gc_disk_headroom="0.1"
--hadoop_home="" --help="false" --hostname_lookup="true" --http_command_executor="false" --http_credentials="/tmp/Endpoint_SlaveEndpointTest_NoAuthorizer_0_5bmbJK/http_credentials"
--http_heartbeat_interval="30secs" --initialize_driver_logging="true" --isolation="posix/cpu,posix/mem"
--launcher="posix" --launcher_dir="/mesos/mesos-1.5.0/_build/src" --logbufsecs="0" --logging_level="INFO"
--max_completed_executors_per_framework="150" --oversubscribed_resources_interval="15secs"
--perf_duration="10secs" --perf_interval="1mins" --port="5051" --qos_correction_interval_min="0ns"
--quiet="false" --recover="reconnect" --recovery_timeout="15mins" --registration_backoff_factor="10ms"
--resources="cpus:2;gpus:0;mem:1024;disk:1024;ports:[31000-32000]" --revocable_cpu_low_priority="true"
--runtime_dir="/tmp/Endpoint_SlaveEndpointTest_NoAuthorizer_0_5bmbJK" --sandbox_directory="/mnt/mesos/sandbox"
--strict="true" --switch_user="true" --systemd_enable_support="true" --systemd_runtime_directory="/run/systemd/system"
--version="false" --work_dir="/tmp/Endpoint_SlaveEndpointTest_NoAuthorizer_0_cl1n70" --zk_session_timeout="10secs"
I1003 00:53:45.323690  6818 credentials.hpp:86] Loading credential for authentication from
'/tmp/Endpoint_SlaveEndpointTest_NoAuthorizer_0_5bmbJK/credential'
I1003 00:53:45.323856  6818 slave.cpp:287] Agent using credential for: test-principal
I1003 00:53:45.323880  6818 credentials.hpp:37] Loading credentials for authentication from
'/tmp/Endpoint_SlaveEndpointTest_NoAuthorizer_0_5bmbJK/http_credentials'
I1003 00:53:45.324123  6818 http.cpp:1045] Creating default 'basic' HTTP authenticator for
realm 'mesos-agent-readonly'
I1003 00:53:45.324280  6818 http.cpp:1045] Creating default 'basic' HTTP authenticator for
realm 'mesos-agent-readwrite'
I1003 00:53:45.325716  6818 slave.cpp:585] Agent resources: [{"name":"cpus","scalar":{"value":2.0},"type":"SCALAR"},{"name":"mem","scalar":{"value":1024.0},"type":"SCALAR"},{"name":"disk","scalar":{"value":1024.0},"type":"SCALAR"},{"name":"ports","ranges":{"range":[{"begin":31000,"end":32000}]},"type":"RANGES"}]
I1003 00:53:45.325953  6818 slave.cpp:593] Agent attributes: [  ]
I1003 00:53:45.325969  6818 slave.cpp:602] Agent hostname: f956d9c3ff7c
I1003 00:53:45.326184  6799 status_update_manager.cpp:177] Pausing sending status updates
I1003 00:53:45.327550  6801 state.cpp:64] Recovering state from '/tmp/Endpoint_SlaveEndpointTest_NoAuthorizer_0_cl1n70/meta'
I1003 00:53:45.327834  6801 status_update_manager.cpp:203] Recovering status update manager
I1003 00:53:45.328105  6800 containerizer.cpp:648] Recovering containerizer
I1003 00:53:45.329573  6815 provisioner.cpp:416] Provisioner recovery complete
I1003 00:53:45.330032  6803 slave.cpp:6310] Finished recovery
I1003 00:53:45.330648  6803 slave.cpp:6492] Querying resource estimator for oversubscribable
resources
I1003 00:53:45.330956  6806 slave.cpp:6506] Received oversubscribable resources {} from the
resource estimator
I1003 00:53:45.333271  6819 process.cpp:3929] Handling HTTP event for process 'slave(821)'
with path: '/slave(821)/monitor/statistics'
I1003 00:53:45.335008  6816 http.cpp:1185] HTTP GET for /slave(821)/monitor/statistics from
172.17.0.8:34394
I1003 00:53:45.335151  6816 http.cpp:976] Authorizing principal 'test-principal' to GET the
'/monitor/statistics' endpoint
I1003 00:53:45.339463  6811 slave.cpp:869] Agent terminating
[       OK ] Endpoint/SlaveEndpointTest.NoAuthorizer/0 (40 ms)
[ RUN      ] Endpoint/SlaveEndpointTest.NoAuthorizer/1
I1003 00:53:45.355989  6780 containerizer.cpp:292] Using isolation { environment_secret, posix/cpu,
posix/mem, filesystem/posix, network/cni }
W1003 00:53:45.356662  6780 backend.cpp:76] Failed to create 'aufs' backend: AufsBackend requires
root privileges
W1003 00:53:45.356812  6780 backend.cpp:76] Failed to create 'bind' backend: BindBackend requires
root privileges
I1003 00:53:45.356859  6780 provisioner.cpp:255] Using default backend 'copy'
I1003 00:53:45.359179  6780 cluster.cpp:448] Creating default 'local' authorizer
I1003 00:53:45.361831  6817 slave.cpp:254] Mesos agent started on (822)@172.17.0.8:32814
I1003 00:53:45.361876  6817 slave.cpp:255] Flags at startup: --acls="" --appc_simple_discovery_uri_prefix="http://"
--appc_store_dir="/tmp/Endpoint_SlaveEndpointTest_NoAuthorizer_1_FuEtuH/store/appc" --authenticate_http_readonly="true"
--authenticate_http_readwrite="true" --authenticatee="crammd5" --authentication_backoff_factor="1secs"
--authorizer="local" --cgroups_cpu_enable_pids_and_tids_count="false" --cgroups_enable_cfs="false"
--cgroups_hierarchy="/sys/fs/cgroup" --cgroups_limit_swap="false" --cgroups_root="mesos" --container_disk_watch_interval="15secs"
--containerizers="mesos" --credential="/tmp/Endpoint_SlaveEndpointTest_NoAuthorizer_1_FuEtuH/credential"
--default_role="*" --disallow_sharing_agent_pid_namespace="false" --disk_watch_interval="1mins"
--docker="docker" --docker_kill_orphans="true" --docker_registry="https://registry-1.docker.io"
--docker_remove_delay="6hrs" --docker_socket="/var/run/docker.sock" --docker_stop_timeout="0ns"
--docker_store_dir="/tmp/Endpoint_SlaveEndpointTest_NoAuthorizer_1_FuEtuH/store/docker" --docker_volume_checkpoint_dir="/var/run/mesos/isolators/docker/volume"
--enforce_container_disk_quota="false" --executor_registration_timeout="1mins" --executor_reregistration_timeout="2secs"
--executor_shutdown_grace_period="5secs" --fetcher_cache_dir="/tmp/Endpoint_SlaveEndpointTest_NoAuthorizer_1_FuEtuH/fetch"
--fetcher_cache_size="2GB" --frameworks_home="" --gc_delay="1weeks" --gc_disk_headroom="0.1"
--hadoop_home="" --help="false" --hostname_lookup="true" --http_command_executor="false" --http_credentials="/tmp/Endpoint_SlaveEndpointTest_NoAuthorizer_1_FuEtuH/http_credentials"
--http_heartbeat_interval="30secs" --initialize_driver_logging="true" --isolation="posix/cpu,posix/mem"
--launcher="posix" --launcher_dir="/mesos/mesos-1.5.0/_build/src" --logbufsecs="0" --logging_level="INFO"
--max_completed_executors_per_framework="150" --oversubscribed_resources_interval="15secs"
--perf_duration="10secs" --perf_interval="1mins" --port="5051" --qos_correction_interval_min="0ns"
--quiet="false" --recover="reconnect" --recovery_timeout="15mins" --registration_backoff_factor="10ms"
--resources="cpus:2;gpus:0;mem:1024;disk:1024;ports:[31000-32000]" --revocable_cpu_low_priority="true"
--runtime_dir="/tmp/Endpoint_SlaveEndpointTest_NoAuthorizer_1_FuEtuH" --sandbox_directory="/mnt/mesos/sandbox"
--strict="true" --switch_user="true" --systemd_enable_support="true" --systemd_runtime_directory="/run/systemd/system"
--version="false" --work_dir="/tmp/Endpoint_SlaveEndpointTest_NoAuthorizer_1_jSAKMX" --zk_session_timeout="10secs"
I1003 00:53:45.362362  6817 credentials.hpp:86] Loading credential for authentication from
'/tmp/Endpoint_SlaveEndpointTest_NoAuthorizer_1_FuEtuH/credential'
I1003 00:53:45.362591  6817 slave.cpp:287] Agent using credential for: test-principal
I1003 00:53:45.362620  6817 credentials.hpp:37] Loading credentials for authentication from
'/tmp/Endpoint_SlaveEndpointTest_NoAuthorizer_1_FuEtuH/http_credentials'
I1003 00:53:45.362975  6817 http.cpp:1045] Creating default 'basic' HTTP authenticator for
realm 'mesos-agent-readonly'
I1003 00:53:45.363173  6817 http.cpp:1045] Creating default 'basic' HTTP authenticator for
realm 'mesos-agent-readwrite'
I1003 00:53:45.365101  6817 slave.cpp:585] Agent resources: [{"name":"cpus","scalar":{"value":2.0},"type":"SCALAR"},{"name":"mem","scalar":{"value":1024.0},"type":"SCALAR"},{"name":"disk","scalar":{"value":1024.0},"type":"SCALAR"},{"name":"ports","ranges":{"range":[{"begin":31000,"end":32000}]},"type":"RANGES"}]
I1003 00:53:45.365423  6817 slave.cpp:593] Agent attributes: [  ]
I1003 00:53:45.365440  6817 slave.cpp:602] Agent hostname: f956d9c3ff7c
I1003 00:53:45.365685  6818 status_update_manager.cpp:177] Pausing sending status updates
I1003 00:53:45.367424  6806 state.cpp:64] Recovering state from '/tmp/Endpoint_SlaveEndpointTest_NoAuthorizer_1_jSAKMX/meta'
I1003 00:53:45.367729  6806 status_update_manager.cpp:203] Recovering status update manager
I1003 00:53:45.367956  6822 containerizer.cpp:648] Recovering containerizer
I1003 00:53:45.370054  6802 provisioner.cpp:416] Provisioner recovery complete
I1003 00:53:45.370535  6818 slave.cpp:6310] Finished recovery
I1003 00:53:45.371021  6818 slave.cpp:6492] Querying resource estimator for oversubscribable
resources
I1003 00:53:45.371251  6806 slave.cpp:6506] Received oversubscribable resources {} from the
resource estimator
I1003 00:53:45.373673  6815 process.cpp:3929] Handling HTTP event for process 'slave(822)'
with path: '/slave(822)/monitor/statistics.json'
I1003 00:53:45.375764  6807 http.cpp:1185] HTTP GET for /slave(822)/monitor/statistics.json
from 172.17.0.8:34396
I1003 00:53:45.375891  6807 http.cpp:976] Authorizing principal 'test-principal' to GET the
'/monitor/statistics.json' endpoint
I1003 00:53:45.379714  6780 slave.cpp:869] Agent terminating
[       OK ] Endpoint/SlaveEndpointTest.NoAuthorizer/1 (39 ms)
[ RUN      ] Endpoint/SlaveEndpointTest.NoAuthorizer/2
I1003 00:53:45.397474  6780 containerizer.cpp:292] Using isolation { environment_secret, posix/cpu,
posix/mem, filesystem/posix, network/cni }
W1003 00:53:45.398305  6780 backend.cpp:76] Failed to create 'aufs' backend: AufsBackend requires
root privileges
W1003 00:53:45.398496  6780 backend.cpp:76] Failed to create 'bind' backend: BindBackend requires
root privileges
I1003 00:53:45.398557  6780 provisioner.cpp:255] Using default backend 'copy'
I1003 00:53:45.401357  6780 cluster.cpp:448] Creating default 'local' authorizer
I1003 00:53:45.404726  6819 slave.cpp:254] Mesos agent started on (823)@172.17.0.8:32814
I1003 00:53:45.404754  6819 slave.cpp:255] Flags at startup: --acls="" --appc_simple_discovery_uri_prefix="http://"
--appc_store_dir="/tmp/Endpoint_SlaveEndpointTest_NoAuthorizer_2_HGUMDE/store/appc" --authenticate_http_readonly="true"
--authenticate_http_readwrite="true" --authenticatee="crammd5" --authentication_backoff_factor="1secs"
--authorizer="local" --cgroups_cpu_enable_pids_and_tids_count="false" --cgroups_enable_cfs="false"
--cgroups_hierarchy="/sys/fs/cgroup" --cgroups_limit_swap="false" --cgroups_root="mesos" --container_disk_watch_interval="15secs"
--containerizers="mesos" --credential="/tmp/Endpoint_SlaveEndpointTest_NoAuthorizer_2_HGUMDE/credential"
--default_role="*" --disallow_sharing_agent_pid_namespace="false" --disk_watch_interval="1mins"
--docker="docker" --docker_kill_orphans="true" --docker_registry="https://registry-1.docker.io"
--docker_remove_delay="6hrs" --docker_socket="/var/run/docker.sock" --docker_stop_timeout="0ns"
--docker_store_dir="/tmp/Endpoint_SlaveEndpointTest_NoAuthorizer_2_HGUMDE/store/docker" --docker_volume_checkpoint_dir="/var/run/mesos/isolators/docker/volume"
--enforce_container_disk_quota="false" --executor_registration_timeout="1mins" --executor_reregistration_timeout="2secs"
--executor_shutdown_grace_period="5secs" --fetcher_cache_dir="/tmp/Endpoint_SlaveEndpointTest_NoAuthorizer_2_HGUMDE/fetch"
--fetcher_cache_size="2GB" --frameworks_home="" --gc_delay="1weeks" --gc_disk_headroom="0.1"
--hadoop_home="" --help="false" --hostname_lookup="true" --http_command_executor="false" --http_credentials="/tmp/Endpoint_SlaveEndpointTest_NoAuthorizer_2_HGUMDE/http_credentials"
--http_heartbeat_interval="30secs" --initialize_driver_logging="true" --isolation="posix/cpu,posix/mem"
--launcher="posix" --launcher_dir="/mesos/mesos-1.5.0/_build/src" --logbufsecs="0" --logging_level="INFO"
--max_completed_executors_per_framework="150" --oversubscribed_resources_interval="15secs"
--perf_duration="10secs" --perf_interval="1mins" --port="5051" --qos_correction_interval_min="0ns"
--quiet="false" --recover="reconnect" --recovery_timeout="15mins" --registration_backoff_factor="10ms"
--resources="cpus:2;gpus:0;mem:1024;disk:1024;ports:[31000-32000]" --revocable_cpu_low_priority="true"
--runtime_dir="/tmp/Endpoint_SlaveEndpointTest_NoAuthorizer_2_HGUMDE" --sandbox_directory="/mnt/mesos/sandbox"
--strict="true" --switch_user="true" --systemd_enable_support="true" --systemd_runtime_directory="/run/systemd/system"
--version="false" --work_dir="/tmp/Endpoint_SlaveEndpointTest_NoAuthorizer_2_XAH1PU" --zk_session_timeout="10secs"
I1003 00:53:45.405315  6819 credentials.hpp:86] Loading credential for authentication from
'/tmp/Endpoint_SlaveEndpointTest_NoAuthorizer_2_HGUMDE/credential'
I1003 00:53:45.405526  6819 slave.cpp:287] Agent using credential for: test-principal
I1003 00:53:45.405550  6819 credentials.hpp:37] Loading credentials for authentication from
'/tmp/Endpoint_SlaveEndpointTest_NoAuthorizer_2_HGUMDE/http_credentials'
I1003 00:53:45.405833  6819 http.cpp:1045] Creating default 'basic' HTTP authenticator for
realm 'mesos-agent-readonly'
I1003 00:53:45.406006  6819 http.cpp:1045] Creating default 'basic' HTTP authenticator for
realm 'mesos-agent-readwrite'
I1003 00:53:45.407515  6819 slave.cpp:585] Agent resources: [{"name":"cpus","scalar":{"value":2.0},"type":"SCALAR"},{"name":"mem","scalar":{"value":1024.0},"type":"SCALAR"},{"name":"disk","scalar":{"value":1024.0},"type":"SCALAR"},{"name":"ports","ranges":{"range":[{"begin":31000,"end":32000}]},"type":"RANGES"}]
I1003 00:53:45.407773  6819 slave.cpp:593] Agent attributes: [  ]
I1003 00:53:45.407801  6819 slave.cpp:602] Agent hostname: f956d9c3ff7c
I1003 00:53:45.407987  6820 status_update_manager.cpp:177] Pausing sending status updates
I1003 00:53:45.409967  6816 state.cpp:64] Recovering state from '/tmp/Endpoint_SlaveEndpointTest_NoAuthorizer_2_XAH1PU/meta'
I1003 00:53:45.410470  6818 status_update_manager.cpp:203] Recovering status update manager
I1003 00:53:45.410709  6813 containerizer.cpp:648] Recovering containerizer
I1003 00:53:45.412371  6801 provisioner.cpp:416] Provisioner recovery complete
I1003 00:53:45.413127  6820 slave.cpp:6310] Finished recovery
I1003 00:53:45.413723  6820 slave.cpp:6492] Querying resource estimator for oversubscribable
resources
I1003 00:53:45.414023  6809 slave.cpp:6506] Received oversubscribable resources {} from the
resource estimator
I1003 00:53:45.416393  6803 process.cpp:3929] Handling HTTP event for process 'slave(823)'
with path: '/slave(823)/containers'
I1003 00:53:45.418129  6810 http.cpp:1185] HTTP GET for /slave(823)/containers from 172.17.0.8:34398
I1003 00:53:45.418249  6810 http.cpp:976] Authorizing principal 'test-principal' to GET the
'/containers' endpoint
I1003 00:53:45.423012  6802 slave.cpp:869] Agent terminating
[       OK ] Endpoint/SlaveEndpointTest.NoAuthorizer/2 (42 ms)
[----------] 9 tests from Endpoint/SlaveEndpointTest (343 ms total)

[----------] 2 tests from ContainerizerType/DefaultContainerDNSFlagTest
[ RUN      ] ContainerizerType/DefaultContainerDNSFlagTest.ValidateFlag/0
[       OK ] ContainerizerType/DefaultContainerDNSFlagTest.ValidateFlag/0 (13 ms)
[ RUN      ] ContainerizerType/DefaultContainerDNSFlagTest.ValidateFlag/1
[       OK ] ContainerizerType/DefaultContainerDNSFlagTest.ValidateFlag/1 (12 ms)
[----------] 2 tests from ContainerizerType/DefaultContainerDNSFlagTest (25 ms total)

[----------] Global test environment tear-down
[==========] 1682 tests from 184 test cases ran. (560037 ms total)
[  PASSED  ] 1681 tests.
[  FAILED  ] 1 test, listed below:
[  FAILED  ] CommandExecutorCheckTest.CommandCheckDeliveredAndReconciled

 1 FAILED TEST
  YOU HAVE 21 DISABLED TESTS

I1003 00:53:45.526450  6823 process.cpp:1068] Failed to accept socket: future discarded
make[4]: *** [check-local] Error 1
make[4]: Leaving directory `/mesos/mesos-1.5.0/_build/src'
make[3]: *** [check-am] Error 2
make[3]: Leaving directory `/mesos/mesos-1.5.0/_build/src'
make[2]: *** [check] Error 2
make[2]: Leaving directory `/mesos/mesos-1.5.0/_build/src'
make[1]: *** [check-recursive] Error 1
make[1]: Leaving directory `/mesos/mesos-1.5.0/_build'
make: *** [distcheck] Error 1
+ docker rmi mesos-1506989378-10895
Untagged: mesos-1506989378-10895:latest
Deleted: sha256:c41ddd04550f96136f98c8c11ea21b9552781c57fe4d685b37969903fd4f49e4
Deleted: sha256:e26dfd9801284d4d18c5eed6fe06ee16fd79348c7262614e3f4b691beb3eedae
Deleted: sha256:a872f6e0359b62b02ddf617c565c8a9cf0201494a3e5564d25a7c162ea9b79f0
Deleted: sha256:887ecee0a642461097e878f51a3ce7e401617dd86b45c5ec002f6d5904f9d15f
Deleted: sha256:503dc1d9064e0504e7ea449b8b67add8c804cb553b5b7dce4a565c7e83bfc88d
Deleted: sha256:c96a57bacc3e1f6ceac5e59131d05b39ce2b8ed6a439e30c3ff5c37a5d3a7e97
Deleted: sha256:6263a3ab5a265bbe3b27dbf8004d1ce7a65da35a76336e17aa546c02d41202af
Deleted: sha256:70d0c7ac445f8c3f2323fe47f3dad124a0ea6de58e20c6fa49fdab6f8cb33a97
Deleted: sha256:f86c7ea9a6f73134fd9136967802b94b70891ed30baa832a75cb5d39b43323d8
Deleted: sha256:0f448bb408c07b1185fcc21f4a1c590a4e103c56b4543cf27240411a2572204e
Deleted: sha256:7598813e26f40442f1132ac09eb1c8ef19b19e7cb00690f51b210a7b1079d71e
Deleted: sha256:c5bf80d6f87030967e3d280d61abed706db2fa69afd91d47f16e7450c8db6409
Deleted: sha256:c4f25abf9c8a006ee01cea447aa4894322ed5b11c91fbf0f91eec696ac241b8d
Deleted: sha256:8d2fbc0a632a52252f4365cd42a98fc45b292c08a723b154bda4a052bcb3a088
Deleted: sha256:aaa2a4456d0c728e3055a2972711788e636c35d172c3b7fe7443341a5553b001
Deleted: sha256:ced52d84d8cde8c7d3358840f3b694ba35c92b6fcf6670f0f39253718e0a2652
Deleted: sha256:4427d2c749e5cd84f4fec162ffc64017ab2cafee23bee81a4e0edcb289e081be
Deleted: sha256:b8ad061dbc93d65156672a6d08bd48ae603f8bae2a3db163db2e1dff439efa46
Deleted: sha256:f5a9be50f7c0341ff3cbd4eee96579177c59e896ec8dc2b509b4f5af63a6c0a9
Deleted: sha256:726195d5607000a1860d1c1872caded22c2f1c0775a6fb48517f16313a141e65
Deleted: sha256:3d09876dfb6a44df399a3ddade8348653900311df246a1f081364b976173b489
Deleted: sha256:6f8d3f2bddf5ea181748bafa130249f58adac7bcdac269a5e41635462d94cf5e
Deleted: sha256:517e8d9d59f9ac0832ce0f4612976f97d1b7cceca9956b8a0b39f4bece42ea41
Deleted: sha256:fac626803293ba9f91ad0ef9cdd9b419c37faa6d1b8f71b5b0a4fa83cf120b11
Deleted: sha256:7c9c2b66fe8555cfe733ab69f4c4ef2938f7a47ac606d87976e176ea4cdcc06f
Deleted: sha256:701de26ee96d9ce7ba68ea54f19872bcfacd5886c33147659780f9e9ca77d711
Deleted: sha256:22b67d29449ed3d9299c0fc2c8e0219810e17d4d38a5ef62cd218e361667e100
Deleted: sha256:eb508474a14d031faa72fee865c114a678ba2ea5558ec03d1ea8bc8fd2aa651d
Deleted: sha256:78df42b6cbf92288041d1f8490c841557769882d149051a7ebad30760b465d87
Build step 'Execute shell' marked build as failure

Mime
View raw message