mesos-builds mailing list archives

Site index · List index
Message view « Date » · « Thread »
Top « Date » · « Thread »
From Apache Jenkins Server <jenk...@builds.apache.org>
Subject Build failed in Jenkins: Mesos-Buildbot » autotools,gcc,--verbose --disable-libtool-wrappers --enable-libevent --enable-ssl,GLOG_v=1 MESOS_VERBOSE=1,centos:7,(ubuntu)&&(!ubuntu-us1)&&(!ubuntu-eu2)&&(!qnode3)&&(!H23) #4314
Date Thu, 12 Oct 2017 18:10:12 GMT
See <https://builds.apache.org/job/Mesos-Buildbot/BUILDTOOL=autotools,COMPILER=gcc,CONFIGURATION=--verbose%20--disable-libtool-wrappers%20--enable-libevent%20--enable-ssl,ENVIRONMENT=GLOG_v=1%20MESOS_VERBOSE=1,OS=centos%3A7,label_exp=(ubuntu)&&(!ubuntu-us1)&&(!ubuntu-eu2)&&(!qnode3)&&(!H23)/4314/display/redirect?page=changes>

Changes:

[jpeach] Fixed default executor handling of nested container status.

------------------------------------------
[...truncated 33.88 MB...]
I1012 18:09:45.032279 19488 credentials.hpp:86] Loading credential for authentication from
'/tmp/Endpoint_SlaveEndpointTest_UnauthorizedRequest_0_Pq9HaX/credential'
I1012 18:09:45.032495 19488 slave.cpp:287] Agent using credential for: test-principal
I1012 18:09:45.032526 19488 credentials.hpp:37] Loading credentials for authentication from
'/tmp/Endpoint_SlaveEndpointTest_UnauthorizedRequest_0_Pq9HaX/http_credentials'
I1012 18:09:45.032881 19488 http.cpp:1045] Creating default 'basic' HTTP authenticator for
realm 'mesos-agent-executor'
I1012 18:09:45.033044 19488 http.cpp:1066] Creating default 'jwt' HTTP authenticator for realm
'mesos-agent-executor'
I1012 18:09:45.033305 19488 http.cpp:1045] Creating default 'basic' HTTP authenticator for
realm 'mesos-agent-readonly'
I1012 18:09:45.033416 19488 http.cpp:1066] Creating default 'jwt' HTTP authenticator for realm
'mesos-agent-readonly'
I1012 18:09:45.033641 19488 http.cpp:1045] Creating default 'basic' HTTP authenticator for
realm 'mesos-agent-readwrite'
I1012 18:09:45.033754 19488 http.cpp:1066] Creating default 'jwt' HTTP authenticator for realm
'mesos-agent-readwrite'
I1012 18:09:45.035392 19488 slave.cpp:585] Agent resources: [{"name":"cpus","scalar":{"value":2.0},"type":"SCALAR"},{"name":"mem","scalar":{"value":1024.0},"type":"SCALAR"},{"name":"disk","scalar":{"value":1024.0},"type":"SCALAR"},{"name":"ports","ranges":{"range":[{"begin":31000,"end":32000}]},"type":"RANGES"}]
I1012 18:09:45.035650 19488 slave.cpp:593] Agent attributes: [  ]
I1012 18:09:45.035666 19488 slave.cpp:602] Agent hostname: e588e2f637bc
I1012 18:09:45.035815 19497 status_update_manager.cpp:177] Pausing sending status updates
I1012 18:09:45.037642 19477 state.cpp:64] Recovering state from '/tmp/Endpoint_SlaveEndpointTest_UnauthorizedRequest_0_eBQRAM/meta'
I1012 18:09:45.037951 19486 status_update_manager.cpp:203] Recovering status update manager
I1012 18:09:45.038166 19494 containerizer.cpp:648] Recovering containerizer
I1012 18:09:45.039798 19483 provisioner.cpp:416] Provisioner recovery complete
I1012 18:09:45.040127 19497 slave.cpp:6310] Finished recovery
I1012 18:09:45.040680 19497 slave.cpp:6492] Querying resource estimator for oversubscribable
resources
I1012 18:09:45.040966 19476 slave.cpp:6506] Received oversubscribable resources {} from the
resource estimator
I1012 18:09:45.043531 19487 process.cpp:3929] Handling HTTP event for process 'slave(825)'
with path: '/slave(825)/monitor/statistics'
I1012 18:09:45.045508 19479 http.cpp:1185] HTTP GET for /slave(825)/monitor/statistics from
172.17.0.4:43690
I1012 18:09:45.045598 19479 http.cpp:976] Authorizing principal 'test-principal' to GET the
'/monitor/statistics' endpoint
I1012 18:09:45.048022 19490 slave.cpp:869] Agent terminating
[       OK ] Endpoint/SlaveEndpointTest.UnauthorizedRequest/0 (32 ms)
[ RUN      ] Endpoint/SlaveEndpointTest.UnauthorizedRequest/1
I1012 18:09:45.059589  9515 containerizer.cpp:292] Using isolation { environment_secret, posix/cpu,
posix/mem, filesystem/posix, network/cni }
W1012 18:09:45.060166  9515 backend.cpp:76] Failed to create 'aufs' backend: AufsBackend requires
root privileges
W1012 18:09:45.060297  9515 backend.cpp:76] Failed to create 'bind' backend: BindBackend requires
root privileges
I1012 18:09:45.060345  9515 provisioner.cpp:255] Using default backend 'copy'
I1012 18:09:45.064051 19475 slave.cpp:254] Mesos agent started on (826)@172.17.0.4:36774
I1012 18:09:45.064086 19475 slave.cpp:255] Flags at startup: --acls="" --appc_simple_discovery_uri_prefix="http://"
--appc_store_dir="/tmp/Endpoint_SlaveEndpointTest_UnauthorizedRequest_1_tIGzKD/store/appc"
--authenticate_http_executors="true" --authenticate_http_readonly="true" --authenticate_http_readwrite="true"
--authenticatee="crammd5" --authentication_backoff_factor="1secs" --authorizer="local" --cgroups_cpu_enable_pids_and_tids_count="false"
--cgroups_enable_cfs="false" --cgroups_hierarchy="/sys/fs/cgroup" --cgroups_limit_swap="false"
--cgroups_root="mesos" --container_disk_watch_interval="15secs" --containerizers="mesos" --credential="/tmp/Endpoint_SlaveEndpointTest_UnauthorizedRequest_1_tIGzKD/credential"
--default_role="*" --disallow_sharing_agent_pid_namespace="false" --disk_watch_interval="1mins"
--docker="docker" --docker_kill_orphans="true" --docker_registry="https://registry-1.docker.io"
--docker_remove_delay="6hrs" --docker_socket="/var/run/docker.sock" --docker_stop_timeout="0ns"
--docker_store_dir="/tmp/Endpoint_SlaveEndpointTest_UnauthorizedRequest_1_tIGzKD/store/docker"
--docker_volume_checkpoint_dir="/var/run/mesos/isolators/docker/volume" --enforce_container_disk_quota="false"
--executor_registration_timeout="1mins" --executor_reregistration_timeout="2secs" --executor_secret_key="/tmp/Endpoint_SlaveEndpointTest_UnauthorizedRequest_1_tIGzKD/executor_secret_key"
--executor_shutdown_grace_period="5secs" --fetcher_cache_dir="/tmp/Endpoint_SlaveEndpointTest_UnauthorizedRequest_1_tIGzKD/fetch"
--fetcher_cache_size="2GB" --frameworks_home="" --gc_delay="1weeks" --gc_disk_headroom="0.1"
--hadoop_home="" --help="false" --hostname_lookup="true" --http_command_executor="false" --http_credentials="/tmp/Endpoint_SlaveEndpointTest_UnauthorizedRequest_1_tIGzKD/http_credentials"
--http_heartbeat_interval="30secs" --initialize_driver_logging="true" --isolation="posix/cpu,posix/mem"
--launcher="posix" --launcher_dir="/mesos/mesos-1.5.0/_build/src" --logbufsecs="0" --logging_level="INFO"
--max_completed_executors_per_framework="150" --oversubscribed_resources_interval="15secs"
--perf_duration="10secs" --perf_interval="1mins" --port="5051" --qos_correction_interval_min="0ns"
--quiet="false" --recover="reconnect" --recovery_timeout="15mins" --registration_backoff_factor="10ms"
--resources="cpus:2;gpus:0;mem:1024;disk:1024;ports:[31000-32000]" --revocable_cpu_low_priority="true"
--runtime_dir="/tmp/Endpoint_SlaveEndpointTest_UnauthorizedRequest_1_tIGzKD" --sandbox_directory="/mnt/mesos/sandbox"
--strict="true" --switch_user="true" --systemd_enable_support="true" --systemd_runtime_directory="/run/systemd/system"
--version="false" --work_dir="/tmp/Endpoint_SlaveEndpointTest_UnauthorizedRequest_1_gKyU5s"
--zk_session_timeout="10secs"
I1012 18:09:45.064853 19475 credentials.hpp:86] Loading credential for authentication from
'/tmp/Endpoint_SlaveEndpointTest_UnauthorizedRequest_1_tIGzKD/credential'
I1012 18:09:45.065172 19475 slave.cpp:287] Agent using credential for: test-principal
I1012 18:09:45.065207 19475 credentials.hpp:37] Loading credentials for authentication from
'/tmp/Endpoint_SlaveEndpointTest_UnauthorizedRequest_1_tIGzKD/http_credentials'
I1012 18:09:45.065681 19475 http.cpp:1045] Creating default 'basic' HTTP authenticator for
realm 'mesos-agent-executor'
I1012 18:09:45.065863 19475 http.cpp:1066] Creating default 'jwt' HTTP authenticator for realm
'mesos-agent-executor'
I1012 18:09:45.066190 19475 http.cpp:1045] Creating default 'basic' HTTP authenticator for
realm 'mesos-agent-readonly'
I1012 18:09:45.066334 19475 http.cpp:1066] Creating default 'jwt' HTTP authenticator for realm
'mesos-agent-readonly'
I1012 18:09:45.066604 19475 http.cpp:1045] Creating default 'basic' HTTP authenticator for
realm 'mesos-agent-readwrite'
I1012 18:09:45.066747 19475 http.cpp:1066] Creating default 'jwt' HTTP authenticator for realm
'mesos-agent-readwrite'
I1012 18:09:45.069411 19475 slave.cpp:585] Agent resources: [{"name":"cpus","scalar":{"value":2.0},"type":"SCALAR"},{"name":"mem","scalar":{"value":1024.0},"type":"SCALAR"},{"name":"disk","scalar":{"value":1024.0},"type":"SCALAR"},{"name":"ports","ranges":{"range":[{"begin":31000,"end":32000}]},"type":"RANGES"}]
I1012 18:09:45.069829 19475 slave.cpp:593] Agent attributes: [  ]
I1012 18:09:45.069855 19475 slave.cpp:602] Agent hostname: e588e2f637bc
I1012 18:09:45.070032 19474 status_update_manager.cpp:177] Pausing sending status updates
I1012 18:09:45.072538 19479 state.cpp:64] Recovering state from '/tmp/Endpoint_SlaveEndpointTest_UnauthorizedRequest_1_gKyU5s/meta'
I1012 18:09:45.072878 19497 status_update_manager.cpp:203] Recovering status update manager
I1012 18:09:45.073113 19488 containerizer.cpp:648] Recovering containerizer
I1012 18:09:45.074455 19474 provisioner.cpp:416] Provisioner recovery complete
I1012 18:09:45.074856 19478 slave.cpp:6310] Finished recovery
I1012 18:09:45.075433 19478 slave.cpp:6492] Querying resource estimator for oversubscribable
resources
I1012 18:09:45.075713 19481 slave.cpp:6506] Received oversubscribable resources {} from the
resource estimator
I1012 18:09:45.078568 19490 process.cpp:3929] Handling HTTP event for process 'slave(826)'
with path: '/slave(826)/monitor/statistics.json'
I1012 18:09:45.080503 19491 http.cpp:1185] HTTP GET for /slave(826)/monitor/statistics.json
from 172.17.0.4:43692
I1012 18:09:45.080585 19491 http.cpp:976] Authorizing principal 'test-principal' to GET the
'/monitor/statistics.json' endpoint
I1012 18:09:45.082463 19487 slave.cpp:869] Agent terminating
[       OK ] Endpoint/SlaveEndpointTest.UnauthorizedRequest/1 (34 ms)
[ RUN      ] Endpoint/SlaveEndpointTest.UnauthorizedRequest/2
I1012 18:09:45.094069  9515 containerizer.cpp:292] Using isolation { environment_secret, posix/cpu,
posix/mem, filesystem/posix, network/cni }
W1012 18:09:45.094626  9515 backend.cpp:76] Failed to create 'aufs' backend: AufsBackend requires
root privileges
W1012 18:09:45.094746  9515 backend.cpp:76] Failed to create 'bind' backend: BindBackend requires
root privileges
I1012 18:09:45.094789  9515 provisioner.cpp:255] Using default backend 'copy'
I1012 18:09:45.099073 19493 slave.cpp:254] Mesos agent started on (827)@172.17.0.4:36774
I1012 18:09:45.099105 19493 slave.cpp:255] Flags at startup: --acls="" --appc_simple_discovery_uri_prefix="http://"
--appc_store_dir="/tmp/Endpoint_SlaveEndpointTest_UnauthorizedRequest_2_LSj2Ek/store/appc"
--authenticate_http_executors="true" --authenticate_http_readonly="true" --authenticate_http_readwrite="true"
--authenticatee="crammd5" --authentication_backoff_factor="1secs" --authorizer="local" --cgroups_cpu_enable_pids_and_tids_count="false"
--cgroups_enable_cfs="false" --cgroups_hierarchy="/sys/fs/cgroup" --cgroups_limit_swap="false"
--cgroups_root="mesos" --container_disk_watch_interval="15secs" --containerizers="mesos" --credential="/tmp/Endpoint_SlaveEndpointTest_UnauthorizedRequest_2_LSj2Ek/credential"
--default_role="*" --disallow_sharing_agent_pid_namespace="false" --disk_watch_interval="1mins"
--docker="docker" --docker_kill_orphans="true" --docker_registry="https://registry-1.docker.io"
--docker_remove_delay="6hrs" --docker_socket="/var/run/docker.sock" --docker_stop_timeout="0ns"
--docker_store_dir="/tmp/Endpoint_SlaveEndpointTest_UnauthorizedRequest_2_LSj2Ek/store/docker"
--docker_volume_checkpoint_dir="/var/run/mesos/isolators/docker/volume" --enforce_container_disk_quota="false"
--executor_registration_timeout="1mins" --executor_reregistration_timeout="2secs" --executor_secret_key="/tmp/Endpoint_SlaveEndpointTest_UnauthorizedRequest_2_LSj2Ek/executor_secret_key"
--executor_shutdown_grace_period="5secs" --fetcher_cache_dir="/tmp/Endpoint_SlaveEndpointTest_UnauthorizedRequest_2_LSj2Ek/fetch"
--fetcher_cache_size="2GB" --frameworks_home="" --gc_delay="1weeks" --gc_disk_headroom="0.1"
--hadoop_home="" --help="false" --hostname_lookup="true" --http_command_executor="false" --http_credentials="/tmp/Endpoint_SlaveEndpointTest_UnauthorizedRequest_2_LSj2Ek/http_credentials"
--http_heartbeat_interval="30secs" --initialize_driver_logging="true" --isolation="posix/cpu,posix/mem"
--launcher="posix" --launcher_dir="/mesos/mesos-1.5.0/_build/src" --logbufsecs="0" --logging_level="INFO"
--max_completed_executors_per_framework="150" --oversubscribed_resources_interval="15secs"
--perf_duration="10secs" --perf_interval="1mins" --port="5051" --qos_correction_interval_min="0ns"
--quiet="false" --recover="reconnect" --recovery_timeout="15mins" --registration_backoff_factor="10ms"
--resources="cpus:2;gpus:0;mem:1024;disk:1024;ports:[31000-32000]" --revocable_cpu_low_priority="true"
--runtime_dir="/tmp/Endpoint_SlaveEndpointTest_UnauthorizedRequest_2_LSj2Ek" --sandbox_directory="/mnt/mesos/sandbox"
--strict="true" --switch_user="true" --systemd_enable_support="true" --systemd_runtime_directory="/run/systemd/system"
--version="false" --work_dir="/tmp/Endpoint_SlaveEndpointTest_UnauthorizedRequest_2_C8meV9"
--zk_session_timeout="10secs"
I1012 18:09:45.099614 19493 credentials.hpp:86] Loading credential for authentication from
'/tmp/Endpoint_SlaveEndpointTest_UnauthorizedRequest_2_LSj2Ek/credential'
I1012 18:09:45.099849 19493 slave.cpp:287] Agent using credential for: test-principal
I1012 18:09:45.099871 19493 credentials.hpp:37] Loading credentials for authentication from
'/tmp/Endpoint_SlaveEndpointTest_UnauthorizedRequest_2_LSj2Ek/http_credentials'
I1012 18:09:45.100198 19493 http.cpp:1045] Creating default 'basic' HTTP authenticator for
realm 'mesos-agent-executor'
I1012 18:09:45.100363 19493 http.cpp:1066] Creating default 'jwt' HTTP authenticator for realm
'mesos-agent-executor'
I1012 18:09:45.100610 19493 http.cpp:1045] Creating default 'basic' HTTP authenticator for
realm 'mesos-agent-readonly'
I1012 18:09:45.100719 19493 http.cpp:1066] Creating default 'jwt' HTTP authenticator for realm
'mesos-agent-readonly'
I1012 18:09:45.100913 19493 http.cpp:1045] Creating default 'basic' HTTP authenticator for
realm 'mesos-agent-readwrite'
I1012 18:09:45.101016 19493 http.cpp:1066] Creating default 'jwt' HTTP authenticator for realm
'mesos-agent-readwrite'
I1012 18:09:45.102632 19493 slave.cpp:585] Agent resources: [{"name":"cpus","scalar":{"value":2.0},"type":"SCALAR"},{"name":"mem","scalar":{"value":1024.0},"type":"SCALAR"},{"name":"disk","scalar":{"value":1024.0},"type":"SCALAR"},{"name":"ports","ranges":{"range":[{"begin":31000,"end":32000}]},"type":"RANGES"}]
I1012 18:09:45.102886 19493 slave.cpp:593] Agent attributes: [  ]
I1012 18:09:45.102901 19493 slave.cpp:602] Agent hostname: e588e2f637bc
I1012 18:09:45.103062 19492 status_update_manager.cpp:177] Pausing sending status updates
I1012 18:09:45.104869 19488 state.cpp:64] Recovering state from '/tmp/Endpoint_SlaveEndpointTest_UnauthorizedRequest_2_C8meV9/meta'
I1012 18:09:45.105206 19474 status_update_manager.cpp:203] Recovering status update manager
I1012 18:09:45.105442 19485 containerizer.cpp:648] Recovering containerizer
I1012 18:09:45.106909 19480 provisioner.cpp:416] Provisioner recovery complete
I1012 18:09:45.107333 19484 slave.cpp:6310] Finished recovery
I1012 18:09:45.107931 19484 slave.cpp:6492] Querying resource estimator for oversubscribable
resources
I1012 18:09:45.108253 19491 slave.cpp:6506] Received oversubscribable resources {} from the
resource estimator
I1012 18:09:45.111249 19479 process.cpp:3929] Handling HTTP event for process 'slave(827)'
with path: '/slave(827)/containers'
I1012 18:09:45.113152 19490 http.cpp:1185] HTTP GET for /slave(827)/containers from 172.17.0.4:43694
I1012 18:09:45.113245 19490 http.cpp:976] Authorizing principal 'test-principal' to GET the
'/containers' endpoint
I1012 18:09:45.114920 19478 slave.cpp:869] Agent terminating
[       OK ] Endpoint/SlaveEndpointTest.UnauthorizedRequest/2 (32 ms)
[ RUN      ] Endpoint/SlaveEndpointTest.NoAuthorizer/0
I1012 18:09:45.127182  9515 containerizer.cpp:292] Using isolation { environment_secret, posix/cpu,
posix/mem, filesystem/posix, network/cni }
W1012 18:09:45.127744  9515 backend.cpp:76] Failed to create 'aufs' backend: AufsBackend requires
root privileges
W1012 18:09:45.127882  9515 backend.cpp:76] Failed to create 'bind' backend: BindBackend requires
root privileges
I1012 18:09:45.127925  9515 provisioner.cpp:255] Using default backend 'copy'
I1012 18:09:45.129741  9515 cluster.cpp:448] Creating default 'local' authorizer
I1012 18:09:45.131896 19480 slave.cpp:254] Mesos agent started on (828)@172.17.0.4:36774
I1012 18:09:45.131922 19480 slave.cpp:255] Flags at startup: --acls="" --appc_simple_discovery_uri_prefix="http://"
--appc_store_dir="/tmp/Endpoint_SlaveEndpointTest_NoAuthorizer_0_RJDWS1/store/appc" --authenticate_http_executors="true"
--authenticate_http_readonly="true" --authenticate_http_readwrite="true" --authenticatee="crammd5"
--authentication_backoff_factor="1secs" --authorizer="local" --cgroups_cpu_enable_pids_and_tids_count="false"
--cgroups_enable_cfs="false" --cgroups_hierarchy="/sys/fs/cgroup" --cgroups_limit_swap="false"
--cgroups_root="mesos" --container_disk_watch_interval="15secs" --containerizers="mesos" --credential="/tmp/Endpoint_SlaveEndpointTest_NoAuthorizer_0_RJDWS1/credential"
--default_role="*" --disallow_sharing_agent_pid_namespace="false" --disk_watch_interval="1mins"
--docker="docker" --docker_kill_orphans="true" --docker_registry="https://registry-1.docker.io"
--docker_remove_delay="6hrs" --docker_socket="/var/run/docker.sock" --docker_stop_timeout="0ns"
--docker_store_dir="/tmp/Endpoint_SlaveEndpointTest_NoAuthorizer_0_RJDWS1/store/docker" --docker_volume_checkpoint_dir="/var/run/mesos/isolators/docker/volume"
--enforce_container_disk_quota="false" --executor_registration_timeout="1mins" --executor_reregistration_timeout="2secs"
--executor_secret_key="/tmp/Endpoint_SlaveEndpointTest_NoAuthorizer_0_RJDWS1/executor_secret_key"
--executor_shutdown_grace_period="5secs" --fetcher_cache_dir="/tmp/Endpoint_SlaveEndpointTest_NoAuthorizer_0_RJDWS1/fetch"
--fetcher_cache_size="2GB" --frameworks_home="" --gc_delay="1weeks" --gc_disk_headroom="0.1"
--hadoop_home="" --help="false" --hostname_lookup="true" --http_command_executor="false" --http_credentials="/tmp/Endpoint_SlaveEndpointTest_NoAuthorizer_0_RJDWS1/http_credentials"
--http_heartbeat_interval="30secs" --initialize_driver_logging="true" --isolation="posix/cpu,posix/mem"
--launcher="posix" --launcher_dir="/mesos/mesos-1.5.0/_build/src" --logbufsecs="0" --logging_level="INFO"
--max_completed_executors_per_framework="150" --oversubscribed_resources_interval="15secs"
--perf_duration="10secs" --perf_interval="1mins" --port="5051" --qos_correction_interval_min="0ns"
--quiet="false" --recover="reconnect" --recovery_timeout="15mins" --registration_backoff_factor="10ms"
--resources="cpus:2;gpus:0;mem:1024;disk:1024;ports:[31000-32000]" --revocable_cpu_low_priority="true"
--runtime_dir="/tmp/Endpoint_SlaveEndpointTest_NoAuthorizer_0_RJDWS1" --sandbox_directory="/mnt/mesos/sandbox"
--strict="true" --switch_user="true" --systemd_enable_support="true" --systemd_runtime_directory="/run/systemd/system"
--version="false" --work_dir="/tmp/Endpoint_SlaveEndpointTest_NoAuthorizer_0_e1Ng4Q" --zk_session_timeout="10secs"
I1012 18:09:45.132424 19480 credentials.hpp:86] Loading credential for authentication from
'/tmp/Endpoint_SlaveEndpointTest_NoAuthorizer_0_RJDWS1/credential'
I1012 18:09:45.132637 19480 slave.cpp:287] Agent using credential for: test-principal
I1012 18:09:45.132660 19480 credentials.hpp:37] Loading credentials for authentication from
'/tmp/Endpoint_SlaveEndpointTest_NoAuthorizer_0_RJDWS1/http_credentials'
I1012 18:09:45.132989 19480 http.cpp:1045] Creating default 'basic' HTTP authenticator for
realm 'mesos-agent-executor'
I1012 18:09:45.133154 19480 http.cpp:1066] Creating default 'jwt' HTTP authenticator for realm
'mesos-agent-executor'
I1012 18:09:45.133404 19480 http.cpp:1045] Creating default 'basic' HTTP authenticator for
realm 'mesos-agent-readonly'
I1012 18:09:45.133507 19480 http.cpp:1066] Creating default 'jwt' HTTP authenticator for realm
'mesos-agent-readonly'
I1012 18:09:45.133694 19480 http.cpp:1045] Creating default 'basic' HTTP authenticator for
realm 'mesos-agent-readwrite'
I1012 18:09:45.133797 19480 http.cpp:1066] Creating default 'jwt' HTTP authenticator for realm
'mesos-agent-readwrite'
I1012 18:09:45.135386 19480 slave.cpp:585] Agent resources: [{"name":"cpus","scalar":{"value":2.0},"type":"SCALAR"},{"name":"mem","scalar":{"value":1024.0},"type":"SCALAR"},{"name":"disk","scalar":{"value":1024.0},"type":"SCALAR"},{"name":"ports","ranges":{"range":[{"begin":31000,"end":32000}]},"type":"RANGES"}]
I1012 18:09:45.135639 19480 slave.cpp:593] Agent attributes: [  ]
I1012 18:09:45.135654 19480 slave.cpp:602] Agent hostname: e588e2f637bc
I1012 18:09:45.135807 19479 status_update_manager.cpp:177] Pausing sending status updates
I1012 18:09:45.137748 19490 state.cpp:64] Recovering state from '/tmp/Endpoint_SlaveEndpointTest_NoAuthorizer_0_e1Ng4Q/meta'
I1012 18:09:45.138131 19494 status_update_manager.cpp:203] Recovering status update manager
I1012 18:09:45.138366 19495 containerizer.cpp:648] Recovering containerizer
I1012 18:09:45.139962 19481 provisioner.cpp:416] Provisioner recovery complete
I1012 18:09:45.140355 19496 slave.cpp:6310] Finished recovery
I1012 18:09:45.140985 19496 slave.cpp:6492] Querying resource estimator for oversubscribable
resources
I1012 18:09:45.141340 19496 slave.cpp:6506] Received oversubscribable resources {} from the
resource estimator
I1012 18:09:45.144433 19489 process.cpp:3929] Handling HTTP event for process 'slave(828)'
with path: '/slave(828)/monitor/statistics'
I1012 18:09:45.146989 19486 http.cpp:1185] HTTP GET for /slave(828)/monitor/statistics from
172.17.0.4:43696
I1012 18:09:45.147090 19486 http.cpp:976] Authorizing principal 'test-principal' to GET the
'/monitor/statistics' endpoint
I1012 18:09:45.150748 19497 slave.cpp:869] Agent terminating
[       OK ] Endpoint/SlaveEndpointTest.NoAuthorizer/0 (39 ms)
[ RUN      ] Endpoint/SlaveEndpointTest.NoAuthorizer/1
I1012 18:09:45.167515  9515 containerizer.cpp:292] Using isolation { environment_secret, posix/cpu,
posix/mem, filesystem/posix, network/cni }
W1012 18:09:45.168082  9515 backend.cpp:76] Failed to create 'aufs' backend: AufsBackend requires
root privileges
W1012 18:09:45.168207  9515 backend.cpp:76] Failed to create 'bind' backend: BindBackend requires
root privileges
I1012 18:09:45.168246  9515 provisioner.cpp:255] Using default backend 'copy'
I1012 18:09:45.170096  9515 cluster.cpp:448] Creating default 'local' authorizer
I1012 18:09:45.172165 19487 slave.cpp:254] Mesos agent started on (829)@172.17.0.4:36774
I1012 18:09:45.172193 19487 slave.cpp:255] Flags at startup: --acls="" --appc_simple_discovery_uri_prefix="http://"
--appc_store_dir="/tmp/Endpoint_SlaveEndpointTest_NoAuthorizer_1_5qpDtJ/store/appc" --authenticate_http_executors="true"
--authenticate_http_readonly="true" --authenticate_http_readwrite="true" --authenticatee="crammd5"
--authentication_backoff_factor="1secs" --authorizer="local" --cgroups_cpu_enable_pids_and_tids_count="false"
--cgroups_enable_cfs="false" --cgroups_hierarchy="/sys/fs/cgroup" --cgroups_limit_swap="false"
--cgroups_root="mesos" --container_disk_watch_interval="15secs" --containerizers="mesos" --credential="/tmp/Endpoint_SlaveEndpointTest_NoAuthorizer_1_5qpDtJ/credential"
--default_role="*" --disallow_sharing_agent_pid_namespace="false" --disk_watch_interval="1mins"
--docker="docker" --docker_kill_orphans="true" --docker_registry="https://registry-1.docker.io"
--docker_remove_delay="6hrs" --docker_socket="/var/run/docker.sock" --docker_stop_timeout="0ns"
--docker_store_dir="/tmp/Endpoint_SlaveEndpointTest_NoAuthorizer_1_5qpDtJ/store/docker" --docker_volume_checkpoint_dir="/var/run/mesos/isolators/docker/volume"
--enforce_container_disk_quota="false" --executor_registration_timeout="1mins" --executor_reregistration_timeout="2secs"
--executor_secret_key="/tmp/Endpoint_SlaveEndpointTest_NoAuthorizer_1_5qpDtJ/executor_secret_key"
--executor_shutdown_grace_period="5secs" --fetcher_cache_dir="/tmp/Endpoint_SlaveEndpointTest_NoAuthorizer_1_5qpDtJ/fetch"
--fetcher_cache_size="2GB" --frameworks_home="" --gc_delay="1weeks" --gc_disk_headroom="0.1"
--hadoop_home="" --help="false" --hostname_lookup="true" --http_command_executor="false" --http_credentials="/tmp/Endpoint_SlaveEndpointTest_NoAuthorizer_1_5qpDtJ/http_credentials"
--http_heartbeat_interval="30secs" --initialize_driver_logging="true" --isolation="posix/cpu,posix/mem"
--launcher="posix" --launcher_dir="/mesos/mesos-1.5.0/_build/src" --logbufsecs="0" --logging_level="INFO"
--max_completed_executors_per_framework="150" --oversubscribed_resources_interval="15secs"
--perf_duration="10secs" --perf_interval="1mins" --port="5051" --qos_correction_interval_min="0ns"
--quiet="false" --recover="reconnect" --recovery_timeout="15mins" --registration_backoff_factor="10ms"
--resources="cpus:2;gpus:0;mem:1024;disk:1024;ports:[31000-32000]" --revocable_cpu_low_priority="true"
--runtime_dir="/tmp/Endpoint_SlaveEndpointTest_NoAuthorizer_1_5qpDtJ" --sandbox_directory="/mnt/mesos/sandbox"
--strict="true" --switch_user="true" --systemd_enable_support="true" --systemd_runtime_directory="/run/systemd/system"
--version="false" --work_dir="/tmp/Endpoint_SlaveEndpointTest_NoAuthorizer_1_iph0yy" --zk_session_timeout="10secs"
I1012 18:09:45.172694 19487 credentials.hpp:86] Loading credential for authentication from
'/tmp/Endpoint_SlaveEndpointTest_NoAuthorizer_1_5qpDtJ/credential'
I1012 18:09:45.172947 19487 slave.cpp:287] Agent using credential for: test-principal
I1012 18:09:45.172971 19487 credentials.hpp:37] Loading credentials for authentication from
'/tmp/Endpoint_SlaveEndpointTest_NoAuthorizer_1_5qpDtJ/http_credentials'
I1012 18:09:45.173341 19487 http.cpp:1045] Creating default 'basic' HTTP authenticator for
realm 'mesos-agent-executor'
I1012 18:09:45.173506 19487 http.cpp:1066] Creating default 'jwt' HTTP authenticator for realm
'mesos-agent-executor'
I1012 18:09:45.173763 19487 http.cpp:1045] Creating default 'basic' HTTP authenticator for
realm 'mesos-agent-readonly'
I1012 18:09:45.173873 19487 http.cpp:1066] Creating default 'jwt' HTTP authenticator for realm
'mesos-agent-readonly'
I1012 18:09:45.174118 19487 http.cpp:1045] Creating default 'basic' HTTP authenticator for
realm 'mesos-agent-readwrite'
I1012 18:09:45.174227 19487 http.cpp:1066] Creating default 'jwt' HTTP authenticator for realm
'mesos-agent-readwrite'
I1012 18:09:45.175856 19487 slave.cpp:585] Agent resources: [{"name":"cpus","scalar":{"value":2.0},"type":"SCALAR"},{"name":"mem","scalar":{"value":1024.0},"type":"SCALAR"},{"name":"disk","scalar":{"value":1024.0},"type":"SCALAR"},{"name":"ports","ranges":{"range":[{"begin":31000,"end":32000}]},"type":"RANGES"}]
I1012 18:09:45.176112 19487 slave.cpp:593] Agent attributes: [  ]
I1012 18:09:45.176131 19487 slave.cpp:602] Agent hostname: e588e2f637bc
I1012 18:09:45.176318 19489 status_update_manager.cpp:177] Pausing sending status updates
I1012 18:09:45.178162 19497 state.cpp:64] Recovering state from '/tmp/Endpoint_SlaveEndpointTest_NoAuthorizer_1_iph0yy/meta'
I1012 18:09:45.178537 19479 status_update_manager.cpp:203] Recovering status update manager
I1012 18:09:45.178784 19481 containerizer.cpp:648] Recovering containerizer
I1012 18:09:45.180274 19484 provisioner.cpp:416] Provisioner recovery complete
I1012 18:09:45.180613 19489 slave.cpp:6310] Finished recovery
I1012 18:09:45.181183 19489 slave.cpp:6492] Querying resource estimator for oversubscribable
resources
I1012 18:09:45.181445 19478 slave.cpp:6506] Received oversubscribable resources {} from the
resource estimator
I1012 18:09:45.184239 19493 process.cpp:3929] Handling HTTP event for process 'slave(829)'
with path: '/slave(829)/monitor/statistics.json'
I1012 18:09:45.186231 19484 http.cpp:1185] HTTP GET for /slave(829)/monitor/statistics.json
from 172.17.0.4:43698
I1012 18:09:45.186313 19484 http.cpp:976] Authorizing principal 'test-principal' to GET the
'/monitor/statistics.json' endpoint
I1012 18:09:45.189294  9515 slave.cpp:869] Agent terminating
[       OK ] Endpoint/SlaveEndpointTest.NoAuthorizer/1 (34 ms)
[ RUN      ] Endpoint/SlaveEndpointTest.NoAuthorizer/2
I1012 18:09:45.202296  9515 containerizer.cpp:292] Using isolation { environment_secret, posix/cpu,
posix/mem, filesystem/posix, network/cni }
W1012 18:09:45.202893  9515 backend.cpp:76] Failed to create 'aufs' backend: AufsBackend requires
root privileges
W1012 18:09:45.203024  9515 backend.cpp:76] Failed to create 'bind' backend: BindBackend requires
root privileges
I1012 18:09:45.203070  9515 provisioner.cpp:255] Using default backend 'copy'
I1012 18:09:45.204893  9515 cluster.cpp:448] Creating default 'local' authorizer
I1012 18:09:45.207010 19481 slave.cpp:254] Mesos agent started on (830)@172.17.0.4:36774
I1012 18:09:45.207037 19481 slave.cpp:255] Flags at startup: --acls="" --appc_simple_discovery_uri_prefix="http://"
--appc_store_dir="/tmp/Endpoint_SlaveEndpointTest_NoAuthorizer_2_vJzYpr/store/appc" --authenticate_http_executors="true"
--authenticate_http_readonly="true" --authenticate_http_readwrite="true" --authenticatee="crammd5"
--authentication_backoff_factor="1secs" --authorizer="local" --cgroups_cpu_enable_pids_and_tids_count="false"
--cgroups_enable_cfs="false" --cgroups_hierarchy="/sys/fs/cgroup" --cgroups_limit_swap="false"
--cgroups_root="mesos" --container_disk_watch_interval="15secs" --containerizers="mesos" --credential="/tmp/Endpoint_SlaveEndpointTest_NoAuthorizer_2_vJzYpr/credential"
--default_role="*" --disallow_sharing_agent_pid_namespace="false" --disk_watch_interval="1mins"
--docker="docker" --docker_kill_orphans="true" --docker_registry="https://registry-1.docker.io"
--docker_remove_delay="6hrs" --docker_socket="/var/run/docker.sock" --docker_stop_timeout="0ns"
--docker_store_dir="/tmp/Endpoint_SlaveEndpointTest_NoAuthorizer_2_vJzYpr/store/docker" --docker_volume_checkpoint_dir="/var/run/mesos/isolators/docker/volume"
--enforce_container_disk_quota="false" --executor_registration_timeout="1mins" --executor_reregistration_timeout="2secs"
--executor_secret_key="/tmp/Endpoint_SlaveEndpointTest_NoAuthorizer_2_vJzYpr/executor_secret_key"
--executor_shutdown_grace_period="5secs" --fetcher_cache_dir="/tmp/Endpoint_SlaveEndpointTest_NoAuthorizer_2_vJzYpr/fetch"
--fetcher_cache_size="2GB" --frameworks_home="" --gc_delay="1weeks" --gc_disk_headroom="0.1"
--hadoop_home="" --help="false" --hostname_lookup="true" --http_command_executor="false" --http_credentials="/tmp/Endpoint_SlaveEndpointTest_NoAuthorizer_2_vJzYpr/http_credentials"
--http_heartbeat_interval="30secs" --initialize_driver_logging="true" --isolation="posix/cpu,posix/mem"
--launcher="posix" --launcher_dir="/mesos/mesos-1.5.0/_build/src" --logbufsecs="0" --logging_level="INFO"
--max_completed_executors_per_framework="150" --oversubscribed_resources_interval="15secs"
--perf_duration="10secs" --perf_interval="1mins" --port="5051" --qos_correction_interval_min="0ns"
--quiet="false" --recover="reconnect" --recovery_timeout="15mins" --registration_backoff_factor="10ms"
--resources="cpus:2;gpus:0;mem:1024;disk:1024;ports:[31000-32000]" --revocable_cpu_low_priority="true"
--runtime_dir="/tmp/Endpoint_SlaveEndpointTest_NoAuthorizer_2_vJzYpr" --sandbox_directory="/mnt/mesos/sandbox"
--strict="true" --switch_user="true" --systemd_enable_support="true" --systemd_runtime_directory="/run/systemd/system"
--version="false" --work_dir="/tmp/Endpoint_SlaveEndpointTest_NoAuthorizer_2_4GB7pg" --zk_session_timeout="10secs"
I1012 18:09:45.207506 19481 credentials.hpp:86] Loading credential for authentication from
'/tmp/Endpoint_SlaveEndpointTest_NoAuthorizer_2_vJzYpr/credential'
I1012 18:09:45.207705 19481 slave.cpp:287] Agent using credential for: test-principal
I1012 18:09:45.207726 19481 credentials.hpp:37] Loading credentials for authentication from
'/tmp/Endpoint_SlaveEndpointTest_NoAuthorizer_2_vJzYpr/http_credentials'
I1012 18:09:45.208073 19481 http.cpp:1045] Creating default 'basic' HTTP authenticator for
realm 'mesos-agent-executor'
I1012 18:09:45.208231 19481 http.cpp:1066] Creating default 'jwt' HTTP authenticator for realm
'mesos-agent-executor'
I1012 18:09:45.208488 19481 http.cpp:1045] Creating default 'basic' HTTP authenticator for
realm 'mesos-agent-readonly'
I1012 18:09:45.208596 19481 http.cpp:1066] Creating default 'jwt' HTTP authenticator for realm
'mesos-agent-readonly'
I1012 18:09:45.208814 19481 http.cpp:1045] Creating default 'basic' HTTP authenticator for
realm 'mesos-agent-readwrite'
I1012 18:09:45.208923 19481 http.cpp:1066] Creating default 'jwt' HTTP authenticator for realm
'mesos-agent-readwrite'
I1012 18:09:45.210542 19481 slave.cpp:585] Agent resources: [{"name":"cpus","scalar":{"value":2.0},"type":"SCALAR"},{"name":"mem","scalar":{"value":1024.0},"type":"SCALAR"},{"name":"disk","scalar":{"value":1024.0},"type":"SCALAR"},{"name":"ports","ranges":{"range":[{"begin":31000,"end":32000}]},"type":"RANGES"}]
I1012 18:09:45.210793 19481 slave.cpp:593] Agent attributes: [  ]
I1012 18:09:45.210809 19481 slave.cpp:602] Agent hostname: e588e2f637bc
I1012 18:09:45.210978 19493 status_update_manager.cpp:177] Pausing sending status updates
I1012 18:09:45.212779 19495 state.cpp:64] Recovering state from '/tmp/Endpoint_SlaveEndpointTest_NoAuthorizer_2_4GB7pg/meta'
I1012 18:09:45.213124 19494 status_update_manager.cpp:203] Recovering status update manager
I1012 18:09:45.213383 19480 containerizer.cpp:648] Recovering containerizer
I1012 18:09:45.214869 19490 provisioner.cpp:416] Provisioner recovery complete
I1012 18:09:45.215175 19493 slave.cpp:6310] Finished recovery
I1012 18:09:45.215770 19493 slave.cpp:6492] Querying resource estimator for oversubscribable
resources
I1012 18:09:45.216096 19493 slave.cpp:6506] Received oversubscribable resources {} from the
resource estimator
I1012 18:09:45.218865 19487 process.cpp:3929] Handling HTTP event for process 'slave(830)'
with path: '/slave(830)/containers'
I1012 18:09:45.221175 19485 http.cpp:1185] HTTP GET for /slave(830)/containers from 172.17.0.4:43700
I1012 18:09:45.221261 19485 http.cpp:976] Authorizing principal 'test-principal' to GET the
'/containers' endpoint
I1012 18:09:45.225248  9515 slave.cpp:869] Agent terminating
[       OK ] Endpoint/SlaveEndpointTest.NoAuthorizer/2 (36 ms)
[----------] 9 tests from Endpoint/SlaveEndpointTest (313 ms total)

[----------] 2 tests from ContainerizerType/DefaultContainerDNSFlagTest
[ RUN      ] ContainerizerType/DefaultContainerDNSFlagTest.ValidateFlag/0
[       OK ] ContainerizerType/DefaultContainerDNSFlagTest.ValidateFlag/0 (10 ms)
[ RUN      ] ContainerizerType/DefaultContainerDNSFlagTest.ValidateFlag/1
[       OK ] ContainerizerType/DefaultContainerDNSFlagTest.ValidateFlag/1 (10 ms)
[----------] 2 tests from ContainerizerType/DefaultContainerDNSFlagTest (20 ms total)

[----------] Global test environment tear-down
[==========] 1700 tests from 187 test cases ran. (592087 ms total)
[  PASSED  ] 1698 tests.
[  FAILED  ] 2 tests, listed below:
[  FAILED  ] ExecutorAuthorizationTest.RunTaskGroup
[  FAILED  ] SlaveTest.RestartSlaveRequireExecutorAuthentication

 2 FAILED TESTS
  YOU HAVE 21 DISABLED TESTS

I1012 18:09:45.320739 19498 process.cpp:1068] Failed to accept socket: future discarded
make[4]: *** [check-local] Error 1
make[4]: Leaving directory `/mesos/mesos-1.5.0/_build/src'
make[3]: *** [check-am] Error 2
make[3]: Leaving directory `/mesos/mesos-1.5.0/_build/src'
make[2]: *** [check] Error 2
make[2]: Leaving directory `/mesos/mesos-1.5.0/_build/src'
make[1]: *** [check-recursive] Error 1
make[1]: Leaving directory `/mesos/mesos-1.5.0/_build'
make: *** [distcheck] Error 1
+ docker rmi mesos-1507828999-25723
Untagged: mesos-1507828999-25723:latest
Deleted: sha256:ca77d012a68e7b6ff34a56624c799d2fc3d7988548a6c5a41d011c471c5cbe24
Deleted: sha256:02dcdae92afb6c7944bf9316533812627ec9a9b917fee0fa92f4f8bb119c04fa
Deleted: sha256:9260921023daf3fe20e42fadfe2ac0f600090a54872c18a5613043a6cc56cc1f
Deleted: sha256:a00c9b32889c9c7924ca9a0114fca2a0cd064da2ffab84085c48359d9882d8df
Deleted: sha256:150b66c68a2be1e51207db2462eb2b9b123fb40be1e0c8b3d89e50bbf22d8dce
Deleted: sha256:f4407a7b943f42672ec694b64db8172e77da75f0f73bf1812c9989fe7e0784d1
Deleted: sha256:6ff4a2d76770534df046e276e100564ade804ea261b501f05449b2f300d0e782
Deleted: sha256:0222f85cb99862b0703fe7af44778db918ae5e23d78f69a0780403a8d2ed1241
Deleted: sha256:b68ecd7cb06211431d4e58f9135610c6389f1fd977c681337b0de3ac0ece5e03
Deleted: sha256:20e0d909317efbf9779950290b8fef04d2be85aacd65657a37b761b1b6ffb33b
Deleted: sha256:809217328ae1ddc7de43694e8710b37b378e095de1eb04da76b0b2e7546fd8a3
Deleted: sha256:c6a1341555bb354131d3a716cab65e5ad37c774176af0ecd6d599fe0a7d96170
Deleted: sha256:c687707a4018cbcfb028e3e5851275a03eedcc775b2803c72a9fec76d638fbaf
Deleted: sha256:297e8859bdc9cb150c40bd86f6e2f279dab3671091f8148beb94dc0076ff9b58
Deleted: sha256:a3ef79e041a98da45387916f9fee9899c4375d2a255806dc4c1f7b45eae2cdf8
Deleted: sha256:d4de654ce53100d06a0c8efe97e9d449540192d34ff5eafdf12e66b195d9b0a3
Deleted: sha256:e1d46839356ce0a72a639d5dbff8c4cd307408f209f57b57398f1227ecbe8ddc
Deleted: sha256:eac8055c75060d3b1e5500a1b98c6146928801b9e38e8eb2b894397e813e7306
Deleted: sha256:34d914b8990ae555c614b3d06e3526db8103e75c290ef3134e969e22e0ad6c0a
Deleted: sha256:afab6be88a16527c0b892f67e8bf64a24dd8d6a9cfbda0d87e483958dc6bc8e6
Deleted: sha256:974f315d0a4b658db5aa0097f61d3278e41cd0e8f5d14bf5c35f57c689ad2452
Deleted: sha256:23ef9fd95db58d7386c802e6f782745f940bb4cd67ce3f5db5396fc35494f58e
Deleted: sha256:b12c57f2ab84b395552294686dbb3a89585359f99e02609b4e3263a56e5cb7e9
Deleted: sha256:ea14ef6538869908e574a5e226960a3180e9b237f7053e1d8fc47e0dd2c68f11
Deleted: sha256:5570e88cdda5dff005f82c6a87ec325b162aed641b4220160d83cde16e1ae86b
Deleted: sha256:5d511614d7ab37e48d443768487c30fcfd17f13e6bd6c83f4696d1bba00a7f17
Deleted: sha256:68d6c5dba147249e415ee338d079c1c48f9c8e50f34bc432227feaa4ad6443cd
Deleted: sha256:eb32c815532398a45eb7b36c1327c8e87c5b8477f370d1ebaec83081cd0fb128
Deleted: sha256:53b0c7e5cf2dc61fa7a2b489e584a753870fec20a9448b05a1e714ab84931a29
Build step 'Execute shell' marked build as failure


Mime
View raw message