mesos-builds mailing list archives

Site index · List index
Message view « Date » · « Thread »
Top « Date » · « Thread »
From Apache Jenkins Server <jenk...@builds.apache.org>
Subject Build failed in Jenkins: Mesos-Buildbot » autotools,gcc,--verbose --disable-libtool-wrappers,GLOG_v=1 MESOS_VERBOSE=1,centos:7,(ubuntu)&&(!ubuntu-us1)&&(!ubuntu-eu2)&&(!qnode3)&&(!H23) #4356
Date Mon, 23 Oct 2017 04:07:33 GMT
See <https://builds.apache.org/job/Mesos-Buildbot/BUILDTOOL=autotools,COMPILER=gcc,CONFIGURATION=--verbose%20--disable-libtool-wrappers,ENVIRONMENT=GLOG_v=1%20MESOS_VERBOSE=1,OS=centos%3A7,label_exp=(ubuntu)&&(!ubuntu-us1)&&(!ubuntu-eu2)&&(!qnode3)&&(!H23)/4356/display/redirect?page=changes>

Changes:

[mpark] Fixed missing `convertResourceFormat` cases in `master::updateSlave`.

[mpark] Added MESOS-8090 to the 1.4.1 CHANGELOG.

------------------------------------------
[...truncated 30.87 MB...]
I1023 04:07:20.969697  6165 http.cpp:1045] Creating default 'basic' HTTP authenticator for
realm 'mesos-agent-readwrite'
I1023 04:07:20.971845  6165 slave.cpp:565] Agent resources: [{"name":"cpus","scalar":{"value":2.0},"type":"SCALAR"},{"name":"mem","scalar":{"value":1024.0},"type":"SCALAR"},{"name":"disk","scalar":{"value":1024.0},"type":"SCALAR"},{"name":"ports","ranges":{"range":[{"begin":31000,"end":32000}]},"type":"RANGES"}]
I1023 04:07:20.972283  6165 slave.cpp:573] Agent attributes: [  ]
I1023 04:07:20.972303  6165 slave.cpp:582] Agent hostname: 3e040beb3d93
I1023 04:07:20.972625  6166 status_update_manager.cpp:177] Pausing sending status updates
I1023 04:07:20.974565  6170 state.cpp:64] Recovering state from '/tmp/Endpoint_SlaveEndpointTest_AuthorizedRequest_2_Grku7z/meta'
I1023 04:07:20.975090  6168 status_update_manager.cpp:203] Recovering status update manager
I1023 04:07:20.975468  6163 containerizer.cpp:609] Recovering containerizer
I1023 04:07:20.977614  6166 provisioner.cpp:416] Provisioner recovery complete
I1023 04:07:20.978277  6166 slave.cpp:6295] Finished recovery
I1023 04:07:20.978994  6166 slave.cpp:6477] Querying resource estimator for oversubscribable
resources
I1023 04:07:20.979498  6167 slave.cpp:6491] Received oversubscribable resources {} from the
resource estimator
I1023 04:07:20.983556  6163 process.cpp:3938] Handling HTTP event for process 'slave(796)'
with path: '/slave(796)/containers'
I1023 04:07:20.985563  6166 http.cpp:1185] HTTP GET for /slave(796)/containers from 172.17.0.3:58838
I1023 04:07:20.985682  6166 http.cpp:976] Authorizing principal 'test-principal' to GET the
'/containers' endpoint
I1023 04:07:20.991312  6144 slave.cpp:843] Agent terminating
[       OK ] Endpoint/SlaveEndpointTest.AuthorizedRequest/2 (48 ms)
[ RUN      ] Endpoint/SlaveEndpointTest.UnauthorizedRequest/0
I1023 04:07:21.008898  6144 containerizer.cpp:246] Using isolation: posix/cpu,posix/mem,filesystem/posix,network/cni,environment_secret
W1023 04:07:21.009711  6144 backend.cpp:76] Failed to create 'overlay' backend: OverlayBackend
requires root privileges
W1023 04:07:21.009927  6144 backend.cpp:76] Failed to create 'bind' backend: BindBackend requires
root privileges
I1023 04:07:21.009973  6144 provisioner.cpp:255] Using default backend 'copy'
I1023 04:07:21.015591  6165 slave.cpp:250] Mesos agent started on (797)@172.17.0.3:46089
I1023 04:07:21.015636  6165 slave.cpp:251] Flags at startup: --acls="" --appc_simple_discovery_uri_prefix="http://"
--appc_store_dir="/tmp/Endpoint_SlaveEndpointTest_UnauthorizedRequest_0_c26YnL/store/appc"
--authenticate_http_readonly="true" --authenticate_http_readwrite="true" --authenticatee="crammd5"
--authentication_backoff_factor="1secs" --authorizer="local" --cgroups_cpu_enable_pids_and_tids_count="false"
--cgroups_enable_cfs="false" --cgroups_hierarchy="/sys/fs/cgroup" --cgroups_limit_swap="false"
--cgroups_root="mesos" --container_disk_watch_interval="15secs" --containerizers="mesos" --credential="/tmp/Endpoint_SlaveEndpointTest_UnauthorizedRequest_0_c26YnL/credential"
--default_role="*" --disallow_sharing_agent_pid_namespace="false" --disk_watch_interval="1mins"
--docker="docker" --docker_kill_orphans="true" --docker_registry="https://registry-1.docker.io"
--docker_remove_delay="6hrs" --docker_socket="/var/run/docker.sock" --docker_stop_timeout="0ns"
--docker_store_dir="/tmp/Endpoint_SlaveEndpointTest_UnauthorizedRequest_0_c26YnL/store/docker"
--docker_volume_checkpoint_dir="/var/run/mesos/isolators/docker/volume" --enforce_container_disk_quota="false"
--executor_registration_timeout="1mins" --executor_reregistration_timeout="2secs" --executor_shutdown_grace_period="5secs"
--fetcher_cache_dir="/tmp/Endpoint_SlaveEndpointTest_UnauthorizedRequest_0_c26YnL/fetch" --fetcher_cache_size="2GB"
--frameworks_home="" --gc_delay="1weeks" --gc_disk_headroom="0.1" --hadoop_home="" --help="false"
--hostname_lookup="true" --http_command_executor="false" --http_credentials="/tmp/Endpoint_SlaveEndpointTest_UnauthorizedRequest_0_c26YnL/http_credentials"
--http_heartbeat_interval="30secs" --initialize_driver_logging="true" --isolation="posix/cpu,posix/mem"
--launcher="posix" --launcher_dir="/mesos/mesos-1.4.1/_build/src" --logbufsecs="0" --logging_level="INFO"
--max_completed_executors_per_framework="150" --oversubscribed_resources_interval="15secs"
--perf_duration="10secs" --perf_interval="1mins" --port="5051" --qos_correction_interval_min="0ns"
--quiet="false" --recover="reconnect" --recovery_timeout="15mins" --registration_backoff_factor="10ms"
--resources="cpus:2;gpus:0;mem:1024;disk:1024;ports:[31000-32000]" --revocable_cpu_low_priority="true"
--runtime_dir="/tmp/Endpoint_SlaveEndpointTest_UnauthorizedRequest_0_c26YnL" --sandbox_directory="/mnt/mesos/sandbox"
--strict="true" --switch_user="true" --systemd_enable_support="true" --systemd_runtime_directory="/run/systemd/system"
--version="false" --work_dir="/tmp/Endpoint_SlaveEndpointTest_UnauthorizedRequest_0_S5tZGw"
I1023 04:07:21.016510  6165 credentials.hpp:86] Loading credential for authentication from
'/tmp/Endpoint_SlaveEndpointTest_UnauthorizedRequest_0_c26YnL/credential'
I1023 04:07:21.017220  6165 slave.cpp:283] Agent using credential for: test-principal
I1023 04:07:21.017323  6165 credentials.hpp:37] Loading credentials for authentication from
'/tmp/Endpoint_SlaveEndpointTest_UnauthorizedRequest_0_c26YnL/http_credentials'
I1023 04:07:21.017896  6165 http.cpp:1045] Creating default 'basic' HTTP authenticator for
realm 'mesos-agent-readonly'
I1023 04:07:21.018438  6165 http.cpp:1045] Creating default 'basic' HTTP authenticator for
realm 'mesos-agent-readwrite'
I1023 04:07:21.020889  6165 slave.cpp:565] Agent resources: [{"name":"cpus","scalar":{"value":2.0},"type":"SCALAR"},{"name":"mem","scalar":{"value":1024.0},"type":"SCALAR"},{"name":"disk","scalar":{"value":1024.0},"type":"SCALAR"},{"name":"ports","ranges":{"range":[{"begin":31000,"end":32000}]},"type":"RANGES"}]
I1023 04:07:21.021461  6165 slave.cpp:573] Agent attributes: [  ]
I1023 04:07:21.021484  6165 slave.cpp:582] Agent hostname: 3e040beb3d93
I1023 04:07:21.021889  6169 status_update_manager.cpp:177] Pausing sending status updates
I1023 04:07:21.024111  6164 state.cpp:64] Recovering state from '/tmp/Endpoint_SlaveEndpointTest_UnauthorizedRequest_0_S5tZGw/meta'
I1023 04:07:21.024605  6168 status_update_manager.cpp:203] Recovering status update manager
I1023 04:07:21.024952  6163 containerizer.cpp:609] Recovering containerizer
I1023 04:07:21.027112  6164 provisioner.cpp:416] Provisioner recovery complete
I1023 04:07:21.027804  6164 slave.cpp:6295] Finished recovery
I1023 04:07:21.028492  6164 slave.cpp:6477] Querying resource estimator for oversubscribable
resources
I1023 04:07:21.028908  6163 slave.cpp:6491] Received oversubscribable resources {} from the
resource estimator
I1023 04:07:21.033486  6163 process.cpp:3938] Handling HTTP event for process 'slave(797)'
with path: '/slave(797)/monitor/statistics'
I1023 04:07:21.035667  6164 http.cpp:1185] HTTP GET for /slave(797)/monitor/statistics from
172.17.0.3:58840
I1023 04:07:21.035790  6164 http.cpp:976] Authorizing principal 'test-principal' to GET the
'/monitor/statistics' endpoint
I1023 04:07:21.038972  6163 slave.cpp:843] Agent terminating
[       OK ] Endpoint/SlaveEndpointTest.UnauthorizedRequest/0 (48 ms)
[ RUN      ] Endpoint/SlaveEndpointTest.UnauthorizedRequest/1
I1023 04:07:21.056980  6144 containerizer.cpp:246] Using isolation: posix/cpu,posix/mem,filesystem/posix,network/cni,environment_secret
W1023 04:07:21.057806  6144 backend.cpp:76] Failed to create 'overlay' backend: OverlayBackend
requires root privileges
W1023 04:07:21.058020  6144 backend.cpp:76] Failed to create 'bind' backend: BindBackend requires
root privileges
I1023 04:07:21.058068  6144 provisioner.cpp:255] Using default backend 'copy'
I1023 04:07:21.063697  6164 slave.cpp:250] Mesos agent started on (798)@172.17.0.3:46089
I1023 04:07:21.063741  6164 slave.cpp:251] Flags at startup: --acls="" --appc_simple_discovery_uri_prefix="http://"
--appc_store_dir="/tmp/Endpoint_SlaveEndpointTest_UnauthorizedRequest_1_gMRKAI/store/appc"
--authenticate_http_readonly="true" --authenticate_http_readwrite="true" --authenticatee="crammd5"
--authentication_backoff_factor="1secs" --authorizer="local" --cgroups_cpu_enable_pids_and_tids_count="false"
--cgroups_enable_cfs="false" --cgroups_hierarchy="/sys/fs/cgroup" --cgroups_limit_swap="false"
--cgroups_root="mesos" --container_disk_watch_interval="15secs" --containerizers="mesos" --credential="/tmp/Endpoint_SlaveEndpointTest_UnauthorizedRequest_1_gMRKAI/credential"
--default_role="*" --disallow_sharing_agent_pid_namespace="false" --disk_watch_interval="1mins"
--docker="docker" --docker_kill_orphans="true" --docker_registry="https://registry-1.docker.io"
--docker_remove_delay="6hrs" --docker_socket="/var/run/docker.sock" --docker_stop_timeout="0ns"
--docker_store_dir="/tmp/Endpoint_SlaveEndpointTest_UnauthorizedRequest_1_gMRKAI/store/docker"
--docker_volume_checkpoint_dir="/var/run/mesos/isolators/docker/volume" --enforce_container_disk_quota="false"
--executor_registration_timeout="1mins" --executor_reregistration_timeout="2secs" --executor_shutdown_grace_period="5secs"
--fetcher_cache_dir="/tmp/Endpoint_SlaveEndpointTest_UnauthorizedRequest_1_gMRKAI/fetch" --fetcher_cache_size="2GB"
--frameworks_home="" --gc_delay="1weeks" --gc_disk_headroom="0.1" --hadoop_home="" --help="false"
--hostname_lookup="true" --http_command_executor="false" --http_credentials="/tmp/Endpoint_SlaveEndpointTest_UnauthorizedRequest_1_gMRKAI/http_credentials"
--http_heartbeat_interval="30secs" --initialize_driver_logging="true" --isolation="posix/cpu,posix/mem"
--launcher="posix" --launcher_dir="/mesos/mesos-1.4.1/_build/src" --logbufsecs="0" --logging_level="INFO"
--max_completed_executors_per_framework="150" --oversubscribed_resources_interval="15secs"
--perf_duration="10secs" --perf_interval="1mins" --port="5051" --qos_correction_interval_min="0ns"
--quiet="false" --recover="reconnect" --recovery_timeout="15mins" --registration_backoff_factor="10ms"
--resources="cpus:2;gpus:0;mem:1024;disk:1024;ports:[31000-32000]" --revocable_cpu_low_priority="true"
--runtime_dir="/tmp/Endpoint_SlaveEndpointTest_UnauthorizedRequest_1_gMRKAI" --sandbox_directory="/mnt/mesos/sandbox"
--strict="true" --switch_user="true" --systemd_enable_support="true" --systemd_runtime_directory="/run/systemd/system"
--version="false" --work_dir="/tmp/Endpoint_SlaveEndpointTest_UnauthorizedRequest_1_0n7WLt"
I1023 04:07:21.064466  6164 credentials.hpp:86] Loading credential for authentication from
'/tmp/Endpoint_SlaveEndpointTest_UnauthorizedRequest_1_gMRKAI/credential'
I1023 04:07:21.064715  6164 slave.cpp:283] Agent using credential for: test-principal
I1023 04:07:21.064736  6164 credentials.hpp:37] Loading credentials for authentication from
'/tmp/Endpoint_SlaveEndpointTest_UnauthorizedRequest_1_gMRKAI/http_credentials'
I1023 04:07:21.065089  6164 http.cpp:1045] Creating default 'basic' HTTP authenticator for
realm 'mesos-agent-readonly'
I1023 04:07:21.065364  6164 http.cpp:1045] Creating default 'basic' HTTP authenticator for
realm 'mesos-agent-readwrite'
I1023 04:07:21.067577  6164 slave.cpp:565] Agent resources: [{"name":"cpus","scalar":{"value":2.0},"type":"SCALAR"},{"name":"mem","scalar":{"value":1024.0},"type":"SCALAR"},{"name":"disk","scalar":{"value":1024.0},"type":"SCALAR"},{"name":"ports","ranges":{"range":[{"begin":31000,"end":32000}]},"type":"RANGES"}]
I1023 04:07:21.068058  6164 slave.cpp:573] Agent attributes: [  ]
I1023 04:07:21.068081  6164 slave.cpp:582] Agent hostname: 3e040beb3d93
I1023 04:07:21.068317  6167 status_update_manager.cpp:177] Pausing sending status updates
I1023 04:07:21.070574  6164 state.cpp:64] Recovering state from '/tmp/Endpoint_SlaveEndpointTest_UnauthorizedRequest_1_0n7WLt/meta'
I1023 04:07:21.070997  6164 status_update_manager.cpp:203] Recovering status update manager
I1023 04:07:21.071246  6164 containerizer.cpp:609] Recovering containerizer
I1023 04:07:21.073356  6167 provisioner.cpp:416] Provisioner recovery complete
I1023 04:07:21.073926  6169 slave.cpp:6295] Finished recovery
I1023 04:07:21.074652  6169 slave.cpp:6477] Querying resource estimator for oversubscribable
resources
I1023 04:07:21.075230  6164 slave.cpp:6491] Received oversubscribable resources {} from the
resource estimator
I1023 04:07:21.079227  6165 process.cpp:3938] Handling HTTP event for process 'slave(798)'
with path: '/slave(798)/monitor/statistics.json'
I1023 04:07:21.081369  6170 http.cpp:1185] HTTP GET for /slave(798)/monitor/statistics.json
from 172.17.0.3:58842
I1023 04:07:21.081604  6170 http.cpp:976] Authorizing principal 'test-principal' to GET the
'/monitor/statistics.json' endpoint
I1023 04:07:21.085117  6165 slave.cpp:843] Agent terminating
[       OK ] Endpoint/SlaveEndpointTest.UnauthorizedRequest/1 (45 ms)
[ RUN      ] Endpoint/SlaveEndpointTest.UnauthorizedRequest/2
I1023 04:07:21.102771  6144 containerizer.cpp:246] Using isolation: posix/cpu,posix/mem,filesystem/posix,network/cni,environment_secret
W1023 04:07:21.103559  6144 backend.cpp:76] Failed to create 'overlay' backend: OverlayBackend
requires root privileges
W1023 04:07:21.103773  6144 backend.cpp:76] Failed to create 'bind' backend: BindBackend requires
root privileges
I1023 04:07:21.103822  6144 provisioner.cpp:255] Using default backend 'copy'
I1023 04:07:21.109539  6165 slave.cpp:250] Mesos agent started on (799)@172.17.0.3:46089
I1023 04:07:21.109580  6165 slave.cpp:251] Flags at startup: --acls="" --appc_simple_discovery_uri_prefix="http://"
--appc_store_dir="/tmp/Endpoint_SlaveEndpointTest_UnauthorizedRequest_2_8VwfhG/store/appc"
--authenticate_http_readonly="true" --authenticate_http_readwrite="true" --authenticatee="crammd5"
--authentication_backoff_factor="1secs" --authorizer="local" --cgroups_cpu_enable_pids_and_tids_count="false"
--cgroups_enable_cfs="false" --cgroups_hierarchy="/sys/fs/cgroup" --cgroups_limit_swap="false"
--cgroups_root="mesos" --container_disk_watch_interval="15secs" --containerizers="mesos" --credential="/tmp/Endpoint_SlaveEndpointTest_UnauthorizedRequest_2_8VwfhG/credential"
--default_role="*" --disallow_sharing_agent_pid_namespace="false" --disk_watch_interval="1mins"
--docker="docker" --docker_kill_orphans="true" --docker_registry="https://registry-1.docker.io"
--docker_remove_delay="6hrs" --docker_socket="/var/run/docker.sock" --docker_stop_timeout="0ns"
--docker_store_dir="/tmp/Endpoint_SlaveEndpointTest_UnauthorizedRequest_2_8VwfhG/store/docker"
--docker_volume_checkpoint_dir="/var/run/mesos/isolators/docker/volume" --enforce_container_disk_quota="false"
--executor_registration_timeout="1mins" --executor_reregistration_timeout="2secs" --executor_shutdown_grace_period="5secs"
--fetcher_cache_dir="/tmp/Endpoint_SlaveEndpointTest_UnauthorizedRequest_2_8VwfhG/fetch" --fetcher_cache_size="2GB"
--frameworks_home="" --gc_delay="1weeks" --gc_disk_headroom="0.1" --hadoop_home="" --help="false"
--hostname_lookup="true" --http_command_executor="false" --http_credentials="/tmp/Endpoint_SlaveEndpointTest_UnauthorizedRequest_2_8VwfhG/http_credentials"
--http_heartbeat_interval="30secs" --initialize_driver_logging="true" --isolation="posix/cpu,posix/mem"
--launcher="posix" --launcher_dir="/mesos/mesos-1.4.1/_build/src" --logbufsecs="0" --logging_level="INFO"
--max_completed_executors_per_framework="150" --oversubscribed_resources_interval="15secs"
--perf_duration="10secs" --perf_interval="1mins" --port="5051" --qos_correction_interval_min="0ns"
--quiet="false" --recover="reconnect" --recovery_timeout="15mins" --registration_backoff_factor="10ms"
--resources="cpus:2;gpus:0;mem:1024;disk:1024;ports:[31000-32000]" --revocable_cpu_low_priority="true"
--runtime_dir="/tmp/Endpoint_SlaveEndpointTest_UnauthorizedRequest_2_8VwfhG" --sandbox_directory="/mnt/mesos/sandbox"
--strict="true" --switch_user="true" --systemd_enable_support="true" --systemd_runtime_directory="/run/systemd/system"
--version="false" --work_dir="/tmp/Endpoint_SlaveEndpointTest_UnauthorizedRequest_2_sqZ1kr"
I1023 04:07:21.110354  6165 credentials.hpp:86] Loading credential for authentication from
'/tmp/Endpoint_SlaveEndpointTest_UnauthorizedRequest_2_8VwfhG/credential'
I1023 04:07:21.110621  6165 slave.cpp:283] Agent using credential for: test-principal
I1023 04:07:21.110646  6165 credentials.hpp:37] Loading credentials for authentication from
'/tmp/Endpoint_SlaveEndpointTest_UnauthorizedRequest_2_8VwfhG/http_credentials'
I1023 04:07:21.111016  6165 http.cpp:1045] Creating default 'basic' HTTP authenticator for
realm 'mesos-agent-readonly'
I1023 04:07:21.111307  6165 http.cpp:1045] Creating default 'basic' HTTP authenticator for
realm 'mesos-agent-readwrite'
I1023 04:07:21.113531  6165 slave.cpp:565] Agent resources: [{"name":"cpus","scalar":{"value":2.0},"type":"SCALAR"},{"name":"mem","scalar":{"value":1024.0},"type":"SCALAR"},{"name":"disk","scalar":{"value":1024.0},"type":"SCALAR"},{"name":"ports","ranges":{"range":[{"begin":31000,"end":32000}]},"type":"RANGES"}]
I1023 04:07:21.113973  6165 slave.cpp:573] Agent attributes: [  ]
I1023 04:07:21.113996  6165 slave.cpp:582] Agent hostname: 3e040beb3d93
I1023 04:07:21.114240  6164 status_update_manager.cpp:177] Pausing sending status updates
I1023 04:07:21.116286  6170 state.cpp:64] Recovering state from '/tmp/Endpoint_SlaveEndpointTest_UnauthorizedRequest_2_sqZ1kr/meta'
I1023 04:07:21.116871  6170 status_update_manager.cpp:203] Recovering status update manager
I1023 04:07:21.117332  6163 containerizer.cpp:609] Recovering containerizer
I1023 04:07:21.119472  6164 provisioner.cpp:416] Provisioner recovery complete
I1023 04:07:21.119958  6165 slave.cpp:6295] Finished recovery
I1023 04:07:21.120596  6165 slave.cpp:6477] Querying resource estimator for oversubscribable
resources
I1023 04:07:21.120996  6163 slave.cpp:6491] Received oversubscribable resources {} from the
resource estimator
I1023 04:07:21.125003  6165 process.cpp:3938] Handling HTTP event for process 'slave(799)'
with path: '/slave(799)/containers'
I1023 04:07:21.127109  6166 http.cpp:1185] HTTP GET for /slave(799)/containers from 172.17.0.3:58844
I1023 04:07:21.127238  6166 http.cpp:976] Authorizing principal 'test-principal' to GET the
'/containers' endpoint
I1023 04:07:21.130530  6144 slave.cpp:843] Agent terminating
[       OK ] Endpoint/SlaveEndpointTest.UnauthorizedRequest/2 (50 ms)
[ RUN      ] Endpoint/SlaveEndpointTest.NoAuthorizer/0
I1023 04:07:21.154026  6144 containerizer.cpp:246] Using isolation: posix/cpu,posix/mem,filesystem/posix,network/cni,environment_secret
W1023 04:07:21.154826  6144 backend.cpp:76] Failed to create 'overlay' backend: OverlayBackend
requires root privileges
W1023 04:07:21.155040  6144 backend.cpp:76] Failed to create 'bind' backend: BindBackend requires
root privileges
I1023 04:07:21.155087  6144 provisioner.cpp:255] Using default backend 'copy'
I1023 04:07:21.157764  6144 cluster.cpp:448] Creating default 'local' authorizer
I1023 04:07:21.160946  6168 slave.cpp:250] Mesos agent started on (800)@172.17.0.3:46089
I1023 04:07:21.160991  6168 slave.cpp:251] Flags at startup: --acls="" --appc_simple_discovery_uri_prefix="http://"
--appc_store_dir="/tmp/Endpoint_SlaveEndpointTest_NoAuthorizer_0_E6rStE/store/appc" --authenticate_http_readonly="true"
--authenticate_http_readwrite="true" --authenticatee="crammd5" --authentication_backoff_factor="1secs"
--authorizer="local" --cgroups_cpu_enable_pids_and_tids_count="false" --cgroups_enable_cfs="false"
--cgroups_hierarchy="/sys/fs/cgroup" --cgroups_limit_swap="false" --cgroups_root="mesos" --container_disk_watch_interval="15secs"
--containerizers="mesos" --credential="/tmp/Endpoint_SlaveEndpointTest_NoAuthorizer_0_E6rStE/credential"
--default_role="*" --disallow_sharing_agent_pid_namespace="false" --disk_watch_interval="1mins"
--docker="docker" --docker_kill_orphans="true" --docker_registry="https://registry-1.docker.io"
--docker_remove_delay="6hrs" --docker_socket="/var/run/docker.sock" --docker_stop_timeout="0ns"
--docker_store_dir="/tmp/Endpoint_SlaveEndpointTest_NoAuthorizer_0_E6rStE/store/docker" --docker_volume_checkpoint_dir="/var/run/mesos/isolators/docker/volume"
--enforce_container_disk_quota="false" --executor_registration_timeout="1mins" --executor_reregistration_timeout="2secs"
--executor_shutdown_grace_period="5secs" --fetcher_cache_dir="/tmp/Endpoint_SlaveEndpointTest_NoAuthorizer_0_E6rStE/fetch"
--fetcher_cache_size="2GB" --frameworks_home="" --gc_delay="1weeks" --gc_disk_headroom="0.1"
--hadoop_home="" --help="false" --hostname_lookup="true" --http_command_executor="false" --http_credentials="/tmp/Endpoint_SlaveEndpointTest_NoAuthorizer_0_E6rStE/http_credentials"
--http_heartbeat_interval="30secs" --initialize_driver_logging="true" --isolation="posix/cpu,posix/mem"
--launcher="posix" --launcher_dir="/mesos/mesos-1.4.1/_build/src" --logbufsecs="0" --logging_level="INFO"
--max_completed_executors_per_framework="150" --oversubscribed_resources_interval="15secs"
--perf_duration="10secs" --perf_interval="1mins" --port="5051" --qos_correction_interval_min="0ns"
--quiet="false" --recover="reconnect" --recovery_timeout="15mins" --registration_backoff_factor="10ms"
--resources="cpus:2;gpus:0;mem:1024;disk:1024;ports:[31000-32000]" --revocable_cpu_low_priority="true"
--runtime_dir="/tmp/Endpoint_SlaveEndpointTest_NoAuthorizer_0_E6rStE" --sandbox_directory="/mnt/mesos/sandbox"
--strict="true" --switch_user="true" --systemd_enable_support="true" --systemd_runtime_directory="/run/systemd/system"
--version="false" --work_dir="/tmp/Endpoint_SlaveEndpointTest_NoAuthorizer_0_y52qpp"
I1023 04:07:21.161792  6168 credentials.hpp:86] Loading credential for authentication from
'/tmp/Endpoint_SlaveEndpointTest_NoAuthorizer_0_E6rStE/credential'
I1023 04:07:21.162099  6168 slave.cpp:283] Agent using credential for: test-principal
I1023 04:07:21.162137  6168 credentials.hpp:37] Loading credentials for authentication from
'/tmp/Endpoint_SlaveEndpointTest_NoAuthorizer_0_E6rStE/http_credentials'
I1023 04:07:21.162570  6168 http.cpp:1045] Creating default 'basic' HTTP authenticator for
realm 'mesos-agent-readonly'
I1023 04:07:21.162870  6168 http.cpp:1045] Creating default 'basic' HTTP authenticator for
realm 'mesos-agent-readwrite'
I1023 04:07:21.165156  6168 slave.cpp:565] Agent resources: [{"name":"cpus","scalar":{"value":2.0},"type":"SCALAR"},{"name":"mem","scalar":{"value":1024.0},"type":"SCALAR"},{"name":"disk","scalar":{"value":1024.0},"type":"SCALAR"},{"name":"ports","ranges":{"range":[{"begin":31000,"end":32000}]},"type":"RANGES"}]
I1023 04:07:21.165598  6168 slave.cpp:573] Agent attributes: [  ]
I1023 04:07:21.165619  6168 slave.cpp:582] Agent hostname: 3e040beb3d93
I1023 04:07:21.165890  6165 status_update_manager.cpp:177] Pausing sending status updates
I1023 04:07:21.168334  6170 state.cpp:64] Recovering state from '/tmp/Endpoint_SlaveEndpointTest_NoAuthorizer_0_y52qpp/meta'
I1023 04:07:21.168999  6169 status_update_manager.cpp:203] Recovering status update manager
I1023 04:07:21.169338  6163 containerizer.cpp:609] Recovering containerizer
I1023 04:07:21.171332  6166 provisioner.cpp:416] Provisioner recovery complete
I1023 04:07:21.171807  6165 slave.cpp:6295] Finished recovery
I1023 04:07:21.172435  6165 slave.cpp:6477] Querying resource estimator for oversubscribable
resources
I1023 04:07:21.172809  6167 slave.cpp:6491] Received oversubscribable resources {} from the
resource estimator
I1023 04:07:21.176898  6165 process.cpp:3938] Handling HTTP event for process 'slave(800)'
with path: '/slave(800)/monitor/statistics'
I1023 04:07:21.179044  6168 http.cpp:1185] HTTP GET for /slave(800)/monitor/statistics from
172.17.0.3:58846
I1023 04:07:21.179168  6168 http.cpp:976] Authorizing principal 'test-principal' to GET the
'/monitor/statistics' endpoint
I1023 04:07:21.184067  6167 slave.cpp:843] Agent terminating
[       OK ] Endpoint/SlaveEndpointTest.NoAuthorizer/0 (47 ms)
[ RUN      ] Endpoint/SlaveEndpointTest.NoAuthorizer/1
I1023 04:07:21.202005  6144 containerizer.cpp:246] Using isolation: posix/cpu,posix/mem,filesystem/posix,network/cni,environment_secret
W1023 04:07:21.202836  6144 backend.cpp:76] Failed to create 'overlay' backend: OverlayBackend
requires root privileges
W1023 04:07:21.203060  6144 backend.cpp:76] Failed to create 'bind' backend: BindBackend requires
root privileges
I1023 04:07:21.203115  6144 provisioner.cpp:255] Using default backend 'copy'
I1023 04:07:21.205835  6144 cluster.cpp:448] Creating default 'local' authorizer
I1023 04:07:21.209086  6169 slave.cpp:250] Mesos agent started on (801)@172.17.0.3:46089
I1023 04:07:21.209131  6169 slave.cpp:251] Flags at startup: --acls="" --appc_simple_discovery_uri_prefix="http://"
--appc_store_dir="/tmp/Endpoint_SlaveEndpointTest_NoAuthorizer_1_GNDdcD/store/appc" --authenticate_http_readonly="true"
--authenticate_http_readwrite="true" --authenticatee="crammd5" --authentication_backoff_factor="1secs"
--authorizer="local" --cgroups_cpu_enable_pids_and_tids_count="false" --cgroups_enable_cfs="false"
--cgroups_hierarchy="/sys/fs/cgroup" --cgroups_limit_swap="false" --cgroups_root="mesos" --container_disk_watch_interval="15secs"
--containerizers="mesos" --credential="/tmp/Endpoint_SlaveEndpointTest_NoAuthorizer_1_GNDdcD/credential"
--default_role="*" --disallow_sharing_agent_pid_namespace="false" --disk_watch_interval="1mins"
--docker="docker" --docker_kill_orphans="true" --docker_registry="https://registry-1.docker.io"
--docker_remove_delay="6hrs" --docker_socket="/var/run/docker.sock" --docker_stop_timeout="0ns"
--docker_store_dir="/tmp/Endpoint_SlaveEndpointTest_NoAuthorizer_1_GNDdcD/store/docker" --docker_volume_checkpoint_dir="/var/run/mesos/isolators/docker/volume"
--enforce_container_disk_quota="false" --executor_registration_timeout="1mins" --executor_reregistration_timeout="2secs"
--executor_shutdown_grace_period="5secs" --fetcher_cache_dir="/tmp/Endpoint_SlaveEndpointTest_NoAuthorizer_1_GNDdcD/fetch"
--fetcher_cache_size="2GB" --frameworks_home="" --gc_delay="1weeks" --gc_disk_headroom="0.1"
--hadoop_home="" --help="false" --hostname_lookup="true" --http_command_executor="false" --http_credentials="/tmp/Endpoint_SlaveEndpointTest_NoAuthorizer_1_GNDdcD/http_credentials"
--http_heartbeat_interval="30secs" --initialize_driver_logging="true" --isolation="posix/cpu,posix/mem"
--launcher="posix" --launcher_dir="/mesos/mesos-1.4.1/_build/src" --logbufsecs="0" --logging_level="INFO"
--max_completed_executors_per_framework="150" --oversubscribed_resources_interval="15secs"
--perf_duration="10secs" --perf_interval="1mins" --port="5051" --qos_correction_interval_min="0ns"
--quiet="false" --recover="reconnect" --recovery_timeout="15mins" --registration_backoff_factor="10ms"
--resources="cpus:2;gpus:0;mem:1024;disk:1024;ports:[31000-32000]" --revocable_cpu_low_priority="true"
--runtime_dir="/tmp/Endpoint_SlaveEndpointTest_NoAuthorizer_1_GNDdcD" --sandbox_directory="/mnt/mesos/sandbox"
--strict="true" --switch_user="true" --systemd_enable_support="true" --systemd_runtime_directory="/run/systemd/system"
--version="false" --work_dir="/tmp/Endpoint_SlaveEndpointTest_NoAuthorizer_1_2or0Zn"
I1023 04:07:21.210001  6169 credentials.hpp:86] Loading credential for authentication from
'/tmp/Endpoint_SlaveEndpointTest_NoAuthorizer_1_GNDdcD/credential'
I1023 04:07:21.210438  6169 slave.cpp:283] Agent using credential for: test-principal
I1023 04:07:21.210467  6169 credentials.hpp:37] Loading credentials for authentication from
'/tmp/Endpoint_SlaveEndpointTest_NoAuthorizer_1_GNDdcD/http_credentials'
I1023 04:07:21.210959  6169 http.cpp:1045] Creating default 'basic' HTTP authenticator for
realm 'mesos-agent-readonly'
I1023 04:07:21.211375  6169 http.cpp:1045] Creating default 'basic' HTTP authenticator for
realm 'mesos-agent-readwrite'
I1023 04:07:21.213783  6169 slave.cpp:565] Agent resources: [{"name":"cpus","scalar":{"value":2.0},"type":"SCALAR"},{"name":"mem","scalar":{"value":1024.0},"type":"SCALAR"},{"name":"disk","scalar":{"value":1024.0},"type":"SCALAR"},{"name":"ports","ranges":{"range":[{"begin":31000,"end":32000}]},"type":"RANGES"}]
I1023 04:07:21.214227  6169 slave.cpp:573] Agent attributes: [  ]
I1023 04:07:21.214251  6169 slave.cpp:582] Agent hostname: 3e040beb3d93
I1023 04:07:21.214704  6163 status_update_manager.cpp:177] Pausing sending status updates
I1023 04:07:21.216971  6170 state.cpp:64] Recovering state from '/tmp/Endpoint_SlaveEndpointTest_NoAuthorizer_1_2or0Zn/meta'
I1023 04:07:21.217566  6164 status_update_manager.cpp:203] Recovering status update manager
I1023 04:07:21.217869  6163 containerizer.cpp:609] Recovering containerizer
I1023 04:07:21.219991  6170 provisioner.cpp:416] Provisioner recovery complete
I1023 04:07:21.220741  6168 slave.cpp:6295] Finished recovery
I1023 04:07:21.221395  6168 slave.cpp:6477] Querying resource estimator for oversubscribable
resources
I1023 04:07:21.222002  6163 slave.cpp:6491] Received oversubscribable resources {} from the
resource estimator
I1023 04:07:21.225996  6168 process.cpp:3938] Handling HTTP event for process 'slave(801)'
with path: '/slave(801)/monitor/statistics.json'
I1023 04:07:21.228080  6170 http.cpp:1185] HTTP GET for /slave(801)/monitor/statistics.json
from 172.17.0.3:58848
I1023 04:07:21.228544  6170 http.cpp:976] Authorizing principal 'test-principal' to GET the
'/monitor/statistics.json' endpoint
I1023 04:07:21.234177  6169 slave.cpp:843] Agent terminating
[       OK ] Endpoint/SlaveEndpointTest.NoAuthorizer/1 (50 ms)
[ RUN      ] Endpoint/SlaveEndpointTest.NoAuthorizer/2
I1023 04:07:21.252791  6144 containerizer.cpp:246] Using isolation: posix/cpu,posix/mem,filesystem/posix,network/cni,environment_secret
W1023 04:07:21.253614  6144 backend.cpp:76] Failed to create 'overlay' backend: OverlayBackend
requires root privileges
W1023 04:07:21.253842  6144 backend.cpp:76] Failed to create 'bind' backend: BindBackend requires
root privileges
I1023 04:07:21.253897  6144 provisioner.cpp:255] Using default backend 'copy'
I1023 04:07:21.256799  6144 cluster.cpp:448] Creating default 'local' authorizer
I1023 04:07:21.260112  6167 slave.cpp:250] Mesos agent started on (802)@172.17.0.3:46089
I1023 04:07:21.260157  6167 slave.cpp:251] Flags at startup: --acls="" --appc_simple_discovery_uri_prefix="http://"
--appc_store_dir="/tmp/Endpoint_SlaveEndpointTest_NoAuthorizer_2_WfK0qC/store/appc" --authenticate_http_readonly="true"
--authenticate_http_readwrite="true" --authenticatee="crammd5" --authentication_backoff_factor="1secs"
--authorizer="local" --cgroups_cpu_enable_pids_and_tids_count="false" --cgroups_enable_cfs="false"
--cgroups_hierarchy="/sys/fs/cgroup" --cgroups_limit_swap="false" --cgroups_root="mesos" --container_disk_watch_interval="15secs"
--containerizers="mesos" --credential="/tmp/Endpoint_SlaveEndpointTest_NoAuthorizer_2_WfK0qC/credential"
--default_role="*" --disallow_sharing_agent_pid_namespace="false" --disk_watch_interval="1mins"
--docker="docker" --docker_kill_orphans="true" --docker_registry="https://registry-1.docker.io"
--docker_remove_delay="6hrs" --docker_socket="/var/run/docker.sock" --docker_stop_timeout="0ns"
--docker_store_dir="/tmp/Endpoint_SlaveEndpointTest_NoAuthorizer_2_WfK0qC/store/docker" --docker_volume_checkpoint_dir="/var/run/mesos/isolators/docker/volume"
--enforce_container_disk_quota="false" --executor_registration_timeout="1mins" --executor_reregistration_timeout="2secs"
--executor_shutdown_grace_period="5secs" --fetcher_cache_dir="/tmp/Endpoint_SlaveEndpointTest_NoAuthorizer_2_WfK0qC/fetch"
--fetcher_cache_size="2GB" --frameworks_home="" --gc_delay="1weeks" --gc_disk_headroom="0.1"
--hadoop_home="" --help="false" --hostname_lookup="true" --http_command_executor="false" --http_credentials="/tmp/Endpoint_SlaveEndpointTest_NoAuthorizer_2_WfK0qC/http_credentials"
--http_heartbeat_interval="30secs" --initialize_driver_logging="true" --isolation="posix/cpu,posix/mem"
--launcher="posix" --launcher_dir="/mesos/mesos-1.4.1/_build/src" --logbufsecs="0" --logging_level="INFO"
--max_completed_executors_per_framework="150" --oversubscribed_resources_interval="15secs"
--perf_duration="10secs" --perf_interval="1mins" --port="5051" --qos_correction_interval_min="0ns"
--quiet="false" --recover="reconnect" --recovery_timeout="15mins" --registration_backoff_factor="10ms"
--resources="cpus:2;gpus:0;mem:1024;disk:1024;ports:[31000-32000]" --revocable_cpu_low_priority="true"
--runtime_dir="/tmp/Endpoint_SlaveEndpointTest_NoAuthorizer_2_WfK0qC" --sandbox_directory="/mnt/mesos/sandbox"
--strict="true" --switch_user="true" --systemd_enable_support="true" --systemd_runtime_directory="/run/systemd/system"
--version="false" --work_dir="/tmp/Endpoint_SlaveEndpointTest_NoAuthorizer_2_k4HC6m"
I1023 04:07:21.260920  6167 credentials.hpp:86] Loading credential for authentication from
'/tmp/Endpoint_SlaveEndpointTest_NoAuthorizer_2_WfK0qC/credential'
I1023 04:07:21.261188  6167 slave.cpp:283] Agent using credential for: test-principal
I1023 04:07:21.261219  6167 credentials.hpp:37] Loading credentials for authentication from
'/tmp/Endpoint_SlaveEndpointTest_NoAuthorizer_2_WfK0qC/http_credentials'
I1023 04:07:21.261621  6167 http.cpp:1045] Creating default 'basic' HTTP authenticator for
realm 'mesos-agent-readonly'
I1023 04:07:21.261888  6167 http.cpp:1045] Creating default 'basic' HTTP authenticator for
realm 'mesos-agent-readwrite'
I1023 04:07:21.264086  6167 slave.cpp:565] Agent resources: [{"name":"cpus","scalar":{"value":2.0},"type":"SCALAR"},{"name":"mem","scalar":{"value":1024.0},"type":"SCALAR"},{"name":"disk","scalar":{"value":1024.0},"type":"SCALAR"},{"name":"ports","ranges":{"range":[{"begin":31000,"end":32000}]},"type":"RANGES"}]
I1023 04:07:21.264526  6167 slave.cpp:573] Agent attributes: [  ]
I1023 04:07:21.264549  6167 slave.cpp:582] Agent hostname: 3e040beb3d93
I1023 04:07:21.264787  6168 status_update_manager.cpp:177] Pausing sending status updates
I1023 04:07:21.266875  6165 state.cpp:64] Recovering state from '/tmp/Endpoint_SlaveEndpointTest_NoAuthorizer_2_k4HC6m/meta'
I1023 04:07:21.267359  6168 status_update_manager.cpp:203] Recovering status update manager
I1023 04:07:21.267704  6166 containerizer.cpp:609] Recovering containerizer
I1023 04:07:21.270030  6168 provisioner.cpp:416] Provisioner recovery complete
I1023 04:07:21.270573  6163 slave.cpp:6295] Finished recovery
I1023 04:07:21.271261  6163 slave.cpp:6477] Querying resource estimator for oversubscribable
resources
I1023 04:07:21.271682  6169 slave.cpp:6491] Received oversubscribable resources {} from the
resource estimator
I1023 04:07:21.275563  6165 process.cpp:3938] Handling HTTP event for process 'slave(802)'
with path: '/slave(802)/containers'
I1023 04:07:21.277752  6164 http.cpp:1185] HTTP GET for /slave(802)/containers from 172.17.0.3:58850
I1023 04:07:21.277880  6164 http.cpp:976] Authorizing principal 'test-principal' to GET the
'/containers' endpoint
I1023 04:07:21.284597  6166 slave.cpp:843] Agent terminating
[       OK ] Endpoint/SlaveEndpointTest.NoAuthorizer/2 (53 ms)
[----------] 9 tests from Endpoint/SlaveEndpointTest (442 ms total)

[----------] 2 tests from ContainerizerType/DefaultContainerDNSFlagTest
[ RUN      ] ContainerizerType/DefaultContainerDNSFlagTest.ValidateFlag/0
[       OK ] ContainerizerType/DefaultContainerDNSFlagTest.ValidateFlag/0 (19 ms)
[ RUN      ] ContainerizerType/DefaultContainerDNSFlagTest.ValidateFlag/1
[       OK ] ContainerizerType/DefaultContainerDNSFlagTest.ValidateFlag/1 (20 ms)
[----------] 2 tests from ContainerizerType/DefaultContainerDNSFlagTest (39 ms total)

[----------] Global test environment tear-down
[==========] 1652 tests from 182 test cases ran. (771330 ms total)
[  PASSED  ] 1646 tests.
[  FAILED  ] 6 tests, listed below:
[  FAILED  ] CommandExecutorCheckTest.CommandCheckDeliveredAndReconciled
[  FAILED  ] DefaultExecutorCheckTest.CommandCheckDeliveredAndReconciled
[  FAILED  ] DefaultExecutorCheckTest.CommandCheckStatusChange
[  FAILED  ] DefaultExecutorCheckTest.CommandCheckSeesParentsEnv
[  FAILED  ] DefaultExecutorCheckTest.CommandCheckSharesWorkDirWithTask
[  FAILED  ] ContentType/AgentAPITest.GetContainers/0, where GetParam() = application/x-protobuf

 6 FAILED TESTS
  YOU HAVE 20 DISABLED TESTS

I1023 04:07:21.481168  6171 process.cpp:1068] Failed to accept socket: future discarded
make[4]: *** [check-local] Error 1
make[4]: Leaving directory `/mesos/mesos-1.4.1/_build/src'
make[3]: *** [check-am] Error 2
make[3]: Leaving directory `/mesos/mesos-1.4.1/_build/src'
make[2]: *** [check] Error 2
make[2]: Leaving directory `/mesos/mesos-1.4.1/_build/src'
make[1]: *** [check-recursive] Error 1
make[1]: Leaving directory `/mesos/mesos-1.4.1/_build'
make: *** [distcheck] Error 1
+ docker rmi mesos-1508726662-25206
Untagged: mesos-1508726662-25206:latest
Deleted: sha256:708e18040b94d44784fa803a0ed8830c4c42d1e4000445cedfbfd01ab1b733a2
Deleted: sha256:7907610eeb4913c039a4fb2c1d69cd7b49fb65c7cc22df549dce306fc1b37f87
Deleted: sha256:eb56e5c198444c0f5d4c932c306864ebf56df904c21a7e348e33c0147ffb4119
Deleted: sha256:14718b21ba626ab62bb57e6e045f1960fcf0117e965203c804192e67ad1be518
Deleted: sha256:6eb04068a2e163306d6765ef080ecb3724feddd7659a4e55b7567e9e0479f0e5
Deleted: sha256:eb030f9d8f8044a8f41fb58ea54f13d4caca8724d71dd03f495bab44a41d50ad
Deleted: sha256:404e0cfcad47f3138ad18ba1ef73369dac1b6a984402fd5aca5496f83b6c574a
Deleted: sha256:31570eacf40e8d9165e9306ad53c4fce470fb8a6f5da601e1f7118c8b2e1af40
Deleted: sha256:b78f0f43be5ca3c69ec5039a03daf31290322da1fc30ac4652f9e12ba9d6641c
Deleted: sha256:f2487ee45117a4b0e91cf370bcae7cdf84d8fd16b2cc3333ee827133384aa066
Deleted: sha256:327bea4ef1620aef94106d70b7ab49ece663e6b714d108247c143732deb189a0
Deleted: sha256:afaa0c2e4a04aa0d8cfaf5492faea78eba7089520bdb399b6ecb121c8d135668
Deleted: sha256:3f4c5fc6f52b5e1a72ac802803a76387e788d95c8c35544863253997441ed860
Deleted: sha256:4271aec0f30a35a647b6ae1df212305f8f618087e7a2f5f31eaf3be0e97a03b3
Deleted: sha256:96de49875d0bd5b4d4b72f8c6b8b2a546a1c9138af9a4b59faba92b6aa60e014
Deleted: sha256:3c5d3db3d4cea8092ad52049967eddf3f5929170af8fbf8cc7b9dcbd0a902897
Deleted: sha256:703458a50a1b5b8df2de9d25511da59365859d8db23c6652d400f853d3132327
Deleted: sha256:dcae2858f0a43a9ff6a027859b2cc695afa914c464f4c1c764e25c79ac1e7e7e
Deleted: sha256:2d57e0be2ab40c106c6d5780f4389f743f3efe70573d5aa57649b122d55244e9
Deleted: sha256:85ee5488a5b1cc77af6d3af1527a5250510cf2169114f82cd780f6a67ac78af2
Deleted: sha256:bcfc7f2588ada7c042557a86bb10b22b9b05a73ec21754c726c4a25edeab50cb
Deleted: sha256:2bef8ddf0743f902a00424bf7dc73d29ad7d01a054848644099e65e40dec475f
Deleted: sha256:d9b1e8b1d7c3fc6767b81792217d9079912925b213de55b5715ef26f6298b2a9
Deleted: sha256:cbfb7c79cb74bf6af52985e33affa7c9d9d66c5c071ca06c1743a86d0a70046e
Deleted: sha256:0a373f874afda20f6d8120ac2ea5aef9226c194621e0cb300432871d8b1de28d
Build step 'Execute shell' marked build as failure


Mime
View raw message