mesos-builds mailing list archives

Site index · List index
Message view « Date » · « Thread »
Top « Date » · « Thread »
From Apache Jenkins Server <jenk...@builds.apache.org>
Subject Build failed in Jenkins: Mesos-Buildbot » autotools,gcc,--verbose --disable-libtool-wrappers --enable-libevent --enable-ssl,GLOG_v=1 MESOS_VERBOSE=1,centos:7,(ubuntu)&&(!ubuntu-us1)&&(!ubuntu-eu2)&&(!qnode3)&&(!H23) #4317
Date Fri, 13 Oct 2017 01:35:03 GMT
See <https://builds.apache.org/job/Mesos-Buildbot/BUILDTOOL=autotools,COMPILER=gcc,CONFIGURATION=--verbose%20--disable-libtool-wrappers%20--enable-libevent%20--enable-ssl,ENVIRONMENT=GLOG_v=1%20MESOS_VERBOSE=1,OS=centos%3A7,label_exp=(ubuntu)&&(!ubuntu-us1)&&(!ubuntu-eu2)&&(!qnode3)&&(!H23)/4317/display/redirect>

------------------------------------------
[...truncated 33.12 MB...]
I1013 01:34:57.373200 19287 slave.cpp:255] Flags at startup: --acls="" --appc_simple_discovery_uri_prefix="http://"
--appc_store_dir="/tmp/Endpoint_SlaveEndpointTest_UnauthorizedRequest_0_o3So12/store/appc"
--authenticate_http_executors="true" --authenticate_http_readonly="true" --authenticate_http_readwrite="true"
--authenticatee="crammd5" --authentication_backoff_factor="1secs" --authorizer="local" --cgroups_cpu_enable_pids_and_tids_count="false"
--cgroups_enable_cfs="false" --cgroups_hierarchy="/sys/fs/cgroup" --cgroups_limit_swap="false"
--cgroups_root="mesos" --container_disk_watch_interval="15secs" --containerizers="mesos" --credential="/tmp/Endpoint_SlaveEndpointTest_UnauthorizedRequest_0_o3So12/credential"
--default_role="*" --disallow_sharing_agent_pid_namespace="false" --disk_watch_interval="1mins"
--docker="docker" --docker_kill_orphans="true" --docker_registry="https://registry-1.docker.io"
--docker_remove_delay="6hrs" --docker_socket="/var/run/docker.sock" --docker_stop_timeout="0ns"
--docker_store_dir="/tmp/Endpoint_SlaveEndpointTest_UnauthorizedRequest_0_o3So12/store/docker"
--docker_volume_checkpoint_dir="/var/run/mesos/isolators/docker/volume" --enforce_container_disk_quota="false"
--executor_registration_timeout="1mins" --executor_reregistration_timeout="2secs" --executor_secret_key="/tmp/Endpoint_SlaveEndpointTest_UnauthorizedRequest_0_o3So12/executor_secret_key"
--executor_shutdown_grace_period="5secs" --fetcher_cache_dir="/tmp/Endpoint_SlaveEndpointTest_UnauthorizedRequest_0_o3So12/fetch"
--fetcher_cache_size="2GB" --frameworks_home="" --gc_delay="1weeks" --gc_disk_headroom="0.1"
--hadoop_home="" --help="false" --hostname_lookup="true" --http_command_executor="false" --http_credentials="/tmp/Endpoint_SlaveEndpointTest_UnauthorizedRequest_0_o3So12/http_credentials"
--http_heartbeat_interval="30secs" --initialize_driver_logging="true" --isolation="posix/cpu,posix/mem"
--launcher="posix" --launcher_dir="/mesos/mesos-1.5.0/_build/src" --logbufsecs="0" --logging_level="INFO"
--max_completed_executors_per_framework="150" --oversubscribed_resources_interval="15secs"
--perf_duration="10secs" --perf_interval="1mins" --port="5051" --qos_correction_interval_min="0ns"
--quiet="false" --recover="reconnect" --recovery_timeout="15mins" --registration_backoff_factor="10ms"
--resources="cpus:2;gpus:0;mem:1024;disk:1024;ports:[31000-32000]" --revocable_cpu_low_priority="true"
--runtime_dir="/tmp/Endpoint_SlaveEndpointTest_UnauthorizedRequest_0_o3So12" --sandbox_directory="/mnt/mesos/sandbox"
--strict="true" --switch_user="true" --systemd_enable_support="true" --systemd_runtime_directory="/run/systemd/system"
--version="false" --work_dir="/tmp/Endpoint_SlaveEndpointTest_UnauthorizedRequest_0_D1yWpf"
--zk_session_timeout="10secs"
I1013 01:34:57.373570 19287 credentials.hpp:86] Loading credential for authentication from
'/tmp/Endpoint_SlaveEndpointTest_UnauthorizedRequest_0_o3So12/credential'
I1013 01:34:57.373740 19287 slave.cpp:287] Agent using credential for: test-principal
I1013 01:34:57.373761 19287 credentials.hpp:37] Loading credentials for authentication from
'/tmp/Endpoint_SlaveEndpointTest_UnauthorizedRequest_0_o3So12/http_credentials'
I1013 01:34:57.374050 19287 http.cpp:1045] Creating default 'basic' HTTP authenticator for
realm 'mesos-agent-executor'
I1013 01:34:57.374176 19287 http.cpp:1066] Creating default 'jwt' HTTP authenticator for realm
'mesos-agent-executor'
I1013 01:34:57.374392 19287 http.cpp:1045] Creating default 'basic' HTTP authenticator for
realm 'mesos-agent-readonly'
I1013 01:34:57.374491 19287 http.cpp:1066] Creating default 'jwt' HTTP authenticator for realm
'mesos-agent-readonly'
I1013 01:34:57.374670 19287 http.cpp:1045] Creating default 'basic' HTTP authenticator for
realm 'mesos-agent-readwrite'
I1013 01:34:57.374768 19287 http.cpp:1066] Creating default 'jwt' HTTP authenticator for realm
'mesos-agent-readwrite'
I1013 01:34:57.376159 19287 slave.cpp:585] Agent resources: [{"name":"cpus","scalar":{"value":2.0},"type":"SCALAR"},{"name":"mem","scalar":{"value":1024.0},"type":"SCALAR"},{"name":"disk","scalar":{"value":1024.0},"type":"SCALAR"},{"name":"ports","ranges":{"range":[{"begin":31000,"end":32000}]},"type":"RANGES"}]
I1013 01:34:57.376385 19287 slave.cpp:593] Agent attributes: [  ]
I1013 01:34:57.376399 19287 slave.cpp:602] Agent hostname: d327f163cda0
I1013 01:34:57.376549 19280 status_update_manager.cpp:177] Pausing sending status updates
I1013 01:34:57.378033 19277 state.cpp:64] Recovering state from '/tmp/Endpoint_SlaveEndpointTest_UnauthorizedRequest_0_D1yWpf/meta'
I1013 01:34:57.378299 19288 status_update_manager.cpp:203] Recovering status update manager
I1013 01:34:57.378473 19288 containerizer.cpp:648] Recovering containerizer
I1013 01:34:57.379683 19278 provisioner.cpp:416] Provisioner recovery complete
I1013 01:34:57.380056 19278 slave.cpp:6310] Finished recovery
I1013 01:34:57.380496 19278 slave.cpp:6492] Querying resource estimator for oversubscribable
resources
I1013 01:34:57.380764 19273 slave.cpp:6506] Received oversubscribable resources {} from the
resource estimator
I1013 01:34:57.382787 19275 process.cpp:3929] Handling HTTP event for process 'slave(825)'
with path: '/slave(825)/monitor/statistics'
I1013 01:34:57.384464 19282 http.cpp:1185] HTTP GET for /slave(825)/monitor/statistics from
172.17.0.3:44428
I1013 01:34:57.384532 19282 http.cpp:976] Authorizing principal 'test-principal' to GET the
'/monitor/statistics' endpoint
I1013 01:34:57.386550  9525 slave.cpp:869] Agent terminating
[       OK ] Endpoint/SlaveEndpointTest.UnauthorizedRequest/0 (27 ms)
[ RUN      ] Endpoint/SlaveEndpointTest.UnauthorizedRequest/1
I1013 01:34:57.397619  9525 containerizer.cpp:292] Using isolation { environment_secret, posix/cpu,
posix/mem, filesystem/posix, network/cni }
W1013 01:34:57.398144  9525 backend.cpp:76] Failed to create 'aufs' backend: AufsBackend requires
root privileges
W1013 01:34:57.398258  9525 backend.cpp:76] Failed to create 'bind' backend: BindBackend requires
root privileges
I1013 01:34:57.398298  9525 provisioner.cpp:255] Using default backend 'copy'
I1013 01:34:57.401773 19283 slave.cpp:254] Mesos agent started on (826)@172.17.0.3:41580
I1013 01:34:57.401798 19283 slave.cpp:255] Flags at startup: --acls="" --appc_simple_discovery_uri_prefix="http://"
--appc_store_dir="/tmp/Endpoint_SlaveEndpointTest_UnauthorizedRequest_1_SRDAFf/store/appc"
--authenticate_http_executors="true" --authenticate_http_readonly="true" --authenticate_http_readwrite="true"
--authenticatee="crammd5" --authentication_backoff_factor="1secs" --authorizer="local" --cgroups_cpu_enable_pids_and_tids_count="false"
--cgroups_enable_cfs="false" --cgroups_hierarchy="/sys/fs/cgroup" --cgroups_limit_swap="false"
--cgroups_root="mesos" --container_disk_watch_interval="15secs" --containerizers="mesos" --credential="/tmp/Endpoint_SlaveEndpointTest_UnauthorizedRequest_1_SRDAFf/credential"
--default_role="*" --disallow_sharing_agent_pid_namespace="false" --disk_watch_interval="1mins"
--docker="docker" --docker_kill_orphans="true" --docker_registry="https://registry-1.docker.io"
--docker_remove_delay="6hrs" --docker_socket="/var/run/docker.sock" --docker_stop_timeout="0ns"
--docker_store_dir="/tmp/Endpoint_SlaveEndpointTest_UnauthorizedRequest_1_SRDAFf/store/docker"
--docker_volume_checkpoint_dir="/var/run/mesos/isolators/docker/volume" --enforce_container_disk_quota="false"
--executor_registration_timeout="1mins" --executor_reregistration_timeout="2secs" --executor_secret_key="/tmp/Endpoint_SlaveEndpointTest_UnauthorizedRequest_1_SRDAFf/executor_secret_key"
--executor_shutdown_grace_period="5secs" --fetcher_cache_dir="/tmp/Endpoint_SlaveEndpointTest_UnauthorizedRequest_1_SRDAFf/fetch"
--fetcher_cache_size="2GB" --frameworks_home="" --gc_delay="1weeks" --gc_disk_headroom="0.1"
--hadoop_home="" --help="false" --hostname_lookup="true" --http_command_executor="false" --http_credentials="/tmp/Endpoint_SlaveEndpointTest_UnauthorizedRequest_1_SRDAFf/http_credentials"
--http_heartbeat_interval="30secs" --initialize_driver_logging="true" --isolation="posix/cpu,posix/mem"
--launcher="posix" --launcher_dir="/mesos/mesos-1.5.0/_build/src" --logbufsecs="0" --logging_level="INFO"
--max_completed_executors_per_framework="150" --oversubscribed_resources_interval="15secs"
--perf_duration="10secs" --perf_interval="1mins" --port="5051" --qos_correction_interval_min="0ns"
--quiet="false" --recover="reconnect" --recovery_timeout="15mins" --registration_backoff_factor="10ms"
--resources="cpus:2;gpus:0;mem:1024;disk:1024;ports:[31000-32000]" --revocable_cpu_low_priority="true"
--runtime_dir="/tmp/Endpoint_SlaveEndpointTest_UnauthorizedRequest_1_SRDAFf" --sandbox_directory="/mnt/mesos/sandbox"
--strict="true" --switch_user="true" --systemd_enable_support="true" --systemd_runtime_directory="/run/systemd/system"
--version="false" --work_dir="/tmp/Endpoint_SlaveEndpointTest_UnauthorizedRequest_1_JbAVZr"
--zk_session_timeout="10secs"
I1013 01:34:57.402216 19283 credentials.hpp:86] Loading credential for authentication from
'/tmp/Endpoint_SlaveEndpointTest_UnauthorizedRequest_1_SRDAFf/credential'
I1013 01:34:57.402369 19283 slave.cpp:287] Agent using credential for: test-principal
I1013 01:34:57.402390 19283 credentials.hpp:37] Loading credentials for authentication from
'/tmp/Endpoint_SlaveEndpointTest_UnauthorizedRequest_1_SRDAFf/http_credentials'
I1013 01:34:57.402675 19283 http.cpp:1045] Creating default 'basic' HTTP authenticator for
realm 'mesos-agent-executor'
I1013 01:34:57.402797 19283 http.cpp:1066] Creating default 'jwt' HTTP authenticator for realm
'mesos-agent-executor'
I1013 01:34:57.403002 19283 http.cpp:1045] Creating default 'basic' HTTP authenticator for
realm 'mesos-agent-readonly'
I1013 01:34:57.403103 19283 http.cpp:1066] Creating default 'jwt' HTTP authenticator for realm
'mesos-agent-readonly'
I1013 01:34:57.403285 19283 http.cpp:1045] Creating default 'basic' HTTP authenticator for
realm 'mesos-agent-readwrite'
I1013 01:34:57.403383 19283 http.cpp:1066] Creating default 'jwt' HTTP authenticator for realm
'mesos-agent-readwrite'
I1013 01:34:57.404772 19283 slave.cpp:585] Agent resources: [{"name":"cpus","scalar":{"value":2.0},"type":"SCALAR"},{"name":"mem","scalar":{"value":1024.0},"type":"SCALAR"},{"name":"disk","scalar":{"value":1024.0},"type":"SCALAR"},{"name":"ports","ranges":{"range":[{"begin":31000,"end":32000}]},"type":"RANGES"}]
I1013 01:34:57.404997 19283 slave.cpp:593] Agent attributes: [  ]
I1013 01:34:57.405010 19283 slave.cpp:602] Agent hostname: d327f163cda0
I1013 01:34:57.405159 19274 status_update_manager.cpp:177] Pausing sending status updates
I1013 01:34:57.406529 19271 state.cpp:64] Recovering state from '/tmp/Endpoint_SlaveEndpointTest_UnauthorizedRequest_1_JbAVZr/meta'
I1013 01:34:57.406801 19269 status_update_manager.cpp:203] Recovering status update manager
I1013 01:34:57.406994 19268 containerizer.cpp:648] Recovering containerizer
I1013 01:34:57.408397 19266 provisioner.cpp:416] Provisioner recovery complete
I1013 01:34:57.408746 19286 slave.cpp:6310] Finished recovery
I1013 01:34:57.409224 19286 slave.cpp:6492] Querying resource estimator for oversubscribable
resources
I1013 01:34:57.409454 19271 slave.cpp:6506] Received oversubscribable resources {} from the
resource estimator
I1013 01:34:57.411221 19277 process.cpp:3929] Handling HTTP event for process 'slave(826)'
with path: '/slave(826)/monitor/statistics.json'
I1013 01:34:57.412916 19288 http.cpp:1185] HTTP GET for /slave(826)/monitor/statistics.json
from 172.17.0.3:44430
I1013 01:34:57.413030 19288 http.cpp:976] Authorizing principal 'test-principal' to GET the
'/monitor/statistics.json' endpoint
I1013 01:34:57.415586 19286 slave.cpp:869] Agent terminating
[       OK ] Endpoint/SlaveEndpointTest.UnauthorizedRequest/1 (28 ms)
[ RUN      ] Endpoint/SlaveEndpointTest.UnauthorizedRequest/2
I1013 01:34:57.425963  9525 containerizer.cpp:292] Using isolation { environment_secret, posix/cpu,
posix/mem, filesystem/posix, network/cni }
W1013 01:34:57.426437  9525 backend.cpp:76] Failed to create 'aufs' backend: AufsBackend requires
root privileges
W1013 01:34:57.426553  9525 backend.cpp:76] Failed to create 'bind' backend: BindBackend requires
root privileges
I1013 01:34:57.426585  9525 provisioner.cpp:255] Using default backend 'copy'
I1013 01:34:57.429955 19266 slave.cpp:254] Mesos agent started on (827)@172.17.0.3:41580
I1013 01:34:57.429983 19266 slave.cpp:255] Flags at startup: --acls="" --appc_simple_discovery_uri_prefix="http://"
--appc_store_dir="/tmp/Endpoint_SlaveEndpointTest_UnauthorizedRequest_2_KayPAs/store/appc"
--authenticate_http_executors="true" --authenticate_http_readonly="true" --authenticate_http_readwrite="true"
--authenticatee="crammd5" --authentication_backoff_factor="1secs" --authorizer="local" --cgroups_cpu_enable_pids_and_tids_count="false"
--cgroups_enable_cfs="false" --cgroups_hierarchy="/sys/fs/cgroup" --cgroups_limit_swap="false"
--cgroups_root="mesos" --container_disk_watch_interval="15secs" --containerizers="mesos" --credential="/tmp/Endpoint_SlaveEndpointTest_UnauthorizedRequest_2_KayPAs/credential"
--default_role="*" --disallow_sharing_agent_pid_namespace="false" --disk_watch_interval="1mins"
--docker="docker" --docker_kill_orphans="true" --docker_registry="https://registry-1.docker.io"
--docker_remove_delay="6hrs" --docker_socket="/var/run/docker.sock" --docker_stop_timeout="0ns"
--docker_store_dir="/tmp/Endpoint_SlaveEndpointTest_UnauthorizedRequest_2_KayPAs/store/docker"
--docker_volume_checkpoint_dir="/var/run/mesos/isolators/docker/volume" --enforce_container_disk_quota="false"
--executor_registration_timeout="1mins" --executor_reregistration_timeout="2secs" --executor_secret_key="/tmp/Endpoint_SlaveEndpointTest_UnauthorizedRequest_2_KayPAs/executor_secret_key"
--executor_shutdown_grace_period="5secs" --fetcher_cache_dir="/tmp/Endpoint_SlaveEndpointTest_UnauthorizedRequest_2_KayPAs/fetch"
--fetcher_cache_size="2GB" --frameworks_home="" --gc_delay="1weeks" --gc_disk_headroom="0.1"
--hadoop_home="" --help="false" --hostname_lookup="true" --http_command_executor="false" --http_credentials="/tmp/Endpoint_SlaveEndpointTest_UnauthorizedRequest_2_KayPAs/http_credentials"
--http_heartbeat_interval="30secs" --initialize_driver_logging="true" --isolation="posix/cpu,posix/mem"
--launcher="posix" --launcher_dir="/mesos/mesos-1.5.0/_build/src" --logbufsecs="0" --logging_level="INFO"
--max_completed_executors_per_framework="150" --oversubscribed_resources_interval="15secs"
--perf_duration="10secs" --perf_interval="1mins" --port="5051" --qos_correction_interval_min="0ns"
--quiet="false" --recover="reconnect" --recovery_timeout="15mins" --registration_backoff_factor="10ms"
--resources="cpus:2;gpus:0;mem:1024;disk:1024;ports:[31000-32000]" --revocable_cpu_low_priority="true"
--runtime_dir="/tmp/Endpoint_SlaveEndpointTest_UnauthorizedRequest_2_KayPAs" --sandbox_directory="/mnt/mesos/sandbox"
--strict="true" --switch_user="true" --systemd_enable_support="true" --systemd_runtime_directory="/run/systemd/system"
--version="false" --work_dir="/tmp/Endpoint_SlaveEndpointTest_UnauthorizedRequest_2_JepUQE"
--zk_session_timeout="10secs"
I1013 01:34:57.430364 19266 credentials.hpp:86] Loading credential for authentication from
'/tmp/Endpoint_SlaveEndpointTest_UnauthorizedRequest_2_KayPAs/credential'
I1013 01:34:57.430523 19266 slave.cpp:287] Agent using credential for: test-principal
I1013 01:34:57.430543 19266 credentials.hpp:37] Loading credentials for authentication from
'/tmp/Endpoint_SlaveEndpointTest_UnauthorizedRequest_2_KayPAs/http_credentials'
I1013 01:34:57.430824 19266 http.cpp:1045] Creating default 'basic' HTTP authenticator for
realm 'mesos-agent-executor'
I1013 01:34:57.430941 19266 http.cpp:1066] Creating default 'jwt' HTTP authenticator for realm
'mesos-agent-executor'
I1013 01:34:57.431176 19266 http.cpp:1045] Creating default 'basic' HTTP authenticator for
realm 'mesos-agent-readonly'
I1013 01:34:57.431284 19266 http.cpp:1066] Creating default 'jwt' HTTP authenticator for realm
'mesos-agent-readonly'
I1013 01:34:57.431466 19266 http.cpp:1045] Creating default 'basic' HTTP authenticator for
realm 'mesos-agent-readwrite'
I1013 01:34:57.431573 19266 http.cpp:1066] Creating default 'jwt' HTTP authenticator for realm
'mesos-agent-readwrite'
I1013 01:34:57.433008 19266 slave.cpp:585] Agent resources: [{"name":"cpus","scalar":{"value":2.0},"type":"SCALAR"},{"name":"mem","scalar":{"value":1024.0},"type":"SCALAR"},{"name":"disk","scalar":{"value":1024.0},"type":"SCALAR"},{"name":"ports","ranges":{"range":[{"begin":31000,"end":32000}]},"type":"RANGES"}]
I1013 01:34:57.433233 19266 slave.cpp:593] Agent attributes: [  ]
I1013 01:34:57.433246 19266 slave.cpp:602] Agent hostname: d327f163cda0
I1013 01:34:57.433393 19269 status_update_manager.cpp:177] Pausing sending status updates
I1013 01:34:57.434801 19281 state.cpp:64] Recovering state from '/tmp/Endpoint_SlaveEndpointTest_UnauthorizedRequest_2_JepUQE/meta'
I1013 01:34:57.435083 19288 status_update_manager.cpp:203] Recovering status update manager
I1013 01:34:57.435269 19275 containerizer.cpp:648] Recovering containerizer
I1013 01:34:57.436573 19282 provisioner.cpp:416] Provisioner recovery complete
I1013 01:34:57.436976 19282 slave.cpp:6310] Finished recovery
I1013 01:34:57.437408 19282 slave.cpp:6492] Querying resource estimator for oversubscribable
resources
I1013 01:34:57.437639 19274 slave.cpp:6506] Received oversubscribable resources {} from the
resource estimator
I1013 01:34:57.439584 19286 process.cpp:3929] Handling HTTP event for process 'slave(827)'
with path: '/slave(827)/containers'
I1013 01:34:57.441296 19269 http.cpp:1185] HTTP GET for /slave(827)/containers from 172.17.0.3:44432
I1013 01:34:57.441362 19269 http.cpp:976] Authorizing principal 'test-principal' to GET the
'/containers' endpoint
I1013 01:34:57.443732 19273 slave.cpp:869] Agent terminating
[       OK ] Endpoint/SlaveEndpointTest.UnauthorizedRequest/2 (28 ms)
[ RUN      ] Endpoint/SlaveEndpointTest.NoAuthorizer/0
I1013 01:34:57.454790  9525 containerizer.cpp:292] Using isolation { environment_secret, posix/cpu,
posix/mem, filesystem/posix, network/cni }
W1013 01:34:57.455246  9525 backend.cpp:76] Failed to create 'aufs' backend: AufsBackend requires
root privileges
W1013 01:34:57.455364  9525 backend.cpp:76] Failed to create 'bind' backend: BindBackend requires
root privileges
I1013 01:34:57.455401  9525 provisioner.cpp:255] Using default backend 'copy'
I1013 01:34:57.456998  9525 cluster.cpp:448] Creating default 'local' authorizer
I1013 01:34:57.458969 19276 slave.cpp:254] Mesos agent started on (828)@172.17.0.3:41580
I1013 01:34:57.458992 19276 slave.cpp:255] Flags at startup: --acls="" --appc_simple_discovery_uri_prefix="http://"
--appc_store_dir="/tmp/Endpoint_SlaveEndpointTest_NoAuthorizer_0_Ck1YMF/store/appc" --authenticate_http_executors="true"
--authenticate_http_readonly="true" --authenticate_http_readwrite="true" --authenticatee="crammd5"
--authentication_backoff_factor="1secs" --authorizer="local" --cgroups_cpu_enable_pids_and_tids_count="false"
--cgroups_enable_cfs="false" --cgroups_hierarchy="/sys/fs/cgroup" --cgroups_limit_swap="false"
--cgroups_root="mesos" --container_disk_watch_interval="15secs" --containerizers="mesos" --credential="/tmp/Endpoint_SlaveEndpointTest_NoAuthorizer_0_Ck1YMF/credential"
--default_role="*" --disallow_sharing_agent_pid_namespace="false" --disk_watch_interval="1mins"
--docker="docker" --docker_kill_orphans="true" --docker_registry="https://registry-1.docker.io"
--docker_remove_delay="6hrs" --docker_socket="/var/run/docker.sock" --docker_stop_timeout="0ns"
--docker_store_dir="/tmp/Endpoint_SlaveEndpointTest_NoAuthorizer_0_Ck1YMF/store/docker" --docker_volume_checkpoint_dir="/var/run/mesos/isolators/docker/volume"
--enforce_container_disk_quota="false" --executor_registration_timeout="1mins" --executor_reregistration_timeout="2secs"
--executor_secret_key="/tmp/Endpoint_SlaveEndpointTest_NoAuthorizer_0_Ck1YMF/executor_secret_key"
--executor_shutdown_grace_period="5secs" --fetcher_cache_dir="/tmp/Endpoint_SlaveEndpointTest_NoAuthorizer_0_Ck1YMF/fetch"
--fetcher_cache_size="2GB" --frameworks_home="" --gc_delay="1weeks" --gc_disk_headroom="0.1"
--hadoop_home="" --help="false" --hostname_lookup="true" --http_command_executor="false" --http_credentials="/tmp/Endpoint_SlaveEndpointTest_NoAuthorizer_0_Ck1YMF/http_credentials"
--http_heartbeat_interval="30secs" --initialize_driver_logging="true" --isolation="posix/cpu,posix/mem"
--launcher="posix" --launcher_dir="/mesos/mesos-1.5.0/_build/src" --logbufsecs="0" --logging_level="INFO"
--max_completed_executors_per_framework="150" --oversubscribed_resources_interval="15secs"
--perf_duration="10secs" --perf_interval="1mins" --port="5051" --qos_correction_interval_min="0ns"
--quiet="false" --recover="reconnect" --recovery_timeout="15mins" --registration_backoff_factor="10ms"
--resources="cpus:2;gpus:0;mem:1024;disk:1024;ports:[31000-32000]" --revocable_cpu_low_priority="true"
--runtime_dir="/tmp/Endpoint_SlaveEndpointTest_NoAuthorizer_0_Ck1YMF" --sandbox_directory="/mnt/mesos/sandbox"
--strict="true" --switch_user="true" --systemd_enable_support="true" --systemd_runtime_directory="/run/systemd/system"
--version="false" --work_dir="/tmp/Endpoint_SlaveEndpointTest_NoAuthorizer_0_9gwPYR" --zk_session_timeout="10secs"
I1013 01:34:57.459367 19276 credentials.hpp:86] Loading credential for authentication from
'/tmp/Endpoint_SlaveEndpointTest_NoAuthorizer_0_Ck1YMF/credential'
I1013 01:34:57.459512 19276 slave.cpp:287] Agent using credential for: test-principal
I1013 01:34:57.459533 19276 credentials.hpp:37] Loading credentials for authentication from
'/tmp/Endpoint_SlaveEndpointTest_NoAuthorizer_0_Ck1YMF/http_credentials'
I1013 01:34:57.459823 19276 http.cpp:1045] Creating default 'basic' HTTP authenticator for
realm 'mesos-agent-executor'
I1013 01:34:57.459934 19276 http.cpp:1066] Creating default 'jwt' HTTP authenticator for realm
'mesos-agent-executor'
I1013 01:34:57.460181 19276 http.cpp:1045] Creating default 'basic' HTTP authenticator for
realm 'mesos-agent-readonly'
I1013 01:34:57.460285 19276 http.cpp:1066] Creating default 'jwt' HTTP authenticator for realm
'mesos-agent-readonly'
I1013 01:34:57.460466 19276 http.cpp:1045] Creating default 'basic' HTTP authenticator for
realm 'mesos-agent-readwrite'
I1013 01:34:57.460563 19276 http.cpp:1066] Creating default 'jwt' HTTP authenticator for realm
'mesos-agent-readwrite'
I1013 01:34:57.462021 19276 slave.cpp:585] Agent resources: [{"name":"cpus","scalar":{"value":2.0},"type":"SCALAR"},{"name":"mem","scalar":{"value":1024.0},"type":"SCALAR"},{"name":"disk","scalar":{"value":1024.0},"type":"SCALAR"},{"name":"ports","ranges":{"range":[{"begin":31000,"end":32000}]},"type":"RANGES"}]
I1013 01:34:57.462244 19276 slave.cpp:593] Agent attributes: [  ]
I1013 01:34:57.462256 19276 slave.cpp:602] Agent hostname: d327f163cda0
I1013 01:34:57.462404 19284 status_update_manager.cpp:177] Pausing sending status updates
I1013 01:34:57.463781 19277 state.cpp:64] Recovering state from '/tmp/Endpoint_SlaveEndpointTest_NoAuthorizer_0_9gwPYR/meta'
I1013 01:34:57.464082 19277 status_update_manager.cpp:203] Recovering status update manager
I1013 01:34:57.464270 19277 containerizer.cpp:648] Recovering containerizer
I1013 01:34:57.465517 19272 provisioner.cpp:416] Provisioner recovery complete
I1013 01:34:57.465844 19275 slave.cpp:6310] Finished recovery
I1013 01:34:57.466320 19275 slave.cpp:6492] Querying resource estimator for oversubscribable
resources
I1013 01:34:57.466589 19271 slave.cpp:6506] Received oversubscribable resources {} from the
resource estimator
I1013 01:34:57.468506 19273 process.cpp:3929] Handling HTTP event for process 'slave(828)'
with path: '/slave(828)/monitor/statistics'
I1013 01:34:57.470260 19272 http.cpp:1185] HTTP GET for /slave(828)/monitor/statistics from
172.17.0.3:44434
I1013 01:34:57.470327 19272 http.cpp:976] Authorizing principal 'test-principal' to GET the
'/monitor/statistics' endpoint
I1013 01:34:57.473635 19279 slave.cpp:869] Agent terminating
[       OK ] Endpoint/SlaveEndpointTest.NoAuthorizer/0 (30 ms)
[ RUN      ] Endpoint/SlaveEndpointTest.NoAuthorizer/1
I1013 01:34:57.484884  9525 containerizer.cpp:292] Using isolation { environment_secret, posix/cpu,
posix/mem, filesystem/posix, network/cni }
W1013 01:34:57.485350  9525 backend.cpp:76] Failed to create 'aufs' backend: AufsBackend requires
root privileges
W1013 01:34:57.485466  9525 backend.cpp:76] Failed to create 'bind' backend: BindBackend requires
root privileges
I1013 01:34:57.485507  9525 provisioner.cpp:255] Using default backend 'copy'
I1013 01:34:57.487185  9525 cluster.cpp:448] Creating default 'local' authorizer
I1013 01:34:57.489074 19279 slave.cpp:254] Mesos agent started on (829)@172.17.0.3:41580
I1013 01:34:57.489094 19279 slave.cpp:255] Flags at startup: --acls="" --appc_simple_discovery_uri_prefix="http://"
--appc_store_dir="/tmp/Endpoint_SlaveEndpointTest_NoAuthorizer_1_mdTRgT/store/appc" --authenticate_http_executors="true"
--authenticate_http_readonly="true" --authenticate_http_readwrite="true" --authenticatee="crammd5"
--authentication_backoff_factor="1secs" --authorizer="local" --cgroups_cpu_enable_pids_and_tids_count="false"
--cgroups_enable_cfs="false" --cgroups_hierarchy="/sys/fs/cgroup" --cgroups_limit_swap="false"
--cgroups_root="mesos" --container_disk_watch_interval="15secs" --containerizers="mesos" --credential="/tmp/Endpoint_SlaveEndpointTest_NoAuthorizer_1_mdTRgT/credential"
--default_role="*" --disallow_sharing_agent_pid_namespace="false" --disk_watch_interval="1mins"
--docker="docker" --docker_kill_orphans="true" --docker_registry="https://registry-1.docker.io"
--docker_remove_delay="6hrs" --docker_socket="/var/run/docker.sock" --docker_stop_timeout="0ns"
--docker_store_dir="/tmp/Endpoint_SlaveEndpointTest_NoAuthorizer_1_mdTRgT/store/docker" --docker_volume_checkpoint_dir="/var/run/mesos/isolators/docker/volume"
--enforce_container_disk_quota="false" --executor_registration_timeout="1mins" --executor_reregistration_timeout="2secs"
--executor_secret_key="/tmp/Endpoint_SlaveEndpointTest_NoAuthorizer_1_mdTRgT/executor_secret_key"
--executor_shutdown_grace_period="5secs" --fetcher_cache_dir="/tmp/Endpoint_SlaveEndpointTest_NoAuthorizer_1_mdTRgT/fetch"
--fetcher_cache_size="2GB" --frameworks_home="" --gc_delay="1weeks" --gc_disk_headroom="0.1"
--hadoop_home="" --help="false" --hostname_lookup="true" --http_command_executor="false" --http_credentials="/tmp/Endpoint_SlaveEndpointTest_NoAuthorizer_1_mdTRgT/http_credentials"
--http_heartbeat_interval="30secs" --initialize_driver_logging="true" --isolation="posix/cpu,posix/mem"
--launcher="posix" --launcher_dir="/mesos/mesos-1.5.0/_build/src" --logbufsecs="0" --logging_level="INFO"
--max_completed_executors_per_framework="150" --oversubscribed_resources_interval="15secs"
--perf_duration="10secs" --perf_interval="1mins" --port="5051" --qos_correction_interval_min="0ns"
--quiet="false" --recover="reconnect" --recovery_timeout="15mins" --registration_backoff_factor="10ms"
--resources="cpus:2;gpus:0;mem:1024;disk:1024;ports:[31000-32000]" --revocable_cpu_low_priority="true"
--runtime_dir="/tmp/Endpoint_SlaveEndpointTest_NoAuthorizer_1_mdTRgT" --sandbox_directory="/mnt/mesos/sandbox"
--strict="true" --switch_user="true" --systemd_enable_support="true" --systemd_runtime_directory="/run/systemd/system"
--version="false" --work_dir="/tmp/Endpoint_SlaveEndpointTest_NoAuthorizer_1_p8Jeo5" --zk_session_timeout="10secs"
I1013 01:34:57.489475 19279 credentials.hpp:86] Loading credential for authentication from
'/tmp/Endpoint_SlaveEndpointTest_NoAuthorizer_1_mdTRgT/credential'
I1013 01:34:57.489626 19279 slave.cpp:287] Agent using credential for: test-principal
I1013 01:34:57.489646 19279 credentials.hpp:37] Loading credentials for authentication from
'/tmp/Endpoint_SlaveEndpointTest_NoAuthorizer_1_mdTRgT/http_credentials'
I1013 01:34:57.489930 19279 http.cpp:1045] Creating default 'basic' HTTP authenticator for
realm 'mesos-agent-executor'
I1013 01:34:57.490074 19279 http.cpp:1066] Creating default 'jwt' HTTP authenticator for realm
'mesos-agent-executor'
I1013 01:34:57.490276 19279 http.cpp:1045] Creating default 'basic' HTTP authenticator for
realm 'mesos-agent-readonly'
I1013 01:34:57.490375 19279 http.cpp:1066] Creating default 'jwt' HTTP authenticator for realm
'mesos-agent-readonly'
I1013 01:34:57.490561 19279 http.cpp:1045] Creating default 'basic' HTTP authenticator for
realm 'mesos-agent-readwrite'
I1013 01:34:57.490685 19279 http.cpp:1066] Creating default 'jwt' HTTP authenticator for realm
'mesos-agent-readwrite'
I1013 01:34:57.492041 19279 slave.cpp:585] Agent resources: [{"name":"cpus","scalar":{"value":2.0},"type":"SCALAR"},{"name":"mem","scalar":{"value":1024.0},"type":"SCALAR"},{"name":"disk","scalar":{"value":1024.0},"type":"SCALAR"},{"name":"ports","ranges":{"range":[{"begin":31000,"end":32000}]},"type":"RANGES"}]
I1013 01:34:57.492264 19279 slave.cpp:593] Agent attributes: [  ]
I1013 01:34:57.492280 19279 slave.cpp:602] Agent hostname: d327f163cda0
I1013 01:34:57.492436 19273 status_update_manager.cpp:177] Pausing sending status updates
I1013 01:34:57.493818 19283 state.cpp:64] Recovering state from '/tmp/Endpoint_SlaveEndpointTest_NoAuthorizer_1_p8Jeo5/meta'
I1013 01:34:57.494215 19272 status_update_manager.cpp:203] Recovering status update manager
I1013 01:34:57.494491 19270 containerizer.cpp:648] Recovering containerizer
I1013 01:34:57.496033 19268 provisioner.cpp:416] Provisioner recovery complete
I1013 01:34:57.496445 19273 slave.cpp:6310] Finished recovery
I1013 01:34:57.496876 19273 slave.cpp:6492] Querying resource estimator for oversubscribable
resources
I1013 01:34:57.497138 19288 slave.cpp:6506] Received oversubscribable resources {} from the
resource estimator
I1013 01:34:57.499344 19281 process.cpp:3929] Handling HTTP event for process 'slave(829)'
with path: '/slave(829)/monitor/statistics.json'
I1013 01:34:57.501472 19268 http.cpp:1185] HTTP GET for /slave(829)/monitor/statistics.json
from 172.17.0.3:44436
I1013 01:34:57.501538 19268 http.cpp:976] Authorizing principal 'test-principal' to GET the
'/monitor/statistics.json' endpoint
I1013 01:34:57.504601 19265 slave.cpp:869] Agent terminating
[       OK ] Endpoint/SlaveEndpointTest.NoAuthorizer/1 (31 ms)
[ RUN      ] Endpoint/SlaveEndpointTest.NoAuthorizer/2
I1013 01:34:57.516366  9525 containerizer.cpp:292] Using isolation { environment_secret, posix/cpu,
posix/mem, filesystem/posix, network/cni }
W1013 01:34:57.516846  9525 backend.cpp:76] Failed to create 'aufs' backend: AufsBackend requires
root privileges
W1013 01:34:57.516957  9525 backend.cpp:76] Failed to create 'bind' backend: BindBackend requires
root privileges
I1013 01:34:57.516990  9525 provisioner.cpp:255] Using default backend 'copy'
I1013 01:34:57.518656  9525 cluster.cpp:448] Creating default 'local' authorizer
I1013 01:34:57.520514 19285 slave.cpp:254] Mesos agent started on (830)@172.17.0.3:41580
I1013 01:34:57.520537 19285 slave.cpp:255] Flags at startup: --acls="" --appc_simple_discovery_uri_prefix="http://"
--appc_store_dir="/tmp/Endpoint_SlaveEndpointTest_NoAuthorizer_2_uOqq36/store/appc" --authenticate_http_executors="true"
--authenticate_http_readonly="true" --authenticate_http_readwrite="true" --authenticatee="crammd5"
--authentication_backoff_factor="1secs" --authorizer="local" --cgroups_cpu_enable_pids_and_tids_count="false"
--cgroups_enable_cfs="false" --cgroups_hierarchy="/sys/fs/cgroup" --cgroups_limit_swap="false"
--cgroups_root="mesos" --container_disk_watch_interval="15secs" --containerizers="mesos" --credential="/tmp/Endpoint_SlaveEndpointTest_NoAuthorizer_2_uOqq36/credential"
--default_role="*" --disallow_sharing_agent_pid_namespace="false" --disk_watch_interval="1mins"
--docker="docker" --docker_kill_orphans="true" --docker_registry="https://registry-1.docker.io"
--docker_remove_delay="6hrs" --docker_socket="/var/run/docker.sock" --docker_stop_timeout="0ns"
--docker_store_dir="/tmp/Endpoint_SlaveEndpointTest_NoAuthorizer_2_uOqq36/store/docker" --docker_volume_checkpoint_dir="/var/run/mesos/isolators/docker/volume"
--enforce_container_disk_quota="false" --executor_registration_timeout="1mins" --executor_reregistration_timeout="2secs"
--executor_secret_key="/tmp/Endpoint_SlaveEndpointTest_NoAuthorizer_2_uOqq36/executor_secret_key"
--executor_shutdown_grace_period="5secs" --fetcher_cache_dir="/tmp/Endpoint_SlaveEndpointTest_NoAuthorizer_2_uOqq36/fetch"
--fetcher_cache_size="2GB" --frameworks_home="" --gc_delay="1weeks" --gc_disk_headroom="0.1"
--hadoop_home="" --help="false" --hostname_lookup="true" --http_command_executor="false" --http_credentials="/tmp/Endpoint_SlaveEndpointTest_NoAuthorizer_2_uOqq36/http_credentials"
--http_heartbeat_interval="30secs" --initialize_driver_logging="true" --isolation="posix/cpu,posix/mem"
--launcher="posix" --launcher_dir="/mesos/mesos-1.5.0/_build/src" --logbufsecs="0" --logging_level="INFO"
--max_completed_executors_per_framework="150" --oversubscribed_resources_interval="15secs"
--perf_duration="10secs" --perf_interval="1mins" --port="5051" --qos_correction_interval_min="0ns"
--quiet="false" --recover="reconnect" --recovery_timeout="15mins" --registration_backoff_factor="10ms"
--resources="cpus:2;gpus:0;mem:1024;disk:1024;ports:[31000-32000]" --revocable_cpu_low_priority="true"
--runtime_dir="/tmp/Endpoint_SlaveEndpointTest_NoAuthorizer_2_uOqq36" --sandbox_directory="/mnt/mesos/sandbox"
--strict="true" --switch_user="true" --systemd_enable_support="true" --systemd_runtime_directory="/run/systemd/system"
--version="false" --work_dir="/tmp/Endpoint_SlaveEndpointTest_NoAuthorizer_2_lms55i" --zk_session_timeout="10secs"
I1013 01:34:57.520932 19285 credentials.hpp:86] Loading credential for authentication from
'/tmp/Endpoint_SlaveEndpointTest_NoAuthorizer_2_uOqq36/credential'
I1013 01:34:57.521091 19285 slave.cpp:287] Agent using credential for: test-principal
I1013 01:34:57.521114 19285 credentials.hpp:37] Loading credentials for authentication from
'/tmp/Endpoint_SlaveEndpointTest_NoAuthorizer_2_uOqq36/http_credentials'
I1013 01:34:57.521440 19285 http.cpp:1045] Creating default 'basic' HTTP authenticator for
realm 'mesos-agent-executor'
I1013 01:34:57.521646 19285 http.cpp:1066] Creating default 'jwt' HTTP authenticator for realm
'mesos-agent-executor'
I1013 01:34:57.522001 19285 http.cpp:1045] Creating default 'basic' HTTP authenticator for
realm 'mesos-agent-readonly'
I1013 01:34:57.522104 19285 http.cpp:1066] Creating default 'jwt' HTTP authenticator for realm
'mesos-agent-readonly'
I1013 01:34:57.522280 19285 http.cpp:1045] Creating default 'basic' HTTP authenticator for
realm 'mesos-agent-readwrite'
I1013 01:34:57.522377 19285 http.cpp:1066] Creating default 'jwt' HTTP authenticator for realm
'mesos-agent-readwrite'
I1013 01:34:57.523751 19285 slave.cpp:585] Agent resources: [{"name":"cpus","scalar":{"value":2.0},"type":"SCALAR"},{"name":"mem","scalar":{"value":1024.0},"type":"SCALAR"},{"name":"disk","scalar":{"value":1024.0},"type":"SCALAR"},{"name":"ports","ranges":{"range":[{"begin":31000,"end":32000}]},"type":"RANGES"}]
I1013 01:34:57.523975 19285 slave.cpp:593] Agent attributes: [  ]
I1013 01:34:57.523989 19285 slave.cpp:602] Agent hostname: d327f163cda0
I1013 01:34:57.524147 19268 status_update_manager.cpp:177] Pausing sending status updates
I1013 01:34:57.525511 19279 state.cpp:64] Recovering state from '/tmp/Endpoint_SlaveEndpointTest_NoAuthorizer_2_lms55i/meta'
I1013 01:34:57.525837 19279 status_update_manager.cpp:203] Recovering status update manager
I1013 01:34:57.526064 19267 containerizer.cpp:648] Recovering containerizer
I1013 01:34:57.527420 19282 provisioner.cpp:416] Provisioner recovery complete
I1013 01:34:57.527765 19286 slave.cpp:6310] Finished recovery
I1013 01:34:57.528177 19286 slave.cpp:6492] Querying resource estimator for oversubscribable
resources
I1013 01:34:57.528409 19265 slave.cpp:6506] Received oversubscribable resources {} from the
resource estimator
I1013 01:34:57.530272 19271 process.cpp:3929] Handling HTTP event for process 'slave(830)'
with path: '/slave(830)/containers'
I1013 01:34:57.532544 19281 http.cpp:1185] HTTP GET for /slave(830)/containers from 172.17.0.3:44438
I1013 01:34:57.532611 19281 http.cpp:976] Authorizing principal 'test-principal' to GET the
'/containers' endpoint
I1013 01:34:57.535950 19274 slave.cpp:869] Agent terminating
[       OK ] Endpoint/SlaveEndpointTest.NoAuthorizer/2 (30 ms)
[----------] 9 tests from Endpoint/SlaveEndpointTest (273 ms total)

[----------] 2 tests from ContainerizerType/DefaultContainerDNSFlagTest
[ RUN      ] ContainerizerType/DefaultContainerDNSFlagTest.ValidateFlag/0
[       OK ] ContainerizerType/DefaultContainerDNSFlagTest.ValidateFlag/0 (10 ms)
[ RUN      ] ContainerizerType/DefaultContainerDNSFlagTest.ValidateFlag/1
[       OK ] ContainerizerType/DefaultContainerDNSFlagTest.ValidateFlag/1 (10 ms)
[----------] 2 tests from ContainerizerType/DefaultContainerDNSFlagTest (20 ms total)

[----------] Global test environment tear-down
[==========] 1700 tests from 187 test cases ran. (593624 ms total)
[  PASSED  ] 1699 tests.
[  FAILED  ] 1 test, listed below:
[  FAILED  ] ExamplesTest.JavaFramework

 1 FAILED TEST
  YOU HAVE 21 DISABLED TESTS

I1013 01:34:57.628155 19289 process.cpp:1068] Failed to accept socket: future discarded
make[4]: *** [check-local] Error 1
make[4]: Leaving directory `/mesos/mesos-1.5.0/_build/src'
make[3]: *** [check-am] Error 2
make[3]: Leaving directory `/mesos/mesos-1.5.0/_build/src'
make[2]: *** [check] Error 2
make[2]: Leaving directory `/mesos/mesos-1.5.0/_build/src'
make[1]: *** [check-recursive] Error 1
make[1]: Leaving directory `/mesos/mesos-1.5.0/_build'
make: *** [distcheck] Error 1
+ docker rmi mesos-1507855788-31506
Untagged: mesos-1507855788-31506:latest
Deleted: sha256:2a6cf9bd87cd5bfae54e9460be61acdac75b07c75f0594daed7500da60f8ff21
Deleted: sha256:e4d673db35158f99988577bf34294596d34fadf272514fd3bf6d919827508ee4
Deleted: sha256:064b8aa55df959b950a771f77307276ece66c1a51be20188c9d5c6a2d6af55b6
Deleted: sha256:da8ac328c3be834884b45ed76fa8d66bdcba404f73e5440e69329e6b42e761de
Deleted: sha256:2f7c6f8f1439d1da458394ec0bb0a703aab79204b3ce94d9b22f9547990b5e79
Deleted: sha256:2b086b61aaa8433ca3162559aebb61b5314c6d48217128b2a45abc9edf1797f4
Deleted: sha256:6d4679cb862d3d193f788de778d009c1ea64386b788508c94d829f6849daa4f9
Deleted: sha256:15a837a685a02eadcf3587004ee6e08c13dc14a36e1531ff6d062e527e10a691
Deleted: sha256:ba7ffb6d7fdcc06477e30bfb2173c88f43bb5ea3bd60c98a26b6cdcf1381c9ea
Deleted: sha256:cd94b970c70a8f646a1b071b7c0f505b444b6bf5a53e1d54fb4a69969a77f165
Deleted: sha256:7b249c84a7440402e52bee25be830bd842eb82f315dd336cc6b5f53d366b7317
Deleted: sha256:2f15c79bfc39c0a2df1eee1a6866838a6eadfaf5ebc23173cf513763fa6b6fce
Deleted: sha256:f9452022b9c9bff8e09bd6cfd1cfacbd2dad38b1a96387c711feb43938fbf9e0
Deleted: sha256:696b3e725fa15a52e7eadbbe32ff542b0aac764016b4fef572730e9a09ff734c
Deleted: sha256:1ce76a19b0f4f79922c30eae54e3bc16e31f84192558b1f4dca9bf2b6456e4db
Deleted: sha256:ddd005a8dcf9060fc484c3a252e0f6d1556cdd2e03ae3a95140d980a6026911f
Deleted: sha256:683890f4591ee20fd4800617a599446536e04966ac25cdb58bf8bf4f15ca1928
Deleted: sha256:6c96aa52975a77e00b24b7a2375ee80171fc565eaa61e7ade3ce2f82dd17bae9
Deleted: sha256:cedba2f5504a35b889dda97c5065be54b3adb04cde5ac79056e41ba5927c3960
Deleted: sha256:847a57e9de86c3f07e2c23f805c6b0c7a33b6413e57126a06a8d7a4796db03b1
Deleted: sha256:e6044e38347785f05cf6e0fb8dac8dafd4a1871fec75bb45a9dcc069d187d722
Deleted: sha256:562fbab6d0750ee22b64b432e70a877b8ca3bd31e6640fa4e4e9e2d15c786fed
Deleted: sha256:e7845eddd383b149018433917436f8f09520e4776664894adec709a98982f3d5
Deleted: sha256:84268eb4a28c9acec40d689641ccab01e721e1cc8aba7c74d76d134b6ffb5fb5
Deleted: sha256:6b717d2c4268f9fb2f1e6511a5ca3b7ab2edecd9e0933c4a9b01514a12eb062b
Deleted: sha256:92cf21accbd6fe18711cc28e2ed962d7b72e5cfc42d70e2b07aff1a9a28a91bb
Deleted: sha256:a4e2e0271fad73e1a9f2f9088fa275bd272a8bcbfddc0d60a605dd77136f39ce
Deleted: sha256:b457ea8dd34a851f393f83e0201df0ebcc846734d7d9d54250c57f4df05fa74f
Deleted: sha256:bb57bade19ad7f1a0f8f8bbbc2f8fe2710e975e20880c315859b948ec1aa959c
Build step 'Execute shell' marked build as failure


Mime
View raw message