mesos-builds mailing list archives

Site index · List index
Message view « Date » · « Thread »
Top « Date » · « Thread »
From Apache Jenkins Server <jenk...@builds.apache.org>
Subject Build failed in Jenkins: Mesos-Reviewbot #19729
Date Mon, 09 Oct 2017 21:37:29 GMT
See <https://builds.apache.org/job/Mesos-Reviewbot/19729/display/redirect>

------------------------------------------
[...truncated 32.23 MB...]
I1009 21:37:24.510430  5593 credentials.hpp:37] Loading credentials for authentication from
'/tmp/Endpoint_SlaveEndpointTest_AuthorizedRequest_2_iTQ9XE/http_credentials'
I1009 21:37:24.510644  5593 http.cpp:1045] Creating default 'basic' HTTP authenticator for
realm 'mesos-agent-readonly'
I1009 21:37:24.510804  5593 http.cpp:1045] Creating default 'basic' HTTP authenticator for
realm 'mesos-agent-readwrite'
I1009 21:37:24.512329  5593 slave.cpp:585] Agent resources: [{"name":"cpus","scalar":{"value":2.0},"type":"SCALAR"},{"name":"mem","scalar":{"value":1024.0},"type":"SCALAR"},{"name":"disk","scalar":{"value":1024.0},"type":"SCALAR"},{"name":"ports","ranges":{"range":[{"begin":31000,"end":32000}]},"type":"RANGES"}]
I1009 21:37:24.512593  5593 slave.cpp:593] Agent attributes: [  ]
I1009 21:37:24.512606  5593 slave.cpp:602] Agent hostname: e0956ba4e7b0
I1009 21:37:24.512792  5581 status_update_manager.cpp:177] Pausing sending status updates
I1009 21:37:24.514211  5598 state.cpp:64] Recovering state from '/tmp/Endpoint_SlaveEndpointTest_AuthorizedRequest_2_wMAfr2/meta'
I1009 21:37:24.514536  5578 status_update_manager.cpp:203] Recovering status update manager
I1009 21:37:24.514784  5597 containerizer.cpp:648] Recovering containerizer
I1009 21:37:24.515991  5591 provisioner.cpp:416] Provisioner recovery complete
I1009 21:37:24.516314  5587 slave.cpp:6326] Finished recovery
I1009 21:37:24.516780  5587 slave.cpp:6512] Querying resource estimator for oversubscribable
resources
I1009 21:37:24.517011  5579 slave.cpp:6526] Received oversubscribable resources {} from the
resource estimator
I1009 21:37:24.520428  5596 process.cpp:3929] Handling HTTP event for process 'slave(822)'
with path: '/slave(822)/containers'
I1009 21:37:24.521735  5585 http.cpp:1185] HTTP GET for /slave(822)/containers from 172.17.0.4:40704
I1009 21:37:24.521806  5585 http.cpp:976] Authorizing principal 'test-principal' to GET the
'/containers' endpoint
I1009 21:37:24.525737  5594 slave.cpp:869] Agent terminating
[       OK ] Endpoint/SlaveEndpointTest.AuthorizedRequest/2 (34 ms)
[ RUN      ] Endpoint/SlaveEndpointTest.UnauthorizedRequest/0
I1009 21:37:24.536272  5576 containerizer.cpp:292] Using isolation { environment_secret, posix/cpu,
posix/mem, filesystem/posix, network/cni }
W1009 21:37:24.536707  5576 backend.cpp:76] Failed to create 'aufs' backend: AufsBackend requires
root privileges
W1009 21:37:24.536815  5576 backend.cpp:76] Failed to create 'bind' backend: BindBackend requires
root privileges
I1009 21:37:24.536847  5576 provisioner.cpp:255] Using default backend 'copy'
I1009 21:37:24.540145  5596 slave.cpp:254] Mesos agent started on (823)@172.17.0.4:45520
I1009 21:37:24.540175  5596 slave.cpp:255] Flags at startup: --acls="" --appc_simple_discovery_uri_prefix="http://"
--appc_store_dir="/tmp/Endpoint_SlaveEndpointTest_UnauthorizedRequest_0_EPhTm9/store/appc"
--authenticate_http_readonly="true" --authenticate_http_readwrite="true" --authenticatee="crammd5"
--authentication_backoff_factor="1secs" --authorizer="local" --cgroups_cpu_enable_pids_and_tids_count="false"
--cgroups_enable_cfs="false" --cgroups_hierarchy="/sys/fs/cgroup" --cgroups_limit_swap="false"
--cgroups_root="mesos" --container_disk_watch_interval="15secs" --containerizers="mesos" --credential="/tmp/Endpoint_SlaveEndpointTest_UnauthorizedRequest_0_EPhTm9/credential"
--default_role="*" --disallow_sharing_agent_pid_namespace="false" --disk_watch_interval="1mins"
--docker="docker" --docker_kill_orphans="true" --docker_registry="https://registry-1.docker.io"
--docker_remove_delay="6hrs" --docker_socket="/var/run/docker.sock" --docker_stop_timeout="0ns"
--docker_store_dir="/tmp/Endpoint_SlaveEndpointTest_UnauthorizedRequest_0_EPhTm9/store/docker"
--docker_volume_checkpoint_dir="/var/run/mesos/isolators/docker/volume" --enforce_container_disk_quota="false"
--executor_registration_timeout="1mins" --executor_reregistration_timeout="2secs" --executor_shutdown_grace_period="5secs"
--fetcher_cache_dir="/tmp/Endpoint_SlaveEndpointTest_UnauthorizedRequest_0_EPhTm9/fetch" --fetcher_cache_size="2GB"
--frameworks_home="" --gc_delay="1weeks" --gc_disk_headroom="0.1" --hadoop_home="" --help="false"
--hostname_lookup="true" --http_command_executor="false" --http_credentials="/tmp/Endpoint_SlaveEndpointTest_UnauthorizedRequest_0_EPhTm9/http_credentials"
--http_heartbeat_interval="30secs" --initialize_driver_logging="true" --isolation="posix/cpu,posix/mem"
--launcher="posix" --launcher_dir="/mesos/mesos-1.5.0/_build/src" --logbufsecs="0" --logging_level="INFO"
--max_completed_executors_per_framework="150" --oversubscribed_resources_interval="15secs"
--perf_duration="10secs" --perf_interval="1mins" --port="5051" --qos_correction_interval_min="0ns"
--quiet="false" --recover="reconnect" --recovery_timeout="15mins" --registration_backoff_factor="10ms"
--resources="cpus:2;gpus:0;mem:1024;disk:1024;ports:[31000-32000]" --revocable_cpu_low_priority="true"
--runtime_dir="/tmp/Endpoint_SlaveEndpointTest_UnauthorizedRequest_0_EPhTm9" --sandbox_directory="/mnt/mesos/sandbox"
--strict="true" --switch_user="true" --systemd_enable_support="true" --systemd_runtime_directory="/run/systemd/system"
--version="false" --work_dir="/tmp/Endpoint_SlaveEndpointTest_UnauthorizedRequest_0_CEwZKw"
--zk_session_timeout="10secs"
I1009 21:37:24.540773  5596 credentials.hpp:86] Loading credential for authentication from
'/tmp/Endpoint_SlaveEndpointTest_UnauthorizedRequest_0_EPhTm9/credential'
I1009 21:37:24.540964  5596 slave.cpp:287] Agent using credential for: test-principal
I1009 21:37:24.540997  5596 credentials.hpp:37] Loading credentials for authentication from
'/tmp/Endpoint_SlaveEndpointTest_UnauthorizedRequest_0_EPhTm9/http_credentials'
I1009 21:37:24.541326  5596 http.cpp:1045] Creating default 'basic' HTTP authenticator for
realm 'mesos-agent-readonly'
I1009 21:37:24.541502  5596 http.cpp:1045] Creating default 'basic' HTTP authenticator for
realm 'mesos-agent-readwrite'
I1009 21:37:24.542827  5596 slave.cpp:585] Agent resources: [{"name":"cpus","scalar":{"value":2.0},"type":"SCALAR"},{"name":"mem","scalar":{"value":1024.0},"type":"SCALAR"},{"name":"disk","scalar":{"value":1024.0},"type":"SCALAR"},{"name":"ports","ranges":{"range":[{"begin":31000,"end":32000}]},"type":"RANGES"}]
I1009 21:37:24.543051  5596 slave.cpp:593] Agent attributes: [  ]
I1009 21:37:24.543063  5596 slave.cpp:602] Agent hostname: e0956ba4e7b0
I1009 21:37:24.543213  5577 status_update_manager.cpp:177] Pausing sending status updates
I1009 21:37:24.544476  5595 state.cpp:64] Recovering state from '/tmp/Endpoint_SlaveEndpointTest_UnauthorizedRequest_0_CEwZKw/meta'
I1009 21:37:24.544736  5597 status_update_manager.cpp:203] Recovering status update manager
I1009 21:37:24.544945  5580 containerizer.cpp:648] Recovering containerizer
I1009 21:37:24.546119  5585 provisioner.cpp:416] Provisioner recovery complete
I1009 21:37:24.546420  5577 slave.cpp:6326] Finished recovery
I1009 21:37:24.546885  5577 slave.cpp:6512] Querying resource estimator for oversubscribable
resources
I1009 21:37:24.547117  5578 slave.cpp:6526] Received oversubscribable resources {} from the
resource estimator
I1009 21:37:24.549229  5581 process.cpp:3929] Handling HTTP event for process 'slave(823)'
with path: '/slave(823)/monitor/statistics'
I1009 21:37:24.550308  5600 http.cpp:1185] HTTP GET for /slave(823)/monitor/statistics from
172.17.0.4:40706
I1009 21:37:24.550385  5600 http.cpp:976] Authorizing principal 'test-principal' to GET the
'/monitor/statistics' endpoint
I1009 21:37:24.552220  5600 slave.cpp:869] Agent terminating
[       OK ] Endpoint/SlaveEndpointTest.UnauthorizedRequest/0 (26 ms)
[ RUN      ] Endpoint/SlaveEndpointTest.UnauthorizedRequest/1
I1009 21:37:24.562600  5576 containerizer.cpp:292] Using isolation { environment_secret, posix/cpu,
posix/mem, filesystem/posix, network/cni }
W1009 21:37:24.563032  5576 backend.cpp:76] Failed to create 'aufs' backend: AufsBackend requires
root privileges
W1009 21:37:24.563138  5576 backend.cpp:76] Failed to create 'bind' backend: BindBackend requires
root privileges
I1009 21:37:24.563169  5576 provisioner.cpp:255] Using default backend 'copy'
I1009 21:37:24.566519  5599 slave.cpp:254] Mesos agent started on (824)@172.17.0.4:45520
I1009 21:37:24.566547  5599 slave.cpp:255] Flags at startup: --acls="" --appc_simple_discovery_uri_prefix="http://"
--appc_store_dir="/tmp/Endpoint_SlaveEndpointTest_UnauthorizedRequest_1_cKQR1D/store/appc"
--authenticate_http_readonly="true" --authenticate_http_readwrite="true" --authenticatee="crammd5"
--authentication_backoff_factor="1secs" --authorizer="local" --cgroups_cpu_enable_pids_and_tids_count="false"
--cgroups_enable_cfs="false" --cgroups_hierarchy="/sys/fs/cgroup" --cgroups_limit_swap="false"
--cgroups_root="mesos" --container_disk_watch_interval="15secs" --containerizers="mesos" --credential="/tmp/Endpoint_SlaveEndpointTest_UnauthorizedRequest_1_cKQR1D/credential"
--default_role="*" --disallow_sharing_agent_pid_namespace="false" --disk_watch_interval="1mins"
--docker="docker" --docker_kill_orphans="true" --docker_registry="https://registry-1.docker.io"
--docker_remove_delay="6hrs" --docker_socket="/var/run/docker.sock" --docker_stop_timeout="0ns"
--docker_store_dir="/tmp/Endpoint_SlaveEndpointTest_UnauthorizedRequest_1_cKQR1D/store/docker"
--docker_volume_checkpoint_dir="/var/run/mesos/isolators/docker/volume" --enforce_container_disk_quota="false"
--executor_registration_timeout="1mins" --executor_reregistration_timeout="2secs" --executor_shutdown_grace_period="5secs"
--fetcher_cache_dir="/tmp/Endpoint_SlaveEndpointTest_UnauthorizedRequest_1_cKQR1D/fetch" --fetcher_cache_size="2GB"
--frameworks_home="" --gc_delay="1weeks" --gc_disk_headroom="0.1" --hadoop_home="" --help="false"
--hostname_lookup="true" --http_command_executor="false" --http_credentials="/tmp/Endpoint_SlaveEndpointTest_UnauthorizedRequest_1_cKQR1D/http_credentials"
--http_heartbeat_interval="30secs" --initialize_driver_logging="true" --isolation="posix/cpu,posix/mem"
--launcher="posix" --launcher_dir="/mesos/mesos-1.5.0/_build/src" --logbufsecs="0" --logging_level="INFO"
--max_completed_executors_per_framework="150" --oversubscribed_resources_interval="15secs"
--perf_duration="10secs" --perf_interval="1mins" --port="5051" --qos_correction_interval_min="0ns"
--quiet="false" --recover="reconnect" --recovery_timeout="15mins" --registration_backoff_factor="10ms"
--resources="cpus:2;gpus:0;mem:1024;disk:1024;ports:[31000-32000]" --revocable_cpu_low_priority="true"
--runtime_dir="/tmp/Endpoint_SlaveEndpointTest_UnauthorizedRequest_1_cKQR1D" --sandbox_directory="/mnt/mesos/sandbox"
--strict="true" --switch_user="true" --systemd_enable_support="true" --systemd_runtime_directory="/run/systemd/system"
--version="false" --work_dir="/tmp/Endpoint_SlaveEndpointTest_UnauthorizedRequest_1_kUa3l1"
--zk_session_timeout="10secs"
I1009 21:37:24.567124  5599 credentials.hpp:86] Loading credential for authentication from
'/tmp/Endpoint_SlaveEndpointTest_UnauthorizedRequest_1_cKQR1D/credential'
I1009 21:37:24.567312  5599 slave.cpp:287] Agent using credential for: test-principal
I1009 21:37:24.567340  5599 credentials.hpp:37] Loading credentials for authentication from
'/tmp/Endpoint_SlaveEndpointTest_UnauthorizedRequest_1_cKQR1D/http_credentials'
I1009 21:37:24.567667  5599 http.cpp:1045] Creating default 'basic' HTTP authenticator for
realm 'mesos-agent-readonly'
I1009 21:37:24.567843  5599 http.cpp:1045] Creating default 'basic' HTTP authenticator for
realm 'mesos-agent-readwrite'
I1009 21:37:24.569135  5599 slave.cpp:585] Agent resources: [{"name":"cpus","scalar":{"value":2.0},"type":"SCALAR"},{"name":"mem","scalar":{"value":1024.0},"type":"SCALAR"},{"name":"disk","scalar":{"value":1024.0},"type":"SCALAR"},{"name":"ports","ranges":{"range":[{"begin":31000,"end":32000}]},"type":"RANGES"}]
I1009 21:37:24.569358  5599 slave.cpp:593] Agent attributes: [  ]
I1009 21:37:24.569372  5599 slave.cpp:602] Agent hostname: e0956ba4e7b0
I1009 21:37:24.569502  5591 status_update_manager.cpp:177] Pausing sending status updates
I1009 21:37:24.570714  5598 state.cpp:64] Recovering state from '/tmp/Endpoint_SlaveEndpointTest_UnauthorizedRequest_1_kUa3l1/meta'
I1009 21:37:24.570931  5598 status_update_manager.cpp:203] Recovering status update manager
I1009 21:37:24.571106  5595 containerizer.cpp:648] Recovering containerizer
I1009 21:37:24.572249  5583 provisioner.cpp:416] Provisioner recovery complete
I1009 21:37:24.572548  5591 slave.cpp:6326] Finished recovery
I1009 21:37:24.572978  5591 slave.cpp:6512] Querying resource estimator for oversubscribable
resources
I1009 21:37:24.573169  5600 slave.cpp:6526] Received oversubscribable resources {} from the
resource estimator
I1009 21:37:24.575232  5586 process.cpp:3929] Handling HTTP event for process 'slave(824)'
with path: '/slave(824)/monitor/statistics.json'
I1009 21:37:24.576310  5597 http.cpp:1185] HTTP GET for /slave(824)/monitor/statistics.json
from 172.17.0.4:40708
I1009 21:37:24.576375  5597 http.cpp:976] Authorizing principal 'test-principal' to GET the
'/monitor/statistics.json' endpoint
I1009 21:37:24.577848  5578 slave.cpp:869] Agent terminating
[       OK ] Endpoint/SlaveEndpointTest.UnauthorizedRequest/1 (26 ms)
[ RUN      ] Endpoint/SlaveEndpointTest.UnauthorizedRequest/2
I1009 21:37:24.588239  5576 containerizer.cpp:292] Using isolation { environment_secret, posix/cpu,
posix/mem, filesystem/posix, network/cni }
W1009 21:37:24.588671  5576 backend.cpp:76] Failed to create 'aufs' backend: AufsBackend requires
root privileges
W1009 21:37:24.588778  5576 backend.cpp:76] Failed to create 'bind' backend: BindBackend requires
root privileges
I1009 21:37:24.588809  5576 provisioner.cpp:255] Using default backend 'copy'
I1009 21:37:24.592180  5579 slave.cpp:254] Mesos agent started on (825)@172.17.0.4:45520
I1009 21:37:24.592200  5579 slave.cpp:255] Flags at startup: --acls="" --appc_simple_discovery_uri_prefix="http://"
--appc_store_dir="/tmp/Endpoint_SlaveEndpointTest_UnauthorizedRequest_2_EFQbW8/store/appc"
--authenticate_http_readonly="true" --authenticate_http_readwrite="true" --authenticatee="crammd5"
--authentication_backoff_factor="1secs" --authorizer="local" --cgroups_cpu_enable_pids_and_tids_count="false"
--cgroups_enable_cfs="false" --cgroups_hierarchy="/sys/fs/cgroup" --cgroups_limit_swap="false"
--cgroups_root="mesos" --container_disk_watch_interval="15secs" --containerizers="mesos" --credential="/tmp/Endpoint_SlaveEndpointTest_UnauthorizedRequest_2_EFQbW8/credential"
--default_role="*" --disallow_sharing_agent_pid_namespace="false" --disk_watch_interval="1mins"
--docker="docker" --docker_kill_orphans="true" --docker_registry="https://registry-1.docker.io"
--docker_remove_delay="6hrs" --docker_socket="/var/run/docker.sock" --docker_stop_timeout="0ns"
--docker_store_dir="/tmp/Endpoint_SlaveEndpointTest_UnauthorizedRequest_2_EFQbW8/store/docker"
--docker_volume_checkpoint_dir="/var/run/mesos/isolators/docker/volume" --enforce_container_disk_quota="false"
--executor_registration_timeout="1mins" --executor_reregistration_timeout="2secs" --executor_shutdown_grace_period="5secs"
--fetcher_cache_dir="/tmp/Endpoint_SlaveEndpointTest_UnauthorizedRequest_2_EFQbW8/fetch" --fetcher_cache_size="2GB"
--frameworks_home="" --gc_delay="1weeks" --gc_disk_headroom="0.1" --hadoop_home="" --help="false"
--hostname_lookup="true" --http_command_executor="false" --http_credentials="/tmp/Endpoint_SlaveEndpointTest_UnauthorizedRequest_2_EFQbW8/http_credentials"
--http_heartbeat_interval="30secs" --initialize_driver_logging="true" --isolation="posix/cpu,posix/mem"
--launcher="posix" --launcher_dir="/mesos/mesos-1.5.0/_build/src" --logbufsecs="0" --logging_level="INFO"
--max_completed_executors_per_framework="150" --oversubscribed_resources_interval="15secs"
--perf_duration="10secs" --perf_interval="1mins" --port="5051" --qos_correction_interval_min="0ns"
--quiet="false" --recover="reconnect" --recovery_timeout="15mins" --registration_backoff_factor="10ms"
--resources="cpus:2;gpus:0;mem:1024;disk:1024;ports:[31000-32000]" --revocable_cpu_low_priority="true"
--runtime_dir="/tmp/Endpoint_SlaveEndpointTest_UnauthorizedRequest_2_EFQbW8" --sandbox_directory="/mnt/mesos/sandbox"
--strict="true" --switch_user="true" --systemd_enable_support="true" --systemd_runtime_directory="/run/systemd/system"
--version="false" --work_dir="/tmp/Endpoint_SlaveEndpointTest_UnauthorizedRequest_2_uUtycw"
--zk_session_timeout="10secs"
I1009 21:37:24.592559  5579 credentials.hpp:86] Loading credential for authentication from
'/tmp/Endpoint_SlaveEndpointTest_UnauthorizedRequest_2_EFQbW8/credential'
I1009 21:37:24.592700  5579 slave.cpp:287] Agent using credential for: test-principal
I1009 21:37:24.592720  5579 credentials.hpp:37] Loading credentials for authentication from
'/tmp/Endpoint_SlaveEndpointTest_UnauthorizedRequest_2_EFQbW8/http_credentials'
I1009 21:37:24.592939  5579 http.cpp:1045] Creating default 'basic' HTTP authenticator for
realm 'mesos-agent-readonly'
I1009 21:37:24.593083  5579 http.cpp:1045] Creating default 'basic' HTTP authenticator for
realm 'mesos-agent-readwrite'
I1009 21:37:24.594388  5579 slave.cpp:585] Agent resources: [{"name":"cpus","scalar":{"value":2.0},"type":"SCALAR"},{"name":"mem","scalar":{"value":1024.0},"type":"SCALAR"},{"name":"disk","scalar":{"value":1024.0},"type":"SCALAR"},{"name":"ports","ranges":{"range":[{"begin":31000,"end":32000}]},"type":"RANGES"}]
I1009 21:37:24.594609  5579 slave.cpp:593] Agent attributes: [  ]
I1009 21:37:24.594621  5579 slave.cpp:602] Agent hostname: e0956ba4e7b0
I1009 21:37:24.594743  5598 status_update_manager.cpp:177] Pausing sending status updates
I1009 21:37:24.595978  5578 state.cpp:64] Recovering state from '/tmp/Endpoint_SlaveEndpointTest_UnauthorizedRequest_2_uUtycw/meta'
I1009 21:37:24.596247  5597 status_update_manager.cpp:203] Recovering status update manager
I1009 21:37:24.596452  5582 containerizer.cpp:648] Recovering containerizer
I1009 21:37:24.597548  5589 provisioner.cpp:416] Provisioner recovery complete
I1009 21:37:24.597852  5584 slave.cpp:6326] Finished recovery
I1009 21:37:24.598304  5584 slave.cpp:6512] Querying resource estimator for oversubscribable
resources
I1009 21:37:24.598547  5586 slave.cpp:6526] Received oversubscribable resources {} from the
resource estimator
I1009 21:37:24.600649  5593 process.cpp:3929] Handling HTTP event for process 'slave(825)'
with path: '/slave(825)/containers'
I1009 21:37:24.601747  5596 http.cpp:1185] HTTP GET for /slave(825)/containers from 172.17.0.4:40710
I1009 21:37:24.601810  5596 http.cpp:976] Authorizing principal 'test-principal' to GET the
'/containers' endpoint
I1009 21:37:24.603479  5576 slave.cpp:869] Agent terminating
[       OK ] Endpoint/SlaveEndpointTest.UnauthorizedRequest/2 (25 ms)
[ RUN      ] Endpoint/SlaveEndpointTest.NoAuthorizer/0
I1009 21:37:24.613648  5576 containerizer.cpp:292] Using isolation { environment_secret, posix/cpu,
posix/mem, filesystem/posix, network/cni }
W1009 21:37:24.614114  5576 backend.cpp:76] Failed to create 'aufs' backend: AufsBackend requires
root privileges
W1009 21:37:24.614231  5576 backend.cpp:76] Failed to create 'bind' backend: BindBackend requires
root privileges
I1009 21:37:24.614264  5576 provisioner.cpp:255] Using default backend 'copy'
I1009 21:37:24.615857  5576 cluster.cpp:448] Creating default 'local' authorizer
I1009 21:37:24.617789  5585 slave.cpp:254] Mesos agent started on (826)@172.17.0.4:45520
I1009 21:37:24.617810  5585 slave.cpp:255] Flags at startup: --acls="" --appc_simple_discovery_uri_prefix="http://"
--appc_store_dir="/tmp/Endpoint_SlaveEndpointTest_NoAuthorizer_0_QIvt5D/store/appc" --authenticate_http_readonly="true"
--authenticate_http_readwrite="true" --authenticatee="crammd5" --authentication_backoff_factor="1secs"
--authorizer="local" --cgroups_cpu_enable_pids_and_tids_count="false" --cgroups_enable_cfs="false"
--cgroups_hierarchy="/sys/fs/cgroup" --cgroups_limit_swap="false" --cgroups_root="mesos" --container_disk_watch_interval="15secs"
--containerizers="mesos" --credential="/tmp/Endpoint_SlaveEndpointTest_NoAuthorizer_0_QIvt5D/credential"
--default_role="*" --disallow_sharing_agent_pid_namespace="false" --disk_watch_interval="1mins"
--docker="docker" --docker_kill_orphans="true" --docker_registry="https://registry-1.docker.io"
--docker_remove_delay="6hrs" --docker_socket="/var/run/docker.sock" --docker_stop_timeout="0ns"
--docker_store_dir="/tmp/Endpoint_SlaveEndpointTest_NoAuthorizer_0_QIvt5D/store/docker" --docker_volume_checkpoint_dir="/var/run/mesos/isolators/docker/volume"
--enforce_container_disk_quota="false" --executor_registration_timeout="1mins" --executor_reregistration_timeout="2secs"
--executor_shutdown_grace_period="5secs" --fetcher_cache_dir="/tmp/Endpoint_SlaveEndpointTest_NoAuthorizer_0_QIvt5D/fetch"
--fetcher_cache_size="2GB" --frameworks_home="" --gc_delay="1weeks" --gc_disk_headroom="0.1"
--hadoop_home="" --help="false" --hostname_lookup="true" --http_command_executor="false" --http_credentials="/tmp/Endpoint_SlaveEndpointTest_NoAuthorizer_0_QIvt5D/http_credentials"
--http_heartbeat_interval="30secs" --initialize_driver_logging="true" --isolation="posix/cpu,posix/mem"
--launcher="posix" --launcher_dir="/mesos/mesos-1.5.0/_build/src" --logbufsecs="0" --logging_level="INFO"
--max_completed_executors_per_framework="150" --oversubscribed_resources_interval="15secs"
--perf_duration="10secs" --perf_interval="1mins" --port="5051" --qos_correction_interval_min="0ns"
--quiet="false" --recover="reconnect" --recovery_timeout="15mins" --registration_backoff_factor="10ms"
--resources="cpus:2;gpus:0;mem:1024;disk:1024;ports:[31000-32000]" --revocable_cpu_low_priority="true"
--runtime_dir="/tmp/Endpoint_SlaveEndpointTest_NoAuthorizer_0_QIvt5D" --sandbox_directory="/mnt/mesos/sandbox"
--strict="true" --switch_user="true" --systemd_enable_support="true" --systemd_runtime_directory="/run/systemd/system"
--version="false" --work_dir="/tmp/Endpoint_SlaveEndpointTest_NoAuthorizer_0_gFN6h1" --zk_session_timeout="10secs"
I1009 21:37:24.618192  5585 credentials.hpp:86] Loading credential for authentication from
'/tmp/Endpoint_SlaveEndpointTest_NoAuthorizer_0_QIvt5D/credential'
I1009 21:37:24.618342  5585 slave.cpp:287] Agent using credential for: test-principal
I1009 21:37:24.618386  5585 credentials.hpp:37] Loading credentials for authentication from
'/tmp/Endpoint_SlaveEndpointTest_NoAuthorizer_0_QIvt5D/http_credentials'
I1009 21:37:24.618644  5585 http.cpp:1045] Creating default 'basic' HTTP authenticator for
realm 'mesos-agent-readonly'
I1009 21:37:24.618814  5585 http.cpp:1045] Creating default 'basic' HTTP authenticator for
realm 'mesos-agent-readwrite'
I1009 21:37:24.620131  5585 slave.cpp:585] Agent resources: [{"name":"cpus","scalar":{"value":2.0},"type":"SCALAR"},{"name":"mem","scalar":{"value":1024.0},"type":"SCALAR"},{"name":"disk","scalar":{"value":1024.0},"type":"SCALAR"},{"name":"ports","ranges":{"range":[{"begin":31000,"end":32000}]},"type":"RANGES"}]
I1009 21:37:24.620355  5585 slave.cpp:593] Agent attributes: [  ]
I1009 21:37:24.620375  5585 slave.cpp:602] Agent hostname: e0956ba4e7b0
I1009 21:37:24.620496  5589 status_update_manager.cpp:177] Pausing sending status updates
I1009 21:37:24.621960  5593 state.cpp:64] Recovering state from '/tmp/Endpoint_SlaveEndpointTest_NoAuthorizer_0_gFN6h1/meta'
I1009 21:37:24.622191  5598 status_update_manager.cpp:203] Recovering status update manager
I1009 21:37:24.622400  5579 containerizer.cpp:648] Recovering containerizer
I1009 21:37:24.623584  5592 provisioner.cpp:416] Provisioner recovery complete
I1009 21:37:24.623889  5589 slave.cpp:6326] Finished recovery
I1009 21:37:24.624300  5589 slave.cpp:6512] Querying resource estimator for oversubscribable
resources
I1009 21:37:24.624490  5577 slave.cpp:6526] Received oversubscribable resources {} from the
resource estimator
I1009 21:37:24.626543  5584 process.cpp:3929] Handling HTTP event for process 'slave(826)'
with path: '/slave(826)/monitor/statistics'
I1009 21:37:24.627670  5588 http.cpp:1185] HTTP GET for /slave(826)/monitor/statistics from
172.17.0.4:40712
I1009 21:37:24.627735  5588 http.cpp:976] Authorizing principal 'test-principal' to GET the
'/monitor/statistics' endpoint
I1009 21:37:24.630533  5576 slave.cpp:869] Agent terminating
[       OK ] Endpoint/SlaveEndpointTest.NoAuthorizer/0 (28 ms)
[ RUN      ] Endpoint/SlaveEndpointTest.NoAuthorizer/1
I1009 21:37:24.645226  5576 containerizer.cpp:292] Using isolation { environment_secret, posix/cpu,
posix/mem, filesystem/posix, network/cni }
W1009 21:37:24.645828  5576 backend.cpp:76] Failed to create 'aufs' backend: AufsBackend requires
root privileges
W1009 21:37:24.646019  5576 backend.cpp:76] Failed to create 'bind' backend: BindBackend requires
root privileges
I1009 21:37:24.646049  5576 provisioner.cpp:255] Using default backend 'copy'
I1009 21:37:24.648083  5576 cluster.cpp:448] Creating default 'local' authorizer
I1009 21:37:24.650252  5584 slave.cpp:254] Mesos agent started on (827)@172.17.0.4:45520
I1009 21:37:24.650276  5584 slave.cpp:255] Flags at startup: --acls="" --appc_simple_discovery_uri_prefix="http://"
--appc_store_dir="/tmp/Endpoint_SlaveEndpointTest_NoAuthorizer_1_Lf4Lv9/store/appc" --authenticate_http_readonly="true"
--authenticate_http_readwrite="true" --authenticatee="crammd5" --authentication_backoff_factor="1secs"
--authorizer="local" --cgroups_cpu_enable_pids_and_tids_count="false" --cgroups_enable_cfs="false"
--cgroups_hierarchy="/sys/fs/cgroup" --cgroups_limit_swap="false" --cgroups_root="mesos" --container_disk_watch_interval="15secs"
--containerizers="mesos" --credential="/tmp/Endpoint_SlaveEndpointTest_NoAuthorizer_1_Lf4Lv9/credential"
--default_role="*" --disallow_sharing_agent_pid_namespace="false" --disk_watch_interval="1mins"
--docker="docker" --docker_kill_orphans="true" --docker_registry="https://registry-1.docker.io"
--docker_remove_delay="6hrs" --docker_socket="/var/run/docker.sock" --docker_stop_timeout="0ns"
--docker_store_dir="/tmp/Endpoint_SlaveEndpointTest_NoAuthorizer_1_Lf4Lv9/store/docker" --docker_volume_checkpoint_dir="/var/run/mesos/isolators/docker/volume"
--enforce_container_disk_quota="false" --executor_registration_timeout="1mins" --executor_reregistration_timeout="2secs"
--executor_shutdown_grace_period="5secs" --fetcher_cache_dir="/tmp/Endpoint_SlaveEndpointTest_NoAuthorizer_1_Lf4Lv9/fetch"
--fetcher_cache_size="2GB" --frameworks_home="" --gc_delay="1weeks" --gc_disk_headroom="0.1"
--hadoop_home="" --help="false" --hostname_lookup="true" --http_command_executor="false" --http_credentials="/tmp/Endpoint_SlaveEndpointTest_NoAuthorizer_1_Lf4Lv9/http_credentials"
--http_heartbeat_interval="30secs" --initialize_driver_logging="true" --isolation="posix/cpu,posix/mem"
--launcher="posix" --launcher_dir="/mesos/mesos-1.5.0/_build/src" --logbufsecs="0" --logging_level="INFO"
--max_completed_executors_per_framework="150" --oversubscribed_resources_interval="15secs"
--perf_duration="10secs" --perf_interval="1mins" --port="5051" --qos_correction_interval_min="0ns"
--quiet="false" --recover="reconnect" --recovery_timeout="15mins" --registration_backoff_factor="10ms"
--resources="cpus:2;gpus:0;mem:1024;disk:1024;ports:[31000-32000]" --revocable_cpu_low_priority="true"
--runtime_dir="/tmp/Endpoint_SlaveEndpointTest_NoAuthorizer_1_Lf4Lv9" --sandbox_directory="/mnt/mesos/sandbox"
--strict="true" --switch_user="true" --systemd_enable_support="true" --systemd_runtime_directory="/run/systemd/system"
--version="false" --work_dir="/tmp/Endpoint_SlaveEndpointTest_NoAuthorizer_1_ElqXDw" --zk_session_timeout="10secs"
I1009 21:37:24.650681  5584 credentials.hpp:86] Loading credential for authentication from
'/tmp/Endpoint_SlaveEndpointTest_NoAuthorizer_1_Lf4Lv9/credential'
I1009 21:37:24.650830  5584 slave.cpp:287] Agent using credential for: test-principal
I1009 21:37:24.650857  5584 credentials.hpp:37] Loading credentials for authentication from
'/tmp/Endpoint_SlaveEndpointTest_NoAuthorizer_1_Lf4Lv9/http_credentials'
I1009 21:37:24.651127  5584 http.cpp:1045] Creating default 'basic' HTTP authenticator for
realm 'mesos-agent-readonly'
I1009 21:37:24.651288  5584 http.cpp:1045] Creating default 'basic' HTTP authenticator for
realm 'mesos-agent-readwrite'
I1009 21:37:24.652662  5584 slave.cpp:585] Agent resources: [{"name":"cpus","scalar":{"value":2.0},"type":"SCALAR"},{"name":"mem","scalar":{"value":1024.0},"type":"SCALAR"},{"name":"disk","scalar":{"value":1024.0},"type":"SCALAR"},{"name":"ports","ranges":{"range":[{"begin":31000,"end":32000}]},"type":"RANGES"}]
I1009 21:37:24.652921  5584 slave.cpp:593] Agent attributes: [  ]
I1009 21:37:24.652933  5584 slave.cpp:602] Agent hostname: e0956ba4e7b0
I1009 21:37:24.653082  5594 status_update_manager.cpp:177] Pausing sending status updates
I1009 21:37:24.654420  5600 state.cpp:64] Recovering state from '/tmp/Endpoint_SlaveEndpointTest_NoAuthorizer_1_ElqXDw/meta'
I1009 21:37:24.654827  5593 status_update_manager.cpp:203] Recovering status update manager
I1009 21:37:24.655012  5598 containerizer.cpp:648] Recovering containerizer
I1009 21:37:24.656167  5597 provisioner.cpp:416] Provisioner recovery complete
I1009 21:37:24.656445  5594 slave.cpp:6326] Finished recovery
I1009 21:37:24.656891  5594 slave.cpp:6512] Querying resource estimator for oversubscribable
resources
I1009 21:37:24.657191  5577 slave.cpp:6526] Received oversubscribable resources {} from the
resource estimator
I1009 21:37:24.659329  5580 process.cpp:3929] Handling HTTP event for process 'slave(827)'
with path: '/slave(827)/monitor/statistics.json'
I1009 21:37:24.660503  5585 http.cpp:1185] HTTP GET for /slave(827)/monitor/statistics.json
from 172.17.0.4:40714
I1009 21:37:24.660573  5585 http.cpp:976] Authorizing principal 'test-principal' to GET the
'/monitor/statistics.json' endpoint
I1009 21:37:24.663811  5584 slave.cpp:869] Agent terminating
[       OK ] Endpoint/SlaveEndpointTest.NoAuthorizer/1 (31 ms)
[ RUN      ] Endpoint/SlaveEndpointTest.NoAuthorizer/2
I1009 21:37:24.674283  5576 containerizer.cpp:292] Using isolation { environment_secret, posix/cpu,
posix/mem, filesystem/posix, network/cni }
W1009 21:37:24.674744  5576 backend.cpp:76] Failed to create 'aufs' backend: AufsBackend requires
root privileges
W1009 21:37:24.674861  5576 backend.cpp:76] Failed to create 'bind' backend: BindBackend requires
root privileges
I1009 21:37:24.674892  5576 provisioner.cpp:255] Using default backend 'copy'
I1009 21:37:24.676460  5576 cluster.cpp:448] Creating default 'local' authorizer
I1009 21:37:24.678315  5580 slave.cpp:254] Mesos agent started on (828)@172.17.0.4:45520
I1009 21:37:24.678338  5580 slave.cpp:255] Flags at startup: --acls="" --appc_simple_discovery_uri_prefix="http://"
--appc_store_dir="/tmp/Endpoint_SlaveEndpointTest_NoAuthorizer_2_dYpUeF/store/appc" --authenticate_http_readonly="true"
--authenticate_http_readwrite="true" --authenticatee="crammd5" --authentication_backoff_factor="1secs"
--authorizer="local" --cgroups_cpu_enable_pids_and_tids_count="false" --cgroups_enable_cfs="false"
--cgroups_hierarchy="/sys/fs/cgroup" --cgroups_limit_swap="false" --cgroups_root="mesos" --container_disk_watch_interval="15secs"
--containerizers="mesos" --credential="/tmp/Endpoint_SlaveEndpointTest_NoAuthorizer_2_dYpUeF/credential"
--default_role="*" --disallow_sharing_agent_pid_namespace="false" --disk_watch_interval="1mins"
--docker="docker" --docker_kill_orphans="true" --docker_registry="https://registry-1.docker.io"
--docker_remove_delay="6hrs" --docker_socket="/var/run/docker.sock" --docker_stop_timeout="0ns"
--docker_store_dir="/tmp/Endpoint_SlaveEndpointTest_NoAuthorizer_2_dYpUeF/store/docker" --docker_volume_checkpoint_dir="/var/run/mesos/isolators/docker/volume"
--enforce_container_disk_quota="false" --executor_registration_timeout="1mins" --executor_reregistration_timeout="2secs"
--executor_shutdown_grace_period="5secs" --fetcher_cache_dir="/tmp/Endpoint_SlaveEndpointTest_NoAuthorizer_2_dYpUeF/fetch"
--fetcher_cache_size="2GB" --frameworks_home="" --gc_delay="1weeks" --gc_disk_headroom="0.1"
--hadoop_home="" --help="false" --hostname_lookup="true" --http_command_executor="false" --http_credentials="/tmp/Endpoint_SlaveEndpointTest_NoAuthorizer_2_dYpUeF/http_credentials"
--http_heartbeat_interval="30secs" --initialize_driver_logging="true" --isolation="posix/cpu,posix/mem"
--launcher="posix" --launcher_dir="/mesos/mesos-1.5.0/_build/src" --logbufsecs="0" --logging_level="INFO"
--max_completed_executors_per_framework="150" --oversubscribed_resources_interval="15secs"
--perf_duration="10secs" --perf_interval="1mins" --port="5051" --qos_correction_interval_min="0ns"
--quiet="false" --recover="reconnect" --recovery_timeout="15mins" --registration_backoff_factor="10ms"
--resources="cpus:2;gpus:0;mem:1024;disk:1024;ports:[31000-32000]" --revocable_cpu_low_priority="true"
--runtime_dir="/tmp/Endpoint_SlaveEndpointTest_NoAuthorizer_2_dYpUeF" --sandbox_directory="/mnt/mesos/sandbox"
--strict="true" --switch_user="true" --systemd_enable_support="true" --systemd_runtime_directory="/run/systemd/system"
--version="false" --work_dir="/tmp/Endpoint_SlaveEndpointTest_NoAuthorizer_2_9x1ui2" --zk_session_timeout="10secs"
I1009 21:37:24.678741  5580 credentials.hpp:86] Loading credential for authentication from
'/tmp/Endpoint_SlaveEndpointTest_NoAuthorizer_2_dYpUeF/credential'
I1009 21:37:24.678880  5580 slave.cpp:287] Agent using credential for: test-principal
I1009 21:37:24.678901  5580 credentials.hpp:37] Loading credentials for authentication from
'/tmp/Endpoint_SlaveEndpointTest_NoAuthorizer_2_dYpUeF/http_credentials'
I1009 21:37:24.679158  5580 http.cpp:1045] Creating default 'basic' HTTP authenticator for
realm 'mesos-agent-readonly'
I1009 21:37:24.679318  5580 http.cpp:1045] Creating default 'basic' HTTP authenticator for
realm 'mesos-agent-readwrite'
I1009 21:37:24.680661  5580 slave.cpp:585] Agent resources: [{"name":"cpus","scalar":{"value":2.0},"type":"SCALAR"},{"name":"mem","scalar":{"value":1024.0},"type":"SCALAR"},{"name":"disk","scalar":{"value":1024.0},"type":"SCALAR"},{"name":"ports","ranges":{"range":[{"begin":31000,"end":32000}]},"type":"RANGES"}]
I1009 21:37:24.680881  5580 slave.cpp:593] Agent attributes: [  ]
I1009 21:37:24.680894  5580 slave.cpp:602] Agent hostname: e0956ba4e7b0
I1009 21:37:24.681020  5597 status_update_manager.cpp:177] Pausing sending status updates
I1009 21:37:24.682355  5595 state.cpp:64] Recovering state from '/tmp/Endpoint_SlaveEndpointTest_NoAuthorizer_2_9x1ui2/meta'
I1009 21:37:24.682641  5578 status_update_manager.cpp:203] Recovering status update manager
I1009 21:37:24.682819  5581 containerizer.cpp:648] Recovering containerizer
I1009 21:37:24.683914  5589 provisioner.cpp:416] Provisioner recovery complete
I1009 21:37:24.684188  5597 slave.cpp:6326] Finished recovery
I1009 21:37:24.684602  5597 slave.cpp:6512] Querying resource estimator for oversubscribable
resources
I1009 21:37:24.684833  5600 slave.cpp:6526] Received oversubscribable resources {} from the
resource estimator
I1009 21:37:24.686911  5583 process.cpp:3929] Handling HTTP event for process 'slave(828)'
with path: '/slave(828)/containers'
I1009 21:37:24.688007  5585 http.cpp:1185] HTTP GET for /slave(828)/containers from 172.17.0.4:40716
I1009 21:37:24.688071  5585 http.cpp:976] Authorizing principal 'test-principal' to GET the
'/containers' endpoint
I1009 21:37:24.691176  5576 slave.cpp:869] Agent terminating
[       OK ] Endpoint/SlaveEndpointTest.NoAuthorizer/2 (27 ms)
[----------] 9 tests from Endpoint/SlaveEndpointTest (275 ms total)

[----------] 2 tests from ContainerizerType/DefaultContainerDNSFlagTest
[ RUN      ] ContainerizerType/DefaultContainerDNSFlagTest.ValidateFlag/0
[       OK ] ContainerizerType/DefaultContainerDNSFlagTest.ValidateFlag/0 (9 ms)
[ RUN      ] ContainerizerType/DefaultContainerDNSFlagTest.ValidateFlag/1
[       OK ] ContainerizerType/DefaultContainerDNSFlagTest.ValidateFlag/1 (10 ms)
[----------] 2 tests from ContainerizerType/DefaultContainerDNSFlagTest (19 ms total)

[----------] Global test environment tear-down
[==========] 1688 tests from 185 test cases ran. (582584 ms total)
[  PASSED  ] 1687 tests.
[  FAILED  ] 1 test, listed below:
[  FAILED  ] ExamplesTest.TestHTTPFramework

 1 FAILED TEST
  YOU HAVE 21 DISABLED TESTS

I1009 21:37:24.774408  5601 process.cpp:1068] Failed to accept socket: future discarded
make[4]: *** [check-local] Error 1
make[4]: Leaving directory `/mesos/mesos-1.5.0/_build/src'
make[3]: *** [check-am] Error 2
make[3]: Leaving directory `/mesos/mesos-1.5.0/_build/src'
make[2]: *** [check] Error 2
make[2]: Leaving directory `/mesos/mesos-1.5.0/_build/src'
make[1]: *** [check-recursive] Error 1
make[1]: Leaving directory `/mesos/mesos-1.5.0/_build'
make: *** [distcheck] Error 1
+ docker rmi mesos-1507581695-20555
Untagged: mesos-1507581695-20555:latest
Deleted: sha256:3f22e646625784c94a012f0c5d7d39f74a6948bdc765f4a94b5426e60858e3f7
Deleted: sha256:3382b996282689c32f153299cad604fc7fd23d06f2c29a7a699ea91b71e1315c
Deleted: sha256:c536de9558f645cc744e65c47aa3a1558953815a276e898783f7d11237992e43
Deleted: sha256:2d5d39b347077fb92b09bdb94cb06088ba975ee2da404fd7db77cc22d77b43ba
Deleted: sha256:e37f59530930720717f3a320c8b5044875d91090972d5d040f26da04121e6b83
Deleted: sha256:d9eb1e6ef14f4664008fc32b0d255de1f4793eaf1b465811b1102ef62f59baaa
Deleted: sha256:7a7992e2c768034eb9ab55a964eb18d9550c7c57ddc6c8647b5287e837a5edad
Deleted: sha256:9ced6e02a1bd34c2751d27fb7e31eafe408ba9401a829c8815901ec6f50fb863
Deleted: sha256:59b089cf8f140f8a8f072188f44b9762f4dd780d03cfd0cb251a7581c0235b92
Deleted: sha256:abc01a237b6ac0439ffcc6cbc70df507a38c3d32984784b0eb9582b6da140ad6
Deleted: sha256:8367d7f146bf4beaa66f5b1b4bfb7384e9ab9696e12f56026a1d20d0bcf4d0de
Deleted: sha256:d5f49c8ab5f192f6c02bbf097850f47ed5db754c614376830f9f922c830fb1b3
Deleted: sha256:b9328d9b02a70636b43dffdf9e4b97a241b6bbbf227a080ede1c067520aa86ba
Deleted: sha256:0ccd60f65aa3e6ad83a4388e052d28e60767c49fdc778613a01b0e94481c3ea1
Deleted: sha256:8c4f167ddfc65a86440996833d0a735292e09274b4780f8d326e5bea65e30cd1
Deleted: sha256:154f5d168ab4a922fbb7989255caebe5d5f4b31a6966da2f19ba330efc8bf2c4
Deleted: sha256:9864e79be5cc379e2d22f967b09a49dad02bd6996cb37c540aab46bad5afcdea
Deleted: sha256:31b5177eb9221b60b62a0c07c10f2c14b3f81db29102d939b5b6b28058458eff
Deleted: sha256:effdde6f2279708fef6553f3cfa5a47e89bd5be776555b7941fdaf74a77cfade
Deleted: sha256:cce02027beb31fce8a1fcdf7fe885dc2c9bf0ccde0322fa12d2426a37dd80304
Deleted: sha256:9debe23dc0db936afef02a68d88eebf314ad09a8cdcae6fcf09999c79da1126b
Deleted: sha256:dc041335f8a00d0b841feb58010169106e0af99fdb45f84e4113bb469c79de84
Deleted: sha256:50c6a9e3e3dc3848c98ddc45df719927a7befe80fec898fa20c66e6f86d5e763
Deleted: sha256:3ad40b7f618931355577a3d2b9d21c99bb6db619fe55a68baf82cc565d8e8451
Deleted: sha256:a0835e621c27e0075060fc69ea9653e677d078ef2918fa7a801d4ac78a1a05d1
Deleted: sha256:c9f804285b4499716cf2db6d7b1abe13d95114afed864225e77bfdd208df6467
Deleted: sha256:1878bd1e81c247178005c5a2c6b034fefd4bac5f1c524009dcc2b8b658ac146d
Deleted: sha256:7cb702ff799b2f6de19b5a911e60bb33a2d0b9ba86091e663f5e2b8f91684b20
Build step 'Execute shell' marked build as failure


Mime
View raw message