mesos-builds mailing list archives

Site index · List index
Message view « Date » · « Thread »
Top « Date » · « Thread »
From Apache Jenkins Server <jenk...@builds.apache.org>
Subject Build failed in Jenkins: Mesos-Buildbot » autotools,gcc,--verbose --disable-libtool-wrappers,GLOG_v=1 MESOS_VERBOSE=1,ubuntu:14.04,(ubuntu)&&(!ubuntu-us1)&&(!ubuntu-eu2)&&(!qnode3)&&(!H23) #4333
Date Tue, 17 Oct 2017 20:58:52 GMT
See <https://builds.apache.org/job/Mesos-Buildbot/BUILDTOOL=autotools,COMPILER=gcc,CONFIGURATION=--verbose%20--disable-libtool-wrappers,ENVIRONMENT=GLOG_v=1%20MESOS_VERBOSE=1,OS=ubuntu%3A14.04,label_exp=(ubuntu)&&(!ubuntu-us1)&&(!ubuntu-eu2)&&(!qnode3)&&(!H23)/4333/display/redirect?page=changes>

Changes:

[benjamin.hindman] Replaced Doxygen style fenced code blocks with GitHub Markdown.

[alexr] Removed a no longer valid comment.

------------------------------------------
[...truncated 31.97 MB...]
I1017 20:58:27.292171  5514 http.cpp:1045] Creating default 'basic' HTTP authenticator for
realm 'mesos-agent-readwrite'
I1017 20:58:27.293666  5514 slave.cpp:585] Agent resources: [{"name":"cpus","scalar":{"value":2.0},"type":"SCALAR"},{"name":"mem","scalar":{"value":1024.0},"type":"SCALAR"},{"name":"disk","scalar":{"value":1024.0},"type":"SCALAR"},{"name":"ports","ranges":{"range":[{"begin":31000,"end":32000}]},"type":"RANGES"}]
I1017 20:58:27.293900  5514 slave.cpp:593] Agent attributes: [  ]
I1017 20:58:27.293961  5514 slave.cpp:602] Agent hostname: 88cb88af5d7f
I1017 20:58:27.294239  5504 status_update_manager.cpp:177] Pausing sending status updates
I1017 20:58:27.295953  5506 state.cpp:64] Recovering state from '/tmp/Endpoint_SlaveEndpointTest_AuthorizedRequest_2_GZhNJS/meta'
I1017 20:58:27.296278  5518 status_update_manager.cpp:203] Recovering status update manager
I1017 20:58:27.296545  5509 containerizer.cpp:649] Recovering containerizer
I1017 20:58:27.297921  5517 provisioner.cpp:416] Provisioner recovery complete
I1017 20:58:27.298336  5515 slave.cpp:6310] Finished recovery
I1017 20:58:27.299127  5515 slave.cpp:6492] Querying resource estimator for oversubscribable
resources
I1017 20:58:27.299433  5515 slave.cpp:6506] Received oversubscribable resources {} from the
resource estimator
I1017 20:58:27.302466  5512 process.cpp:3929] Handling HTTP event for process 'slave(822)'
with path: '/slave(822)/containers'
I1017 20:58:27.303947  5507 http.cpp:1185] HTTP GET for /slave(822)/containers from 172.17.0.3:50321
I1017 20:58:27.304039  5507 http.cpp:976] Authorizing principal 'test-principal' to GET the
'/containers' endpoint
I1017 20:58:27.307822  5512 slave.cpp:869] Agent terminating
[       OK ] Endpoint/SlaveEndpointTest.AuthorizedRequest/2 (38 ms)
[ RUN      ] Endpoint/SlaveEndpointTest.UnauthorizedRequest/0
I1017 20:58:27.320024  5503 containerizer.cpp:292] Using isolation { environment_secret, posix/cpu,
posix/mem, filesystem/posix, network/cni }
W1017 20:58:27.320595  5503 backend.cpp:76] Failed to create 'aufs' backend: AufsBackend requires
root privileges
W1017 20:58:27.320713  5503 backend.cpp:76] Failed to create 'bind' backend: BindBackend requires
root privileges
I1017 20:58:27.320747  5503 provisioner.cpp:255] Using default backend 'copy'
I1017 20:58:27.324542  5508 slave.cpp:254] Mesos agent started on (823)@172.17.0.3:40456
I1017 20:58:27.324579  5508 slave.cpp:255] Flags at startup: --acls="" --appc_simple_discovery_uri_prefix="http://"
--appc_store_dir="/tmp/Endpoint_SlaveEndpointTest_UnauthorizedRequest_0_nUkO16/store/appc"
--authenticate_http_readonly="true" --authenticate_http_readwrite="true" --authenticatee="crammd5"
--authentication_backoff_factor="1secs" --authorizer="local" --cgroups_cpu_enable_pids_and_tids_count="false"
--cgroups_enable_cfs="false" --cgroups_hierarchy="/sys/fs/cgroup" --cgroups_limit_swap="false"
--cgroups_root="mesos" --container_disk_watch_interval="15secs" --containerizers="mesos" --credential="/tmp/Endpoint_SlaveEndpointTest_UnauthorizedRequest_0_nUkO16/credential"
--default_role="*" --disallow_sharing_agent_pid_namespace="false" --disk_watch_interval="1mins"
--docker="docker" --docker_kill_orphans="true" --docker_registry="https://registry-1.docker.io"
--docker_remove_delay="6hrs" --docker_socket="/var/run/docker.sock" --docker_stop_timeout="0ns"
--docker_store_dir="/tmp/Endpoint_SlaveEndpointTest_UnauthorizedRequest_0_nUkO16/store/docker"
--docker_volume_checkpoint_dir="/var/run/mesos/isolators/docker/volume" --enforce_container_disk_quota="false"
--executor_registration_timeout="1mins" --executor_reregistration_timeout="2secs" --executor_shutdown_grace_period="5secs"
--fetcher_cache_dir="/tmp/Endpoint_SlaveEndpointTest_UnauthorizedRequest_0_nUkO16/fetch" --fetcher_cache_size="2GB"
--frameworks_home="" --gc_delay="1weeks" --gc_disk_headroom="0.1" --hadoop_home="" --help="false"
--hostname_lookup="true" --http_command_executor="false" --http_credentials="/tmp/Endpoint_SlaveEndpointTest_UnauthorizedRequest_0_nUkO16/http_credentials"
--http_heartbeat_interval="30secs" --initialize_driver_logging="true" --isolation="posix/cpu,posix/mem"
--launcher="posix" --launcher_dir="/mesos/mesos-1.5.0/_build/src" --logbufsecs="0" --logging_level="INFO"
--max_completed_executors_per_framework="150" --oversubscribed_resources_interval="15secs"
--perf_duration="10secs" --perf_interval="1mins" --port="5051" --qos_correction_interval_min="0ns"
--quiet="false" --recover="reconnect" --recovery_timeout="15mins" --registration_backoff_factor="10ms"
--resources="cpus:2;gpus:0;mem:1024;disk:1024;ports:[31000-32000]" --revocable_cpu_low_priority="true"
--runtime_dir="/tmp/Endpoint_SlaveEndpointTest_UnauthorizedRequest_0_nUkO16" --sandbox_directory="/mnt/mesos/sandbox"
--strict="true" --switch_user="true" --systemd_enable_support="true" --systemd_runtime_directory="/run/systemd/system"
--version="false" --work_dir="/tmp/Endpoint_SlaveEndpointTest_UnauthorizedRequest_0_gDZwxg"
--zk_session_timeout="10secs"
I1017 20:58:27.325170  5508 credentials.hpp:86] Loading credential for authentication from
'/tmp/Endpoint_SlaveEndpointTest_UnauthorizedRequest_0_nUkO16/credential'
I1017 20:58:27.325407  5508 slave.cpp:287] Agent using credential for: test-principal
I1017 20:58:27.325434  5508 credentials.hpp:37] Loading credentials for authentication from
'/tmp/Endpoint_SlaveEndpointTest_UnauthorizedRequest_0_nUkO16/http_credentials'
I1017 20:58:27.325800  5508 http.cpp:1045] Creating default 'basic' HTTP authenticator for
realm 'mesos-agent-readonly'
I1017 20:58:27.326009  5508 http.cpp:1045] Creating default 'basic' HTTP authenticator for
realm 'mesos-agent-readwrite'
I1017 20:58:27.328114  5508 slave.cpp:585] Agent resources: [{"name":"cpus","scalar":{"value":2.0},"type":"SCALAR"},{"name":"mem","scalar":{"value":1024.0},"type":"SCALAR"},{"name":"disk","scalar":{"value":1024.0},"type":"SCALAR"},{"name":"ports","ranges":{"range":[{"begin":31000,"end":32000}]},"type":"RANGES"}]
I1017 20:58:27.328449  5508 slave.cpp:593] Agent attributes: [  ]
I1017 20:58:27.328517  5508 slave.cpp:602] Agent hostname: 88cb88af5d7f
I1017 20:58:27.328728  5512 status_update_manager.cpp:177] Pausing sending status updates
I1017 20:58:27.330556  5509 state.cpp:64] Recovering state from '/tmp/Endpoint_SlaveEndpointTest_UnauthorizedRequest_0_gDZwxg/meta'
I1017 20:58:27.330893  5507 status_update_manager.cpp:203] Recovering status update manager
I1017 20:58:27.331169  5517 containerizer.cpp:649] Recovering containerizer
I1017 20:58:27.332644  5509 provisioner.cpp:416] Provisioner recovery complete
I1017 20:58:27.333016  5507 slave.cpp:6310] Finished recovery
I1017 20:58:27.333676  5507 slave.cpp:6492] Querying resource estimator for oversubscribable
resources
I1017 20:58:27.334025  5517 slave.cpp:6506] Received oversubscribable resources {} from the
resource estimator
I1017 20:58:27.337565  5513 process.cpp:3929] Handling HTTP event for process 'slave(823)'
with path: '/slave(823)/monitor/statistics'
I1017 20:58:27.339083  5507 http.cpp:1185] HTTP GET for /slave(823)/monitor/statistics from
172.17.0.3:50322
I1017 20:58:27.339221  5507 http.cpp:976] Authorizing principal 'test-principal' to GET the
'/monitor/statistics' endpoint
I1017 20:58:27.341372  5503 slave.cpp:869] Agent terminating
[       OK ] Endpoint/SlaveEndpointTest.UnauthorizedRequest/0 (33 ms)
[ RUN      ] Endpoint/SlaveEndpointTest.UnauthorizedRequest/1
I1017 20:58:27.353938  5503 containerizer.cpp:292] Using isolation { environment_secret, posix/cpu,
posix/mem, filesystem/posix, network/cni }
W1017 20:58:27.354557  5503 backend.cpp:76] Failed to create 'aufs' backend: AufsBackend requires
root privileges
W1017 20:58:27.354701  5503 backend.cpp:76] Failed to create 'bind' backend: BindBackend requires
root privileges
I1017 20:58:27.354748  5503 provisioner.cpp:255] Using default backend 'copy'
I1017 20:58:27.358422  5518 slave.cpp:254] Mesos agent started on (824)@172.17.0.3:40456
I1017 20:58:27.358455  5518 slave.cpp:255] Flags at startup: --acls="" --appc_simple_discovery_uri_prefix="http://"
--appc_store_dir="/tmp/Endpoint_SlaveEndpointTest_UnauthorizedRequest_1_BnADhv/store/appc"
--authenticate_http_readonly="true" --authenticate_http_readwrite="true" --authenticatee="crammd5"
--authentication_backoff_factor="1secs" --authorizer="local" --cgroups_cpu_enable_pids_and_tids_count="false"
--cgroups_enable_cfs="false" --cgroups_hierarchy="/sys/fs/cgroup" --cgroups_limit_swap="false"
--cgroups_root="mesos" --container_disk_watch_interval="15secs" --containerizers="mesos" --credential="/tmp/Endpoint_SlaveEndpointTest_UnauthorizedRequest_1_BnADhv/credential"
--default_role="*" --disallow_sharing_agent_pid_namespace="false" --disk_watch_interval="1mins"
--docker="docker" --docker_kill_orphans="true" --docker_registry="https://registry-1.docker.io"
--docker_remove_delay="6hrs" --docker_socket="/var/run/docker.sock" --docker_stop_timeout="0ns"
--docker_store_dir="/tmp/Endpoint_SlaveEndpointTest_UnauthorizedRequest_1_BnADhv/store/docker"
--docker_volume_checkpoint_dir="/var/run/mesos/isolators/docker/volume" --enforce_container_disk_quota="false"
--executor_registration_timeout="1mins" --executor_reregistration_timeout="2secs" --executor_shutdown_grace_period="5secs"
--fetcher_cache_dir="/tmp/Endpoint_SlaveEndpointTest_UnauthorizedRequest_1_BnADhv/fetch" --fetcher_cache_size="2GB"
--frameworks_home="" --gc_delay="1weeks" --gc_disk_headroom="0.1" --hadoop_home="" --help="false"
--hostname_lookup="true" --http_command_executor="false" --http_credentials="/tmp/Endpoint_SlaveEndpointTest_UnauthorizedRequest_1_BnADhv/http_credentials"
--http_heartbeat_interval="30secs" --initialize_driver_logging="true" --isolation="posix/cpu,posix/mem"
--launcher="posix" --launcher_dir="/mesos/mesos-1.5.0/_build/src" --logbufsecs="0" --logging_level="INFO"
--max_completed_executors_per_framework="150" --oversubscribed_resources_interval="15secs"
--perf_duration="10secs" --perf_interval="1mins" --port="5051" --qos_correction_interval_min="0ns"
--quiet="false" --recover="reconnect" --recovery_timeout="15mins" --registration_backoff_factor="10ms"
--resources="cpus:2;gpus:0;mem:1024;disk:1024;ports:[31000-32000]" --revocable_cpu_low_priority="true"
--runtime_dir="/tmp/Endpoint_SlaveEndpointTest_UnauthorizedRequest_1_BnADhv" --sandbox_directory="/mnt/mesos/sandbox"
--strict="true" --switch_user="true" --systemd_enable_support="true" --systemd_runtime_directory="/run/systemd/system"
--version="false" --work_dir="/tmp/Endpoint_SlaveEndpointTest_UnauthorizedRequest_1_k92RHE"
--zk_session_timeout="10secs"
I1017 20:58:27.359011  5518 credentials.hpp:86] Loading credential for authentication from
'/tmp/Endpoint_SlaveEndpointTest_UnauthorizedRequest_1_BnADhv/credential'
I1017 20:58:27.359231  5518 slave.cpp:287] Agent using credential for: test-principal
I1017 20:58:27.359258  5518 credentials.hpp:37] Loading credentials for authentication from
'/tmp/Endpoint_SlaveEndpointTest_UnauthorizedRequest_1_BnADhv/http_credentials'
I1017 20:58:27.359581  5518 http.cpp:1045] Creating default 'basic' HTTP authenticator for
realm 'mesos-agent-readonly'
I1017 20:58:27.359784  5518 http.cpp:1045] Creating default 'basic' HTTP authenticator for
realm 'mesos-agent-readwrite'
I1017 20:58:27.361544  5518 slave.cpp:585] Agent resources: [{"name":"cpus","scalar":{"value":2.0},"type":"SCALAR"},{"name":"mem","scalar":{"value":1024.0},"type":"SCALAR"},{"name":"disk","scalar":{"value":1024.0},"type":"SCALAR"},{"name":"ports","ranges":{"range":[{"begin":31000,"end":32000}]},"type":"RANGES"}]
I1017 20:58:27.361835  5518 slave.cpp:593] Agent attributes: [  ]
I1017 20:58:27.361896  5518 slave.cpp:602] Agent hostname: 88cb88af5d7f
I1017 20:58:27.362174  5511 status_update_manager.cpp:177] Pausing sending status updates
I1017 20:58:27.364382  5507 state.cpp:64] Recovering state from '/tmp/Endpoint_SlaveEndpointTest_UnauthorizedRequest_1_k92RHE/meta'
I1017 20:58:27.364702  5513 status_update_manager.cpp:203] Recovering status update manager
I1017 20:58:27.364941  5509 containerizer.cpp:649] Recovering containerizer
I1017 20:58:27.366969  5514 provisioner.cpp:416] Provisioner recovery complete
I1017 20:58:27.367318  5516 slave.cpp:6310] Finished recovery
I1017 20:58:27.367890  5516 slave.cpp:6492] Querying resource estimator for oversubscribable
resources
I1017 20:58:27.368201  5513 slave.cpp:6506] Received oversubscribable resources {} from the
resource estimator
I1017 20:58:27.370903  5518 process.cpp:3929] Handling HTTP event for process 'slave(824)'
with path: '/slave(824)/monitor/statistics.json'
I1017 20:58:27.372210  5518 http.cpp:1185] HTTP GET for /slave(824)/monitor/statistics.json
from 172.17.0.3:50323
I1017 20:58:27.372294  5518 http.cpp:976] Authorizing principal 'test-principal' to GET the
'/monitor/statistics.json' endpoint
I1017 20:58:27.374896  5506 slave.cpp:869] Agent terminating
[       OK ] Endpoint/SlaveEndpointTest.UnauthorizedRequest/1 (45 ms)
[ RUN      ] Endpoint/SlaveEndpointTest.UnauthorizedRequest/2
I1017 20:58:27.399305  5503 containerizer.cpp:292] Using isolation { environment_secret, posix/cpu,
posix/mem, filesystem/posix, network/cni }
W1017 20:58:27.400023  5503 backend.cpp:76] Failed to create 'aufs' backend: AufsBackend requires
root privileges
W1017 20:58:27.400176  5503 backend.cpp:76] Failed to create 'bind' backend: BindBackend requires
root privileges
I1017 20:58:27.400223  5503 provisioner.cpp:255] Using default backend 'copy'
I1017 20:58:27.404829  5510 slave.cpp:254] Mesos agent started on (825)@172.17.0.3:40456
I1017 20:58:27.404882  5510 slave.cpp:255] Flags at startup: --acls="" --appc_simple_discovery_uri_prefix="http://"
--appc_store_dir="/tmp/Endpoint_SlaveEndpointTest_UnauthorizedRequest_2_lSw5YT/store/appc"
--authenticate_http_readonly="true" --authenticate_http_readwrite="true" --authenticatee="crammd5"
--authentication_backoff_factor="1secs" --authorizer="local" --cgroups_cpu_enable_pids_and_tids_count="false"
--cgroups_enable_cfs="false" --cgroups_hierarchy="/sys/fs/cgroup" --cgroups_limit_swap="false"
--cgroups_root="mesos" --container_disk_watch_interval="15secs" --containerizers="mesos" --credential="/tmp/Endpoint_SlaveEndpointTest_UnauthorizedRequest_2_lSw5YT/credential"
--default_role="*" --disallow_sharing_agent_pid_namespace="false" --disk_watch_interval="1mins"
--docker="docker" --docker_kill_orphans="true" --docker_registry="https://registry-1.docker.io"
--docker_remove_delay="6hrs" --docker_socket="/var/run/docker.sock" --docker_stop_timeout="0ns"
--docker_store_dir="/tmp/Endpoint_SlaveEndpointTest_UnauthorizedRequest_2_lSw5YT/store/docker"
--docker_volume_checkpoint_dir="/var/run/mesos/isolators/docker/volume" --enforce_container_disk_quota="false"
--executor_registration_timeout="1mins" --executor_reregistration_timeout="2secs" --executor_shutdown_grace_period="5secs"
--fetcher_cache_dir="/tmp/Endpoint_SlaveEndpointTest_UnauthorizedRequest_2_lSw5YT/fetch" --fetcher_cache_size="2GB"
--frameworks_home="" --gc_delay="1weeks" --gc_disk_headroom="0.1" --hadoop_home="" --help="false"
--hostname_lookup="true" --http_command_executor="false" --http_credentials="/tmp/Endpoint_SlaveEndpointTest_UnauthorizedRequest_2_lSw5YT/http_credentials"
--http_heartbeat_interval="30secs" --initialize_driver_logging="true" --isolation="posix/cpu,posix/mem"
--launcher="posix" --launcher_dir="/mesos/mesos-1.5.0/_build/src" --logbufsecs="0" --logging_level="INFO"
--max_completed_executors_per_framework="150" --oversubscribed_resources_interval="15secs"
--perf_duration="10secs" --perf_interval="1mins" --port="5051" --qos_correction_interval_min="0ns"
--quiet="false" --recover="reconnect" --recovery_timeout="15mins" --registration_backoff_factor="10ms"
--resources="cpus:2;gpus:0;mem:1024;disk:1024;ports:[31000-32000]" --revocable_cpu_low_priority="true"
--runtime_dir="/tmp/Endpoint_SlaveEndpointTest_UnauthorizedRequest_2_lSw5YT" --sandbox_directory="/mnt/mesos/sandbox"
--strict="true" --switch_user="true" --systemd_enable_support="true" --systemd_runtime_directory="/run/systemd/system"
--version="false" --work_dir="/tmp/Endpoint_SlaveEndpointTest_UnauthorizedRequest_2_6ymXh3"
--zk_session_timeout="10secs"
I1017 20:58:27.405558  5510 credentials.hpp:86] Loading credential for authentication from
'/tmp/Endpoint_SlaveEndpointTest_UnauthorizedRequest_2_lSw5YT/credential'
I1017 20:58:27.405841  5510 slave.cpp:287] Agent using credential for: test-principal
I1017 20:58:27.405865  5510 credentials.hpp:37] Loading credentials for authentication from
'/tmp/Endpoint_SlaveEndpointTest_UnauthorizedRequest_2_lSw5YT/http_credentials'
I1017 20:58:27.406283  5510 http.cpp:1045] Creating default 'basic' HTTP authenticator for
realm 'mesos-agent-readonly'
I1017 20:58:27.406626  5510 http.cpp:1045] Creating default 'basic' HTTP authenticator for
realm 'mesos-agent-readwrite'
I1017 20:58:27.408653  5510 slave.cpp:585] Agent resources: [{"name":"cpus","scalar":{"value":2.0},"type":"SCALAR"},{"name":"mem","scalar":{"value":1024.0},"type":"SCALAR"},{"name":"disk","scalar":{"value":1024.0},"type":"SCALAR"},{"name":"ports","ranges":{"range":[{"begin":31000,"end":32000}]},"type":"RANGES"}]
I1017 20:58:27.409045  5510 slave.cpp:593] Agent attributes: [  ]
I1017 20:58:27.409109  5510 slave.cpp:602] Agent hostname: 88cb88af5d7f
I1017 20:58:27.409371  5508 status_update_manager.cpp:177] Pausing sending status updates
I1017 20:58:27.411370  5517 state.cpp:64] Recovering state from '/tmp/Endpoint_SlaveEndpointTest_UnauthorizedRequest_2_6ymXh3/meta'
I1017 20:58:27.411950  5517 status_update_manager.cpp:203] Recovering status update manager
I1017 20:58:27.412250  5517 containerizer.cpp:649] Recovering containerizer
I1017 20:58:27.413934  5506 provisioner.cpp:416] Provisioner recovery complete
I1017 20:58:27.414451  5505 slave.cpp:6310] Finished recovery
I1017 20:58:27.415163  5505 slave.cpp:6492] Querying resource estimator for oversubscribable
resources
I1017 20:58:27.415484  5507 slave.cpp:6506] Received oversubscribable resources {} from the
resource estimator
I1017 20:58:27.419189  5514 process.cpp:3929] Handling HTTP event for process 'slave(825)'
with path: '/slave(825)/containers'
I1017 20:58:27.420986  5519 http.cpp:1185] HTTP GET for /slave(825)/containers from 172.17.0.3:50324
I1017 20:58:27.421104  5519 http.cpp:976] Authorizing principal 'test-principal' to GET the
'/containers' endpoint
I1017 20:58:27.423560  5503 slave.cpp:869] Agent terminating
[       OK ] Endpoint/SlaveEndpointTest.UnauthorizedRequest/2 (36 ms)
[ RUN      ] Endpoint/SlaveEndpointTest.NoAuthorizer/0
I1017 20:58:27.435565  5503 containerizer.cpp:292] Using isolation { environment_secret, posix/cpu,
posix/mem, filesystem/posix, network/cni }
W1017 20:58:27.436058  5503 backend.cpp:76] Failed to create 'aufs' backend: AufsBackend requires
root privileges
W1017 20:58:27.436167  5503 backend.cpp:76] Failed to create 'bind' backend: BindBackend requires
root privileges
I1017 20:58:27.436198  5503 provisioner.cpp:255] Using default backend 'copy'
I1017 20:58:27.437822  5503 cluster.cpp:448] Creating default 'local' authorizer
I1017 20:58:27.439743  5507 slave.cpp:254] Mesos agent started on (826)@172.17.0.3:40456
I1017 20:58:27.439769  5507 slave.cpp:255] Flags at startup: --acls="" --appc_simple_discovery_uri_prefix="http://"
--appc_store_dir="/tmp/Endpoint_SlaveEndpointTest_NoAuthorizer_0_BIG05i/store/appc" --authenticate_http_readonly="true"
--authenticate_http_readwrite="true" --authenticatee="crammd5" --authentication_backoff_factor="1secs"
--authorizer="local" --cgroups_cpu_enable_pids_and_tids_count="false" --cgroups_enable_cfs="false"
--cgroups_hierarchy="/sys/fs/cgroup" --cgroups_limit_swap="false" --cgroups_root="mesos" --container_disk_watch_interval="15secs"
--containerizers="mesos" --credential="/tmp/Endpoint_SlaveEndpointTest_NoAuthorizer_0_BIG05i/credential"
--default_role="*" --disallow_sharing_agent_pid_namespace="false" --disk_watch_interval="1mins"
--docker="docker" --docker_kill_orphans="true" --docker_registry="https://registry-1.docker.io"
--docker_remove_delay="6hrs" --docker_socket="/var/run/docker.sock" --docker_stop_timeout="0ns"
--docker_store_dir="/tmp/Endpoint_SlaveEndpointTest_NoAuthorizer_0_BIG05i/store/docker" --docker_volume_checkpoint_dir="/var/run/mesos/isolators/docker/volume"
--enforce_container_disk_quota="false" --executor_registration_timeout="1mins" --executor_reregistration_timeout="2secs"
--executor_shutdown_grace_period="5secs" --fetcher_cache_dir="/tmp/Endpoint_SlaveEndpointTest_NoAuthorizer_0_BIG05i/fetch"
--fetcher_cache_size="2GB" --frameworks_home="" --gc_delay="1weeks" --gc_disk_headroom="0.1"
--hadoop_home="" --help="false" --hostname_lookup="true" --http_command_executor="false" --http_credentials="/tmp/Endpoint_SlaveEndpointTest_NoAuthorizer_0_BIG05i/http_credentials"
--http_heartbeat_interval="30secs" --initialize_driver_logging="true" --isolation="posix/cpu,posix/mem"
--launcher="posix" --launcher_dir="/mesos/mesos-1.5.0/_build/src" --logbufsecs="0" --logging_level="INFO"
--max_completed_executors_per_framework="150" --oversubscribed_resources_interval="15secs"
--perf_duration="10secs" --perf_interval="1mins" --port="5051" --qos_correction_interval_min="0ns"
--quiet="false" --recover="reconnect" --recovery_timeout="15mins" --registration_backoff_factor="10ms"
--resources="cpus:2;gpus:0;mem:1024;disk:1024;ports:[31000-32000]" --revocable_cpu_low_priority="true"
--runtime_dir="/tmp/Endpoint_SlaveEndpointTest_NoAuthorizer_0_BIG05i" --sandbox_directory="/mnt/mesos/sandbox"
--strict="true" --switch_user="true" --systemd_enable_support="true" --systemd_runtime_directory="/run/systemd/system"
--version="false" --work_dir="/tmp/Endpoint_SlaveEndpointTest_NoAuthorizer_0_ydqYis" --zk_session_timeout="10secs"
I1017 20:58:27.440254  5507 credentials.hpp:86] Loading credential for authentication from
'/tmp/Endpoint_SlaveEndpointTest_NoAuthorizer_0_BIG05i/credential'
I1017 20:58:27.440440  5507 slave.cpp:287] Agent using credential for: test-principal
I1017 20:58:27.440465  5507 credentials.hpp:37] Loading credentials for authentication from
'/tmp/Endpoint_SlaveEndpointTest_NoAuthorizer_0_BIG05i/http_credentials'
I1017 20:58:27.440778  5507 http.cpp:1045] Creating default 'basic' HTTP authenticator for
realm 'mesos-agent-readonly'
I1017 20:58:27.440963  5507 http.cpp:1045] Creating default 'basic' HTTP authenticator for
realm 'mesos-agent-readwrite'
I1017 20:58:27.442353  5507 slave.cpp:585] Agent resources: [{"name":"cpus","scalar":{"value":2.0},"type":"SCALAR"},{"name":"mem","scalar":{"value":1024.0},"type":"SCALAR"},{"name":"disk","scalar":{"value":1024.0},"type":"SCALAR"},{"name":"ports","ranges":{"range":[{"begin":31000,"end":32000}]},"type":"RANGES"}]
I1017 20:58:27.442570  5507 slave.cpp:593] Agent attributes: [  ]
I1017 20:58:27.442592  5507 slave.cpp:602] Agent hostname: 88cb88af5d7f
I1017 20:58:27.442770  5510 status_update_manager.cpp:177] Pausing sending status updates
I1017 20:58:27.444203  5514 state.cpp:64] Recovering state from '/tmp/Endpoint_SlaveEndpointTest_NoAuthorizer_0_ydqYis/meta'
I1017 20:58:27.444524  5504 status_update_manager.cpp:203] Recovering status update manager
I1017 20:58:27.444720  5505 containerizer.cpp:649] Recovering containerizer
I1017 20:58:27.446079  5514 provisioner.cpp:416] Provisioner recovery complete
I1017 20:58:27.446431  5512 slave.cpp:6310] Finished recovery
I1017 20:58:27.447087  5512 slave.cpp:6492] Querying resource estimator for oversubscribable
resources
I1017 20:58:27.447335  5509 slave.cpp:6506] Received oversubscribable resources {} from the
resource estimator
I1017 20:58:27.450206  5507 process.cpp:3929] Handling HTTP event for process 'slave(826)'
with path: '/slave(826)/monitor/statistics'
I1017 20:58:27.451398  5517 http.cpp:1185] HTTP GET for /slave(826)/monitor/statistics from
172.17.0.3:50325
I1017 20:58:27.451467  5517 http.cpp:976] Authorizing principal 'test-principal' to GET the
'/monitor/statistics' endpoint
I1017 20:58:27.454860  5503 slave.cpp:869] Agent terminating
[       OK ] Endpoint/SlaveEndpointTest.NoAuthorizer/0 (30 ms)
[ RUN      ] Endpoint/SlaveEndpointTest.NoAuthorizer/1
I1017 20:58:27.466250  5503 containerizer.cpp:292] Using isolation { environment_secret, posix/cpu,
posix/mem, filesystem/posix, network/cni }
W1017 20:58:27.466738  5503 backend.cpp:76] Failed to create 'aufs' backend: AufsBackend requires
root privileges
W1017 20:58:27.466843  5503 backend.cpp:76] Failed to create 'bind' backend: BindBackend requires
root privileges
I1017 20:58:27.466874  5503 provisioner.cpp:255] Using default backend 'copy'
I1017 20:58:27.468806  5503 cluster.cpp:448] Creating default 'local' authorizer
I1017 20:58:27.471228  5509 slave.cpp:254] Mesos agent started on (827)@172.17.0.3:40456
I1017 20:58:27.471257  5509 slave.cpp:255] Flags at startup: --acls="" --appc_simple_discovery_uri_prefix="http://"
--appc_store_dir="/tmp/Endpoint_SlaveEndpointTest_NoAuthorizer_1_9PXcxI/store/appc" --authenticate_http_readonly="true"
--authenticate_http_readwrite="true" --authenticatee="crammd5" --authentication_backoff_factor="1secs"
--authorizer="local" --cgroups_cpu_enable_pids_and_tids_count="false" --cgroups_enable_cfs="false"
--cgroups_hierarchy="/sys/fs/cgroup" --cgroups_limit_swap="false" --cgroups_root="mesos" --container_disk_watch_interval="15secs"
--containerizers="mesos" --credential="/tmp/Endpoint_SlaveEndpointTest_NoAuthorizer_1_9PXcxI/credential"
--default_role="*" --disallow_sharing_agent_pid_namespace="false" --disk_watch_interval="1mins"
--docker="docker" --docker_kill_orphans="true" --docker_registry="https://registry-1.docker.io"
--docker_remove_delay="6hrs" --docker_socket="/var/run/docker.sock" --docker_stop_timeout="0ns"
--docker_store_dir="/tmp/Endpoint_SlaveEndpointTest_NoAuthorizer_1_9PXcxI/store/docker" --docker_volume_checkpoint_dir="/var/run/mesos/isolators/docker/volume"
--enforce_container_disk_quota="false" --executor_registration_timeout="1mins" --executor_reregistration_timeout="2secs"
--executor_shutdown_grace_period="5secs" --fetcher_cache_dir="/tmp/Endpoint_SlaveEndpointTest_NoAuthorizer_1_9PXcxI/fetch"
--fetcher_cache_size="2GB" --frameworks_home="" --gc_delay="1weeks" --gc_disk_headroom="0.1"
--hadoop_home="" --help="false" --hostname_lookup="true" --http_command_executor="false" --http_credentials="/tmp/Endpoint_SlaveEndpointTest_NoAuthorizer_1_9PXcxI/http_credentials"
--http_heartbeat_interval="30secs" --initialize_driver_logging="true" --isolation="posix/cpu,posix/mem"
--launcher="posix" --launcher_dir="/mesos/mesos-1.5.0/_build/src" --logbufsecs="0" --logging_level="INFO"
--max_completed_executors_per_framework="150" --oversubscribed_resources_interval="15secs"
--perf_duration="10secs" --perf_interval="1mins" --port="5051" --qos_correction_interval_min="0ns"
--quiet="false" --recover="reconnect" --recovery_timeout="15mins" --registration_backoff_factor="10ms"
--resources="cpus:2;gpus:0;mem:1024;disk:1024;ports:[31000-32000]" --revocable_cpu_low_priority="true"
--runtime_dir="/tmp/Endpoint_SlaveEndpointTest_NoAuthorizer_1_9PXcxI" --sandbox_directory="/mnt/mesos/sandbox"
--strict="true" --switch_user="true" --systemd_enable_support="true" --systemd_runtime_directory="/run/systemd/system"
--version="false" --work_dir="/tmp/Endpoint_SlaveEndpointTest_NoAuthorizer_1_A478ER" --zk_session_timeout="10secs"
I1017 20:58:27.471927  5509 credentials.hpp:86] Loading credential for authentication from
'/tmp/Endpoint_SlaveEndpointTest_NoAuthorizer_1_9PXcxI/credential'
I1017 20:58:27.472121  5509 slave.cpp:287] Agent using credential for: test-principal
I1017 20:58:27.472152  5509 credentials.hpp:37] Loading credentials for authentication from
'/tmp/Endpoint_SlaveEndpointTest_NoAuthorizer_1_9PXcxI/http_credentials'
I1017 20:58:27.472486  5509 http.cpp:1045] Creating default 'basic' HTTP authenticator for
realm 'mesos-agent-readonly'
I1017 20:58:27.472694  5509 http.cpp:1045] Creating default 'basic' HTTP authenticator for
realm 'mesos-agent-readwrite'
I1017 20:58:27.474583  5509 slave.cpp:585] Agent resources: [{"name":"cpus","scalar":{"value":2.0},"type":"SCALAR"},{"name":"mem","scalar":{"value":1024.0},"type":"SCALAR"},{"name":"disk","scalar":{"value":1024.0},"type":"SCALAR"},{"name":"ports","ranges":{"range":[{"begin":31000,"end":32000}]},"type":"RANGES"}]
I1017 20:58:27.474890  5509 slave.cpp:593] Agent attributes: [  ]
I1017 20:58:27.474916  5509 slave.cpp:602] Agent hostname: 88cb88af5d7f
I1017 20:58:27.475113  5517 status_update_manager.cpp:177] Pausing sending status updates
I1017 20:58:27.476925  5519 state.cpp:64] Recovering state from '/tmp/Endpoint_SlaveEndpointTest_NoAuthorizer_1_A478ER/meta'
I1017 20:58:27.477252  5519 status_update_manager.cpp:203] Recovering status update manager
I1017 20:58:27.477495  5514 containerizer.cpp:649] Recovering containerizer
I1017 20:58:27.479216  5516 provisioner.cpp:416] Provisioner recovery complete
I1017 20:58:27.479624  5515 slave.cpp:6310] Finished recovery
I1017 20:58:27.480291  5515 slave.cpp:6492] Querying resource estimator for oversubscribable
resources
I1017 20:58:27.480567  5510 slave.cpp:6506] Received oversubscribable resources {} from the
resource estimator
I1017 20:58:27.483448  5512 process.cpp:3929] Handling HTTP event for process 'slave(827)'
with path: '/slave(827)/monitor/statistics.json'
I1017 20:58:27.485039  5504 http.cpp:1185] HTTP GET for /slave(827)/monitor/statistics.json
from 172.17.0.3:50326
I1017 20:58:27.485137  5504 http.cpp:976] Authorizing principal 'test-principal' to GET the
'/monitor/statistics.json' endpoint
I1017 20:58:27.489186  5503 slave.cpp:869] Agent terminating
[       OK ] Endpoint/SlaveEndpointTest.NoAuthorizer/1 (35 ms)
[ RUN      ] Endpoint/SlaveEndpointTest.NoAuthorizer/2
I1017 20:58:27.503067  5503 containerizer.cpp:292] Using isolation { environment_secret, posix/cpu,
posix/mem, filesystem/posix, network/cni }
W1017 20:58:27.503813  5503 backend.cpp:76] Failed to create 'aufs' backend: AufsBackend requires
root privileges
W1017 20:58:27.503940  5503 backend.cpp:76] Failed to create 'bind' backend: BindBackend requires
root privileges
I1017 20:58:27.503979  5503 provisioner.cpp:255] Using default backend 'copy'
I1017 20:58:27.506021  5503 cluster.cpp:448] Creating default 'local' authorizer
I1017 20:58:27.508340  5504 slave.cpp:254] Mesos agent started on (828)@172.17.0.3:40456
I1017 20:58:27.508368  5504 slave.cpp:255] Flags at startup: --acls="" --appc_simple_discovery_uri_prefix="http://"
--appc_store_dir="/tmp/Endpoint_SlaveEndpointTest_NoAuthorizer_2_1qW9k8/store/appc" --authenticate_http_readonly="true"
--authenticate_http_readwrite="true" --authenticatee="crammd5" --authentication_backoff_factor="1secs"
--authorizer="local" --cgroups_cpu_enable_pids_and_tids_count="false" --cgroups_enable_cfs="false"
--cgroups_hierarchy="/sys/fs/cgroup" --cgroups_limit_swap="false" --cgroups_root="mesos" --container_disk_watch_interval="15secs"
--containerizers="mesos" --credential="/tmp/Endpoint_SlaveEndpointTest_NoAuthorizer_2_1qW9k8/credential"
--default_role="*" --disallow_sharing_agent_pid_namespace="false" --disk_watch_interval="1mins"
--docker="docker" --docker_kill_orphans="true" --docker_registry="https://registry-1.docker.io"
--docker_remove_delay="6hrs" --docker_socket="/var/run/docker.sock" --docker_stop_timeout="0ns"
--docker_store_dir="/tmp/Endpoint_SlaveEndpointTest_NoAuthorizer_2_1qW9k8/store/docker" --docker_volume_checkpoint_dir="/var/run/mesos/isolators/docker/volume"
--enforce_container_disk_quota="false" --executor_registration_timeout="1mins" --executor_reregistration_timeout="2secs"
--executor_shutdown_grace_period="5secs" --fetcher_cache_dir="/tmp/Endpoint_SlaveEndpointTest_NoAuthorizer_2_1qW9k8/fetch"
--fetcher_cache_size="2GB" --frameworks_home="" --gc_delay="1weeks" --gc_disk_headroom="0.1"
--hadoop_home="" --help="false" --hostname_lookup="true" --http_command_executor="false" --http_credentials="/tmp/Endpoint_SlaveEndpointTest_NoAuthorizer_2_1qW9k8/http_credentials"
--http_heartbeat_interval="30secs" --initialize_driver_logging="true" --isolation="posix/cpu,posix/mem"
--launcher="posix" --launcher_dir="/mesos/mesos-1.5.0/_build/src" --logbufsecs="0" --logging_level="INFO"
--max_completed_executors_per_framework="150" --oversubscribed_resources_interval="15secs"
--perf_duration="10secs" --perf_interval="1mins" --port="5051" --qos_correction_interval_min="0ns"
--quiet="false" --recover="reconnect" --recovery_timeout="15mins" --registration_backoff_factor="10ms"
--resources="cpus:2;gpus:0;mem:1024;disk:1024;ports:[31000-32000]" --revocable_cpu_low_priority="true"
--runtime_dir="/tmp/Endpoint_SlaveEndpointTest_NoAuthorizer_2_1qW9k8" --sandbox_directory="/mnt/mesos/sandbox"
--strict="true" --switch_user="true" --systemd_enable_support="true" --systemd_runtime_directory="/run/systemd/system"
--version="false" --work_dir="/tmp/Endpoint_SlaveEndpointTest_NoAuthorizer_2_Pwthnh" --zk_session_timeout="10secs"
I1017 20:58:27.508813  5504 credentials.hpp:86] Loading credential for authentication from
'/tmp/Endpoint_SlaveEndpointTest_NoAuthorizer_2_1qW9k8/credential'
I1017 20:58:27.508993  5504 slave.cpp:287] Agent using credential for: test-principal
I1017 20:58:27.509026  5504 credentials.hpp:37] Loading credentials for authentication from
'/tmp/Endpoint_SlaveEndpointTest_NoAuthorizer_2_1qW9k8/http_credentials'
I1017 20:58:27.509336  5504 http.cpp:1045] Creating default 'basic' HTTP authenticator for
realm 'mesos-agent-readonly'
I1017 20:58:27.509524  5504 http.cpp:1045] Creating default 'basic' HTTP authenticator for
realm 'mesos-agent-readwrite'
I1017 20:58:27.511330  5504 slave.cpp:585] Agent resources: [{"name":"cpus","scalar":{"value":2.0},"type":"SCALAR"},{"name":"mem","scalar":{"value":1024.0},"type":"SCALAR"},{"name":"disk","scalar":{"value":1024.0},"type":"SCALAR"},{"name":"ports","ranges":{"range":[{"begin":31000,"end":32000}]},"type":"RANGES"}]
I1017 20:58:27.511636  5504 slave.cpp:593] Agent attributes: [  ]
I1017 20:58:27.511652  5504 slave.cpp:602] Agent hostname: 88cb88af5d7f
I1017 20:58:27.511831  5512 status_update_manager.cpp:177] Pausing sending status updates
I1017 20:58:27.513448  5519 state.cpp:64] Recovering state from '/tmp/Endpoint_SlaveEndpointTest_NoAuthorizer_2_Pwthnh/meta'
I1017 20:58:27.513782  5514 status_update_manager.cpp:203] Recovering status update manager
I1017 20:58:27.514067  5518 containerizer.cpp:649] Recovering containerizer
I1017 20:58:27.515733  5513 provisioner.cpp:416] Provisioner recovery complete
I1017 20:58:27.516125  5508 slave.cpp:6310] Finished recovery
I1017 20:58:27.516700  5508 slave.cpp:6492] Querying resource estimator for oversubscribable
resources
I1017 20:58:27.516973  5511 slave.cpp:6506] Received oversubscribable resources {} from the
resource estimator
I1017 20:58:27.519820  5519 process.cpp:3929] Handling HTTP event for process 'slave(828)'
with path: '/slave(828)/containers'
I1017 20:58:27.521275  5508 http.cpp:1185] HTTP GET for /slave(828)/containers from 172.17.0.3:50327
I1017 20:58:27.521364  5508 http.cpp:976] Authorizing principal 'test-principal' to GET the
'/containers' endpoint
I1017 20:58:27.525732  5503 slave.cpp:869] Agent terminating
[       OK ] Endpoint/SlaveEndpointTest.NoAuthorizer/2 (36 ms)
[----------] 9 tests from Endpoint/SlaveEndpointTest (322 ms total)

[----------] 2 tests from ContainerizerType/DefaultContainerDNSFlagTest
[ RUN      ] ContainerizerType/DefaultContainerDNSFlagTest.ValidateFlag/0
[       OK ] ContainerizerType/DefaultContainerDNSFlagTest.ValidateFlag/0 (10 ms)
[ RUN      ] ContainerizerType/DefaultContainerDNSFlagTest.ValidateFlag/1
[       OK ] ContainerizerType/DefaultContainerDNSFlagTest.ValidateFlag/1 (9 ms)
[----------] 2 tests from ContainerizerType/DefaultContainerDNSFlagTest (19 ms total)

[----------] Global test environment tear-down
[==========] 1696 tests from 185 test cases ran. (791503 ms total)
[  PASSED  ] 1694 tests.
[  FAILED  ] 2 tests, listed below:
[  FAILED  ] MasterAuthorizationTest.PendingExecutorInfoDiffersOnDifferentSlaves
[  FAILED  ] MesosContainerizer/DefaultExecutorTest.ReservedResources/0, where GetParam()
= "mesos"

 2 FAILED TESTS
  YOU HAVE 21 DISABLED TESTS

I1017 20:58:27.610172  5520 process.cpp:1068] Failed to accept socket: future discarded
make[4]: *** [check-local] Error 1
make[4]: Leaving directory `/mesos/mesos-1.5.0/_build/src'
make[3]: *** [check-am] Error 2
make[3]: Leaving directory `/mesos/mesos-1.5.0/_build/src'
make[2]: *** [check] Error 2
make[2]: Leaving directory `/mesos/mesos-1.5.0/_build/src'
make[1]: *** [check-recursive] Error 1
make[1]: Leaving directory `/mesos/mesos-1.5.0/_build'
make: *** [distcheck] Error 1
+ docker rmi mesos-1508270287-28621
Untagged: mesos-1508270287-28621:latest
Deleted: sha256:9657f47be1700d7a50cee2c65877f25ca4c33a56cea34210ca7ff8fbbd8430c2
Deleted: sha256:94d935a046704e4096b61a74c729104d87393c87f84d71735c16eb57aee2eb7c
Deleted: sha256:615d3022207bc0cba0ce504f0b7638f0c69b8afb97d216ba376ed2b853741cf8
Deleted: sha256:fa8ce75d27251ed6eaa63c4a474fbd0a181617cbb9c90a690ce58d81e4cb9a0e
Deleted: sha256:410a4f73fe8765b942de9b2b806a6d7cfab2f7fd2ee0e5817b246877abddfeb0
Deleted: sha256:ce56a32d16d57219e1a62a516dbe3123c5b7d555759b82cc7016625a919e8061
Deleted: sha256:9fca81354cf9b775aa139284fca12cb00704cf80d79c90612d2946ef1dd40b19
Deleted: sha256:1c7585db8237a63ef3e46d0ad3f150afeeb05ef5e6e30de067aba951f49c916f
Deleted: sha256:3cb216b6ea350d24a26551bd27cd18693445c13604b55609e7a5d0d45699c182
Deleted: sha256:5a486843718621a8f42b06d2c48d08553afc53b9729cdec0713221ccc135dae0
Deleted: sha256:609035ab511cddbc4efd7ab3df24405c49425c3b8976f316cd26bc857bad9ef2
Deleted: sha256:b5091041320ac1675f972541f0f52c2faa7e28af59c23f7132175892134f0b17
Deleted: sha256:c2f0dcd955111ad5ec275e94bde08d2157cc27fb6f47b6af54d3216c525143bc
Deleted: sha256:b9a2d80627890ea3291110e995b46d6e86d58465b774dd77fc0f19f76474b893
Deleted: sha256:8b1cc781dcf6c58165e19808f87239d137cb3d39af08ef098e6b1bd398f28ddb
Deleted: sha256:8358ed9d6cc8b0c6578b66bf2ef8a85fdb11c989537e0c9c2e5add0aa969a2a0
Deleted: sha256:3c588cae690f19ac507ba03cada4200c4f414a9c1c4fef451763d33ee576a898
Deleted: sha256:4d9e02e5dbc46cf8c5207412ea5fb09981cf0baafb92075d79c6315f29ed72f2
Deleted: sha256:abf662382574091658beeea9ae0dbc1d16f19db9c22c40c838974106c4821476
Deleted: sha256:3c0fc03323b36e735f4844a28b67651521217644d9c920d8b778928ee734016e
Deleted: sha256:afb1db0e881816a63ff23abb1e631be980469d2a18bab824dcb210dcf28d2c74
Deleted: sha256:604b742aa81ebccf539577fbaf7bb8e8e4528a7a02fd083155b166d652a16440
Deleted: sha256:becbb19b113267d37b84ce9f20044926a1893ae24b0387e9a71519af09b09000
Deleted: sha256:70f420e6a461945d5d62070d88535d9e7d5c6ce7fd4cee6d0f909c136cd17f2b
Deleted: sha256:ca8ea9c412f30793f276e3d58584ca083d8ae964a2e164d260bcf899f6f924e1
Deleted: sha256:b723b3367f06d67375bd354acc1b9a8e6b375207fff6473623be4d01bf2fa204
Deleted: sha256:5ab5de18426aec0b12173b471ef96c294242ad38407d136b57c0d28ba6626aef
Deleted: sha256:fd836eac948f3d01abceb9172b957fa22ba71284e667efaba5a4431e248fe2b1
Build step 'Execute shell' marked build as failure
Not sending mail to unregistered user benjamin.hindman@gmail.com


Mime
View raw message