mesos-builds mailing list archives

Site index · List index
Message view « Date » · « Thread »
Top « Date » · « Thread »
From Apache Jenkins Server <jenk...@builds.apache.org>
Subject Build failed in Jenkins: Mesos-Reviewbot #19772
Date Thu, 12 Oct 2017 22:20:52 GMT
See <https://builds.apache.org/job/Mesos-Reviewbot/19772/display/redirect?page=changes>

Changes:

[yujie.jay] Synced the MTU for container eth0 in port mapping isolator.

------------------------------------------
[...truncated 32.47 MB...]
I1012 22:20:30.277581  5656 http.cpp:1045] Creating default 'basic' HTTP authenticator for
realm 'mesos-agent-readonly'
I1012 22:20:30.277755  5656 http.cpp:1045] Creating default 'basic' HTTP authenticator for
realm 'mesos-agent-readwrite'
I1012 22:20:30.279389  5656 slave.cpp:585] Agent resources: [{"name":"cpus","scalar":{"value":2.0},"type":"SCALAR"},{"name":"mem","scalar":{"value":1024.0},"type":"SCALAR"},{"name":"disk","scalar":{"value":1024.0},"type":"SCALAR"},{"name":"ports","ranges":{"range":[{"begin":31000,"end":32000}]},"type":"RANGES"}]
I1012 22:20:30.279649  5656 slave.cpp:593] Agent attributes: [  ]
I1012 22:20:30.279664  5656 slave.cpp:602] Agent hostname: e9f78efb6983
I1012 22:20:30.279886  5634 status_update_manager.cpp:177] Pausing sending status updates
I1012 22:20:30.281842  5648 state.cpp:64] Recovering state from '/tmp/Endpoint_SlaveEndpointTest_AuthorizedRequest_2_yOVBPY/meta'
I1012 22:20:30.282250  5648 status_update_manager.cpp:203] Recovering status update manager
I1012 22:20:30.282496  5653 containerizer.cpp:648] Recovering containerizer
I1012 22:20:30.284420  5646 provisioner.cpp:416] Provisioner recovery complete
I1012 22:20:30.285063  5634 slave.cpp:6310] Finished recovery
I1012 22:20:30.285585  5634 slave.cpp:6492] Querying resource estimator for oversubscribable
resources
I1012 22:20:30.285905  5641 slave.cpp:6506] Received oversubscribable resources {} from the
resource estimator
I1012 22:20:30.288517  5639 process.cpp:3929] Handling HTTP event for process 'slave(821)'
with path: '/slave(821)/containers'
I1012 22:20:30.290303  5655 http.cpp:1185] HTTP GET for /slave(821)/containers from 172.17.0.4:43894
I1012 22:20:30.290416  5655 http.cpp:976] Authorizing principal 'test-principal' to GET the
'/containers' endpoint
I1012 22:20:30.295346  5633 slave.cpp:869] Agent terminating
[       OK ] Endpoint/SlaveEndpointTest.AuthorizedRequest/2 (39 ms)
[ RUN      ] Endpoint/SlaveEndpointTest.UnauthorizedRequest/0
I1012 22:20:30.314007  5633 containerizer.cpp:292] Using isolation { environment_secret, posix/cpu,
posix/mem, filesystem/posix, network/cni }
W1012 22:20:30.314873  5633 backend.cpp:76] Failed to create 'aufs' backend: AufsBackend requires
root privileges
W1012 22:20:30.315065  5633 backend.cpp:76] Failed to create 'bind' backend: BindBackend requires
root privileges
I1012 22:20:30.315131  5633 provisioner.cpp:255] Using default backend 'copy'
I1012 22:20:30.321350  5653 slave.cpp:254] Mesos agent started on (822)@172.17.0.4:38372
I1012 22:20:30.321398  5653 slave.cpp:255] Flags at startup: --acls="" --appc_simple_discovery_uri_prefix="http://"
--appc_store_dir="/tmp/Endpoint_SlaveEndpointTest_UnauthorizedRequest_0_hRi4HT/store/appc"
--authenticate_http_readonly="true" --authenticate_http_readwrite="true" --authenticatee="crammd5"
--authentication_backoff_factor="1secs" --authorizer="local" --cgroups_cpu_enable_pids_and_tids_count="false"
--cgroups_enable_cfs="false" --cgroups_hierarchy="/sys/fs/cgroup" --cgroups_limit_swap="false"
--cgroups_root="mesos" --container_disk_watch_interval="15secs" --containerizers="mesos" --credential="/tmp/Endpoint_SlaveEndpointTest_UnauthorizedRequest_0_hRi4HT/credential"
--default_role="*" --disallow_sharing_agent_pid_namespace="false" --disk_watch_interval="1mins"
--docker="docker" --docker_kill_orphans="true" --docker_registry="https://registry-1.docker.io"
--docker_remove_delay="6hrs" --docker_socket="/var/run/docker.sock" --docker_stop_timeout="0ns"
--docker_store_dir="/tmp/Endpoint_SlaveEndpointTest_UnauthorizedRequest_0_hRi4HT/store/docker"
--docker_volume_checkpoint_dir="/var/run/mesos/isolators/docker/volume" --enforce_container_disk_quota="false"
--executor_registration_timeout="1mins" --executor_reregistration_timeout="2secs" --executor_shutdown_grace_period="5secs"
--fetcher_cache_dir="/tmp/Endpoint_SlaveEndpointTest_UnauthorizedRequest_0_hRi4HT/fetch" --fetcher_cache_size="2GB"
--frameworks_home="" --gc_delay="1weeks" --gc_disk_headroom="0.1" --hadoop_home="" --help="false"
--hostname_lookup="true" --http_command_executor="false" --http_credentials="/tmp/Endpoint_SlaveEndpointTest_UnauthorizedRequest_0_hRi4HT/http_credentials"
--http_heartbeat_interval="30secs" --initialize_driver_logging="true" --isolation="posix/cpu,posix/mem"
--launcher="posix" --launcher_dir="/mesos/mesos-1.5.0/_build/src" --logbufsecs="0" --logging_level="INFO"
--max_completed_executors_per_framework="150" --oversubscribed_resources_interval="15secs"
--perf_duration="10secs" --perf_interval="1mins" --port="5051" --qos_correction_interval_min="0ns"
--quiet="false" --recover="reconnect" --recovery_timeout="15mins" --registration_backoff_factor="10ms"
--resources="cpus:2;gpus:0;mem:1024;disk:1024;ports:[31000-32000]" --revocable_cpu_low_priority="true"
--runtime_dir="/tmp/Endpoint_SlaveEndpointTest_UnauthorizedRequest_0_hRi4HT" --sandbox_directory="/mnt/mesos/sandbox"
--strict="true" --switch_user="true" --systemd_enable_support="true" --systemd_runtime_directory="/run/systemd/system"
--version="false" --work_dir="/tmp/Endpoint_SlaveEndpointTest_UnauthorizedRequest_0_GiaLiI"
--zk_session_timeout="10secs"
I1012 22:20:30.321997  5653 credentials.hpp:86] Loading credential for authentication from
'/tmp/Endpoint_SlaveEndpointTest_UnauthorizedRequest_0_hRi4HT/credential'
I1012 22:20:30.322213  5653 slave.cpp:287] Agent using credential for: test-principal
I1012 22:20:30.322243  5653 credentials.hpp:37] Loading credentials for authentication from
'/tmp/Endpoint_SlaveEndpointTest_UnauthorizedRequest_0_hRi4HT/http_credentials'
I1012 22:20:30.322578  5653 http.cpp:1045] Creating default 'basic' HTTP authenticator for
realm 'mesos-agent-readonly'
I1012 22:20:30.322794  5653 http.cpp:1045] Creating default 'basic' HTTP authenticator for
realm 'mesos-agent-readwrite'
I1012 22:20:30.324635  5653 slave.cpp:585] Agent resources: [{"name":"cpus","scalar":{"value":2.0},"type":"SCALAR"},{"name":"mem","scalar":{"value":1024.0},"type":"SCALAR"},{"name":"disk","scalar":{"value":1024.0},"type":"SCALAR"},{"name":"ports","ranges":{"range":[{"begin":31000,"end":32000}]},"type":"RANGES"}]
I1012 22:20:30.324928  5653 slave.cpp:593] Agent attributes: [  ]
I1012 22:20:30.324944  5653 slave.cpp:602] Agent hostname: e9f78efb6983
I1012 22:20:30.325151  5637 status_update_manager.cpp:177] Pausing sending status updates
I1012 22:20:30.327086  5643 state.cpp:64] Recovering state from '/tmp/Endpoint_SlaveEndpointTest_UnauthorizedRequest_0_GiaLiI/meta'
I1012 22:20:30.327602  5648 status_update_manager.cpp:203] Recovering status update manager
I1012 22:20:30.327994  5638 containerizer.cpp:648] Recovering containerizer
I1012 22:20:30.330003  5642 provisioner.cpp:416] Provisioner recovery complete
I1012 22:20:30.330536  5642 slave.cpp:6310] Finished recovery
I1012 22:20:30.331110  5642 slave.cpp:6492] Querying resource estimator for oversubscribable
resources
I1012 22:20:30.331550  5645 slave.cpp:6506] Received oversubscribable resources {} from the
resource estimator
I1012 22:20:30.334347  5641 process.cpp:3929] Handling HTTP event for process 'slave(822)'
with path: '/slave(822)/monitor/statistics'
I1012 22:20:30.336450  5657 http.cpp:1185] HTTP GET for /slave(822)/monitor/statistics from
172.17.0.4:43896
I1012 22:20:30.336549  5657 http.cpp:976] Authorizing principal 'test-principal' to GET the
'/monitor/statistics' endpoint
I1012 22:20:30.340128  5633 slave.cpp:869] Agent terminating
[       OK ] Endpoint/SlaveEndpointTest.UnauthorizedRequest/0 (43 ms)
[ RUN      ] Endpoint/SlaveEndpointTest.UnauthorizedRequest/1
I1012 22:20:30.355873  5633 containerizer.cpp:292] Using isolation { environment_secret, posix/cpu,
posix/mem, filesystem/posix, network/cni }
W1012 22:20:30.356497  5633 backend.cpp:76] Failed to create 'aufs' backend: AufsBackend requires
root privileges
W1012 22:20:30.356631  5633 backend.cpp:76] Failed to create 'bind' backend: BindBackend requires
root privileges
I1012 22:20:30.356674  5633 provisioner.cpp:255] Using default backend 'copy'
I1012 22:20:30.361382  5634 slave.cpp:254] Mesos agent started on (823)@172.17.0.4:38372
I1012 22:20:30.361416  5634 slave.cpp:255] Flags at startup: --acls="" --appc_simple_discovery_uri_prefix="http://"
--appc_store_dir="/tmp/Endpoint_SlaveEndpointTest_UnauthorizedRequest_1_TrAkHD/store/appc"
--authenticate_http_readonly="true" --authenticate_http_readwrite="true" --authenticatee="crammd5"
--authentication_backoff_factor="1secs" --authorizer="local" --cgroups_cpu_enable_pids_and_tids_count="false"
--cgroups_enable_cfs="false" --cgroups_hierarchy="/sys/fs/cgroup" --cgroups_limit_swap="false"
--cgroups_root="mesos" --container_disk_watch_interval="15secs" --containerizers="mesos" --credential="/tmp/Endpoint_SlaveEndpointTest_UnauthorizedRequest_1_TrAkHD/credential"
--default_role="*" --disallow_sharing_agent_pid_namespace="false" --disk_watch_interval="1mins"
--docker="docker" --docker_kill_orphans="true" --docker_registry="https://registry-1.docker.io"
--docker_remove_delay="6hrs" --docker_socket="/var/run/docker.sock" --docker_stop_timeout="0ns"
--docker_store_dir="/tmp/Endpoint_SlaveEndpointTest_UnauthorizedRequest_1_TrAkHD/store/docker"
--docker_volume_checkpoint_dir="/var/run/mesos/isolators/docker/volume" --enforce_container_disk_quota="false"
--executor_registration_timeout="1mins" --executor_reregistration_timeout="2secs" --executor_shutdown_grace_period="5secs"
--fetcher_cache_dir="/tmp/Endpoint_SlaveEndpointTest_UnauthorizedRequest_1_TrAkHD/fetch" --fetcher_cache_size="2GB"
--frameworks_home="" --gc_delay="1weeks" --gc_disk_headroom="0.1" --hadoop_home="" --help="false"
--hostname_lookup="true" --http_command_executor="false" --http_credentials="/tmp/Endpoint_SlaveEndpointTest_UnauthorizedRequest_1_TrAkHD/http_credentials"
--http_heartbeat_interval="30secs" --initialize_driver_logging="true" --isolation="posix/cpu,posix/mem"
--launcher="posix" --launcher_dir="/mesos/mesos-1.5.0/_build/src" --logbufsecs="0" --logging_level="INFO"
--max_completed_executors_per_framework="150" --oversubscribed_resources_interval="15secs"
--perf_duration="10secs" --perf_interval="1mins" --port="5051" --qos_correction_interval_min="0ns"
--quiet="false" --recover="reconnect" --recovery_timeout="15mins" --registration_backoff_factor="10ms"
--resources="cpus:2;gpus:0;mem:1024;disk:1024;ports:[31000-32000]" --revocable_cpu_low_priority="true"
--runtime_dir="/tmp/Endpoint_SlaveEndpointTest_UnauthorizedRequest_1_TrAkHD" --sandbox_directory="/mnt/mesos/sandbox"
--strict="true" --switch_user="true" --systemd_enable_support="true" --systemd_runtime_directory="/run/systemd/system"
--version="false" --work_dir="/tmp/Endpoint_SlaveEndpointTest_UnauthorizedRequest_1_uL4Bbs"
--zk_session_timeout="10secs"
I1012 22:20:30.361965  5634 credentials.hpp:86] Loading credential for authentication from
'/tmp/Endpoint_SlaveEndpointTest_UnauthorizedRequest_1_TrAkHD/credential'
I1012 22:20:30.362217  5634 slave.cpp:287] Agent using credential for: test-principal
I1012 22:20:30.362258  5634 credentials.hpp:37] Loading credentials for authentication from
'/tmp/Endpoint_SlaveEndpointTest_UnauthorizedRequest_1_TrAkHD/http_credentials'
I1012 22:20:30.362689  5634 http.cpp:1045] Creating default 'basic' HTTP authenticator for
realm 'mesos-agent-readonly'
I1012 22:20:30.362943  5634 http.cpp:1045] Creating default 'basic' HTTP authenticator for
realm 'mesos-agent-readwrite'
I1012 22:20:30.365314  5634 slave.cpp:585] Agent resources: [{"name":"cpus","scalar":{"value":2.0},"type":"SCALAR"},{"name":"mem","scalar":{"value":1024.0},"type":"SCALAR"},{"name":"disk","scalar":{"value":1024.0},"type":"SCALAR"},{"name":"ports","ranges":{"range":[{"begin":31000,"end":32000}]},"type":"RANGES"}]
I1012 22:20:30.365713  5634 slave.cpp:593] Agent attributes: [  ]
I1012 22:20:30.365734  5634 slave.cpp:602] Agent hostname: e9f78efb6983
I1012 22:20:30.365973  5652 status_update_manager.cpp:177] Pausing sending status updates
I1012 22:20:30.368103  5640 state.cpp:64] Recovering state from '/tmp/Endpoint_SlaveEndpointTest_UnauthorizedRequest_1_uL4Bbs/meta'
I1012 22:20:30.368536  5657 status_update_manager.cpp:203] Recovering status update manager
I1012 22:20:30.368762  5656 containerizer.cpp:648] Recovering containerizer
I1012 22:20:30.370791  5643 provisioner.cpp:416] Provisioner recovery complete
I1012 22:20:30.371315  5643 slave.cpp:6310] Finished recovery
I1012 22:20:30.371825  5643 slave.cpp:6492] Querying resource estimator for oversubscribable
resources
I1012 22:20:30.372303  5657 slave.cpp:6506] Received oversubscribable resources {} from the
resource estimator
I1012 22:20:30.375586  5646 process.cpp:3929] Handling HTTP event for process 'slave(823)'
with path: '/slave(823)/monitor/statistics.json'
I1012 22:20:30.377352  5654 http.cpp:1185] HTTP GET for /slave(823)/monitor/statistics.json
from 172.17.0.4:43898
I1012 22:20:30.377439  5654 http.cpp:976] Authorizing principal 'test-principal' to GET the
'/monitor/statistics.json' endpoint
I1012 22:20:30.380410  5641 slave.cpp:869] Agent terminating
[       OK ] Endpoint/SlaveEndpointTest.UnauthorizedRequest/1 (41 ms)
[ RUN      ] Endpoint/SlaveEndpointTest.UnauthorizedRequest/2
I1012 22:20:30.398762  5633 containerizer.cpp:292] Using isolation { environment_secret, posix/cpu,
posix/mem, filesystem/posix, network/cni }
W1012 22:20:30.399574  5633 backend.cpp:76] Failed to create 'aufs' backend: AufsBackend requires
root privileges
W1012 22:20:30.399760  5633 backend.cpp:76] Failed to create 'bind' backend: BindBackend requires
root privileges
I1012 22:20:30.399817  5633 provisioner.cpp:255] Using default backend 'copy'
I1012 22:20:30.405095  5657 slave.cpp:254] Mesos agent started on (824)@172.17.0.4:38372
I1012 22:20:30.405125  5657 slave.cpp:255] Flags at startup: --acls="" --appc_simple_discovery_uri_prefix="http://"
--appc_store_dir="/tmp/Endpoint_SlaveEndpointTest_UnauthorizedRequest_2_8IXl5n/store/appc"
--authenticate_http_readonly="true" --authenticate_http_readwrite="true" --authenticatee="crammd5"
--authentication_backoff_factor="1secs" --authorizer="local" --cgroups_cpu_enable_pids_and_tids_count="false"
--cgroups_enable_cfs="false" --cgroups_hierarchy="/sys/fs/cgroup" --cgroups_limit_swap="false"
--cgroups_root="mesos" --container_disk_watch_interval="15secs" --containerizers="mesos" --credential="/tmp/Endpoint_SlaveEndpointTest_UnauthorizedRequest_2_8IXl5n/credential"
--default_role="*" --disallow_sharing_agent_pid_namespace="false" --disk_watch_interval="1mins"
--docker="docker" --docker_kill_orphans="true" --docker_registry="https://registry-1.docker.io"
--docker_remove_delay="6hrs" --docker_socket="/var/run/docker.sock" --docker_stop_timeout="0ns"
--docker_store_dir="/tmp/Endpoint_SlaveEndpointTest_UnauthorizedRequest_2_8IXl5n/store/docker"
--docker_volume_checkpoint_dir="/var/run/mesos/isolators/docker/volume" --enforce_container_disk_quota="false"
--executor_registration_timeout="1mins" --executor_reregistration_timeout="2secs" --executor_shutdown_grace_period="5secs"
--fetcher_cache_dir="/tmp/Endpoint_SlaveEndpointTest_UnauthorizedRequest_2_8IXl5n/fetch" --fetcher_cache_size="2GB"
--frameworks_home="" --gc_delay="1weeks" --gc_disk_headroom="0.1" --hadoop_home="" --help="false"
--hostname_lookup="true" --http_command_executor="false" --http_credentials="/tmp/Endpoint_SlaveEndpointTest_UnauthorizedRequest_2_8IXl5n/http_credentials"
--http_heartbeat_interval="30secs" --initialize_driver_logging="true" --isolation="posix/cpu,posix/mem"
--launcher="posix" --launcher_dir="/mesos/mesos-1.5.0/_build/src" --logbufsecs="0" --logging_level="INFO"
--max_completed_executors_per_framework="150" --oversubscribed_resources_interval="15secs"
--perf_duration="10secs" --perf_interval="1mins" --port="5051" --qos_correction_interval_min="0ns"
--quiet="false" --recover="reconnect" --recovery_timeout="15mins" --registration_backoff_factor="10ms"
--resources="cpus:2;gpus:0;mem:1024;disk:1024;ports:[31000-32000]" --revocable_cpu_low_priority="true"
--runtime_dir="/tmp/Endpoint_SlaveEndpointTest_UnauthorizedRequest_2_8IXl5n" --sandbox_directory="/mnt/mesos/sandbox"
--strict="true" --switch_user="true" --systemd_enable_support="true" --systemd_runtime_directory="/run/systemd/system"
--version="false" --work_dir="/tmp/Endpoint_SlaveEndpointTest_UnauthorizedRequest_2_1XTntc"
--zk_session_timeout="10secs"
I1012 22:20:30.405525  5657 credentials.hpp:86] Loading credential for authentication from
'/tmp/Endpoint_SlaveEndpointTest_UnauthorizedRequest_2_8IXl5n/credential'
I1012 22:20:30.405678  5657 slave.cpp:287] Agent using credential for: test-principal
I1012 22:20:30.405702  5657 credentials.hpp:37] Loading credentials for authentication from
'/tmp/Endpoint_SlaveEndpointTest_UnauthorizedRequest_2_8IXl5n/http_credentials'
I1012 22:20:30.405972  5657 http.cpp:1045] Creating default 'basic' HTTP authenticator for
realm 'mesos-agent-readonly'
I1012 22:20:30.406179  5657 http.cpp:1045] Creating default 'basic' HTTP authenticator for
realm 'mesos-agent-readwrite'
I1012 22:20:30.408296  5657 slave.cpp:585] Agent resources: [{"name":"cpus","scalar":{"value":2.0},"type":"SCALAR"},{"name":"mem","scalar":{"value":1024.0},"type":"SCALAR"},{"name":"disk","scalar":{"value":1024.0},"type":"SCALAR"},{"name":"ports","ranges":{"range":[{"begin":31000,"end":32000}]},"type":"RANGES"}]
I1012 22:20:30.408638  5657 slave.cpp:593] Agent attributes: [  ]
I1012 22:20:30.408658  5657 slave.cpp:602] Agent hostname: e9f78efb6983
I1012 22:20:30.408923  5649 status_update_manager.cpp:177] Pausing sending status updates
I1012 22:20:30.410720  5648 state.cpp:64] Recovering state from '/tmp/Endpoint_SlaveEndpointTest_UnauthorizedRequest_2_1XTntc/meta'
I1012 22:20:30.411190  5639 status_update_manager.cpp:203] Recovering status update manager
I1012 22:20:30.411451  5639 containerizer.cpp:648] Recovering containerizer
I1012 22:20:30.413377  5650 provisioner.cpp:416] Provisioner recovery complete
I1012 22:20:30.413970  5650 slave.cpp:6310] Finished recovery
I1012 22:20:30.414613  5650 slave.cpp:6492] Querying resource estimator for oversubscribable
resources
I1012 22:20:30.414981  5652 slave.cpp:6506] Received oversubscribable resources {} from the
resource estimator
I1012 22:20:30.417712  5641 process.cpp:3929] Handling HTTP event for process 'slave(824)'
with path: '/slave(824)/containers'
I1012 22:20:30.419507  5645 http.cpp:1185] HTTP GET for /slave(824)/containers from 172.17.0.4:43900
I1012 22:20:30.419608  5645 http.cpp:976] Authorizing principal 'test-principal' to GET the
'/containers' endpoint
I1012 22:20:30.423176  5633 slave.cpp:869] Agent terminating
[       OK ] Endpoint/SlaveEndpointTest.UnauthorizedRequest/2 (40 ms)
[ RUN      ] Endpoint/SlaveEndpointTest.NoAuthorizer/0
I1012 22:20:30.440847  5633 containerizer.cpp:292] Using isolation { environment_secret, posix/cpu,
posix/mem, filesystem/posix, network/cni }
W1012 22:20:30.441658  5633 backend.cpp:76] Failed to create 'aufs' backend: AufsBackend requires
root privileges
W1012 22:20:30.441855  5633 backend.cpp:76] Failed to create 'bind' backend: BindBackend requires
root privileges
I1012 22:20:30.441910  5633 provisioner.cpp:255] Using default backend 'copy'
I1012 22:20:30.444728  5633 cluster.cpp:448] Creating default 'local' authorizer
I1012 22:20:30.447656  5655 slave.cpp:254] Mesos agent started on (825)@172.17.0.4:38372
I1012 22:20:30.447695  5655 slave.cpp:255] Flags at startup: --acls="" --appc_simple_discovery_uri_prefix="http://"
--appc_store_dir="/tmp/Endpoint_SlaveEndpointTest_NoAuthorizer_0_u7UdS8/store/appc" --authenticate_http_readonly="true"
--authenticate_http_readwrite="true" --authenticatee="crammd5" --authentication_backoff_factor="1secs"
--authorizer="local" --cgroups_cpu_enable_pids_and_tids_count="false" --cgroups_enable_cfs="false"
--cgroups_hierarchy="/sys/fs/cgroup" --cgroups_limit_swap="false" --cgroups_root="mesos" --container_disk_watch_interval="15secs"
--containerizers="mesos" --credential="/tmp/Endpoint_SlaveEndpointTest_NoAuthorizer_0_u7UdS8/credential"
--default_role="*" --disallow_sharing_agent_pid_namespace="false" --disk_watch_interval="1mins"
--docker="docker" --docker_kill_orphans="true" --docker_registry="https://registry-1.docker.io"
--docker_remove_delay="6hrs" --docker_socket="/var/run/docker.sock" --docker_stop_timeout="0ns"
--docker_store_dir="/tmp/Endpoint_SlaveEndpointTest_NoAuthorizer_0_u7UdS8/store/docker" --docker_volume_checkpoint_dir="/var/run/mesos/isolators/docker/volume"
--enforce_container_disk_quota="false" --executor_registration_timeout="1mins" --executor_reregistration_timeout="2secs"
--executor_shutdown_grace_period="5secs" --fetcher_cache_dir="/tmp/Endpoint_SlaveEndpointTest_NoAuthorizer_0_u7UdS8/fetch"
--fetcher_cache_size="2GB" --frameworks_home="" --gc_delay="1weeks" --gc_disk_headroom="0.1"
--hadoop_home="" --help="false" --hostname_lookup="true" --http_command_executor="false" --http_credentials="/tmp/Endpoint_SlaveEndpointTest_NoAuthorizer_0_u7UdS8/http_credentials"
--http_heartbeat_interval="30secs" --initialize_driver_logging="true" --isolation="posix/cpu,posix/mem"
--launcher="posix" --launcher_dir="/mesos/mesos-1.5.0/_build/src" --logbufsecs="0" --logging_level="INFO"
--max_completed_executors_per_framework="150" --oversubscribed_resources_interval="15secs"
--perf_duration="10secs" --perf_interval="1mins" --port="5051" --qos_correction_interval_min="0ns"
--quiet="false" --recover="reconnect" --recovery_timeout="15mins" --registration_backoff_factor="10ms"
--resources="cpus:2;gpus:0;mem:1024;disk:1024;ports:[31000-32000]" --revocable_cpu_low_priority="true"
--runtime_dir="/tmp/Endpoint_SlaveEndpointTest_NoAuthorizer_0_u7UdS8" --sandbox_directory="/mnt/mesos/sandbox"
--strict="true" --switch_user="true" --systemd_enable_support="true" --systemd_runtime_directory="/run/systemd/system"
--version="false" --work_dir="/tmp/Endpoint_SlaveEndpointTest_NoAuthorizer_0_ehe49W" --zk_session_timeout="10secs"
I1012 22:20:30.448158  5655 credentials.hpp:86] Loading credential for authentication from
'/tmp/Endpoint_SlaveEndpointTest_NoAuthorizer_0_u7UdS8/credential'
I1012 22:20:30.448355  5655 slave.cpp:287] Agent using credential for: test-principal
I1012 22:20:30.448385  5655 credentials.hpp:37] Loading credentials for authentication from
'/tmp/Endpoint_SlaveEndpointTest_NoAuthorizer_0_u7UdS8/http_credentials'
I1012 22:20:30.448704  5655 http.cpp:1045] Creating default 'basic' HTTP authenticator for
realm 'mesos-agent-readonly'
I1012 22:20:30.448930  5655 http.cpp:1045] Creating default 'basic' HTTP authenticator for
realm 'mesos-agent-readwrite'
I1012 22:20:30.450938  5655 slave.cpp:585] Agent resources: [{"name":"cpus","scalar":{"value":2.0},"type":"SCALAR"},{"name":"mem","scalar":{"value":1024.0},"type":"SCALAR"},{"name":"disk","scalar":{"value":1024.0},"type":"SCALAR"},{"name":"ports","ranges":{"range":[{"begin":31000,"end":32000}]},"type":"RANGES"}]
I1012 22:20:30.451259  5655 slave.cpp:593] Agent attributes: [  ]
I1012 22:20:30.451277  5655 slave.cpp:602] Agent hostname: e9f78efb6983
I1012 22:20:30.451508  5638 status_update_manager.cpp:177] Pausing sending status updates
I1012 22:20:30.453303  5643 state.cpp:64] Recovering state from '/tmp/Endpoint_SlaveEndpointTest_NoAuthorizer_0_ehe49W/meta'
I1012 22:20:30.453732  5657 status_update_manager.cpp:203] Recovering status update manager
I1012 22:20:30.454056  5657 containerizer.cpp:648] Recovering containerizer
I1012 22:20:30.455934  5637 provisioner.cpp:416] Provisioner recovery complete
I1012 22:20:30.456532  5638 slave.cpp:6310] Finished recovery
I1012 22:20:30.457170  5638 slave.cpp:6492] Querying resource estimator for oversubscribable
resources
I1012 22:20:30.457532  5635 slave.cpp:6506] Received oversubscribable resources {} from the
resource estimator
I1012 22:20:30.460314  5647 process.cpp:3929] Handling HTTP event for process 'slave(825)'
with path: '/slave(825)/monitor/statistics'
I1012 22:20:30.461894  5642 http.cpp:1185] HTTP GET for /slave(825)/monitor/statistics from
172.17.0.4:43902
I1012 22:20:30.461971  5642 http.cpp:976] Authorizing principal 'test-principal' to GET the
'/monitor/statistics' endpoint
I1012 22:20:30.467023  5633 slave.cpp:869] Agent terminating
[       OK ] Endpoint/SlaveEndpointTest.NoAuthorizer/0 (42 ms)
[ RUN      ] Endpoint/SlaveEndpointTest.NoAuthorizer/1
I1012 22:20:30.481631  5633 containerizer.cpp:292] Using isolation { environment_secret, posix/cpu,
posix/mem, filesystem/posix, network/cni }
W1012 22:20:30.482259  5633 backend.cpp:76] Failed to create 'aufs' backend: AufsBackend requires
root privileges
W1012 22:20:30.482445  5633 backend.cpp:76] Failed to create 'bind' backend: BindBackend requires
root privileges
I1012 22:20:30.482493  5633 provisioner.cpp:255] Using default backend 'copy'
I1012 22:20:30.484397  5633 cluster.cpp:448] Creating default 'local' authorizer
I1012 22:20:30.486935  5636 slave.cpp:254] Mesos agent started on (826)@172.17.0.4:38372
I1012 22:20:30.486968  5636 slave.cpp:255] Flags at startup: --acls="" --appc_simple_discovery_uri_prefix="http://"
--appc_store_dir="/tmp/Endpoint_SlaveEndpointTest_NoAuthorizer_1_R9Hq4T/store/appc" --authenticate_http_readonly="true"
--authenticate_http_readwrite="true" --authenticatee="crammd5" --authentication_backoff_factor="1secs"
--authorizer="local" --cgroups_cpu_enable_pids_and_tids_count="false" --cgroups_enable_cfs="false"
--cgroups_hierarchy="/sys/fs/cgroup" --cgroups_limit_swap="false" --cgroups_root="mesos" --container_disk_watch_interval="15secs"
--containerizers="mesos" --credential="/tmp/Endpoint_SlaveEndpointTest_NoAuthorizer_1_R9Hq4T/credential"
--default_role="*" --disallow_sharing_agent_pid_namespace="false" --disk_watch_interval="1mins"
--docker="docker" --docker_kill_orphans="true" --docker_registry="https://registry-1.docker.io"
--docker_remove_delay="6hrs" --docker_socket="/var/run/docker.sock" --docker_stop_timeout="0ns"
--docker_store_dir="/tmp/Endpoint_SlaveEndpointTest_NoAuthorizer_1_R9Hq4T/store/docker" --docker_volume_checkpoint_dir="/var/run/mesos/isolators/docker/volume"
--enforce_container_disk_quota="false" --executor_registration_timeout="1mins" --executor_reregistration_timeout="2secs"
--executor_shutdown_grace_period="5secs" --fetcher_cache_dir="/tmp/Endpoint_SlaveEndpointTest_NoAuthorizer_1_R9Hq4T/fetch"
--fetcher_cache_size="2GB" --frameworks_home="" --gc_delay="1weeks" --gc_disk_headroom="0.1"
--hadoop_home="" --help="false" --hostname_lookup="true" --http_command_executor="false" --http_credentials="/tmp/Endpoint_SlaveEndpointTest_NoAuthorizer_1_R9Hq4T/http_credentials"
--http_heartbeat_interval="30secs" --initialize_driver_logging="true" --isolation="posix/cpu,posix/mem"
--launcher="posix" --launcher_dir="/mesos/mesos-1.5.0/_build/src" --logbufsecs="0" --logging_level="INFO"
--max_completed_executors_per_framework="150" --oversubscribed_resources_interval="15secs"
--perf_duration="10secs" --perf_interval="1mins" --port="5051" --qos_correction_interval_min="0ns"
--quiet="false" --recover="reconnect" --recovery_timeout="15mins" --registration_backoff_factor="10ms"
--resources="cpus:2;gpus:0;mem:1024;disk:1024;ports:[31000-32000]" --revocable_cpu_low_priority="true"
--runtime_dir="/tmp/Endpoint_SlaveEndpointTest_NoAuthorizer_1_R9Hq4T" --sandbox_directory="/mnt/mesos/sandbox"
--strict="true" --switch_user="true" --systemd_enable_support="true" --systemd_runtime_directory="/run/systemd/system"
--version="false" --work_dir="/tmp/Endpoint_SlaveEndpointTest_NoAuthorizer_1_vo9ZfI" --zk_session_timeout="10secs"
I1012 22:20:30.487453  5636 credentials.hpp:86] Loading credential for authentication from
'/tmp/Endpoint_SlaveEndpointTest_NoAuthorizer_1_R9Hq4T/credential'
I1012 22:20:30.487625  5636 slave.cpp:287] Agent using credential for: test-principal
I1012 22:20:30.487650  5636 credentials.hpp:37] Loading credentials for authentication from
'/tmp/Endpoint_SlaveEndpointTest_NoAuthorizer_1_R9Hq4T/http_credentials'
I1012 22:20:30.487911  5636 http.cpp:1045] Creating default 'basic' HTTP authenticator for
realm 'mesos-agent-readonly'
I1012 22:20:30.488095  5636 http.cpp:1045] Creating default 'basic' HTTP authenticator for
realm 'mesos-agent-readwrite'
I1012 22:20:30.489709  5636 slave.cpp:585] Agent resources: [{"name":"cpus","scalar":{"value":2.0},"type":"SCALAR"},{"name":"mem","scalar":{"value":1024.0},"type":"SCALAR"},{"name":"disk","scalar":{"value":1024.0},"type":"SCALAR"},{"name":"ports","ranges":{"range":[{"begin":31000,"end":32000}]},"type":"RANGES"}]
I1012 22:20:30.490002  5636 slave.cpp:593] Agent attributes: [  ]
I1012 22:20:30.490016  5636 slave.cpp:602] Agent hostname: e9f78efb6983
I1012 22:20:30.490216  5646 status_update_manager.cpp:177] Pausing sending status updates
I1012 22:20:30.491740  5654 state.cpp:64] Recovering state from '/tmp/Endpoint_SlaveEndpointTest_NoAuthorizer_1_vo9ZfI/meta'
I1012 22:20:30.492153  5645 status_update_manager.cpp:203] Recovering status update manager
I1012 22:20:30.492388  5645 containerizer.cpp:648] Recovering containerizer
I1012 22:20:30.494042  5641 provisioner.cpp:416] Provisioner recovery complete
I1012 22:20:30.494537  5639 slave.cpp:6310] Finished recovery
I1012 22:20:30.495059  5639 slave.cpp:6492] Querying resource estimator for oversubscribable
resources
I1012 22:20:30.495357  5639 slave.cpp:6506] Received oversubscribable resources {} from the
resource estimator
I1012 22:20:30.498186  5657 process.cpp:3929] Handling HTTP event for process 'slave(826)'
with path: '/slave(826)/monitor/statistics.json'
I1012 22:20:30.499948  5642 http.cpp:1185] HTTP GET for /slave(826)/monitor/statistics.json
from 172.17.0.4:43904
I1012 22:20:30.500075  5642 http.cpp:976] Authorizing principal 'test-principal' to GET the
'/monitor/statistics.json' endpoint
I1012 22:20:30.504694  5633 slave.cpp:869] Agent terminating
[       OK ] Endpoint/SlaveEndpointTest.NoAuthorizer/1 (38 ms)
[ RUN      ] Endpoint/SlaveEndpointTest.NoAuthorizer/2
I1012 22:20:30.519819  5633 containerizer.cpp:292] Using isolation { environment_secret, posix/cpu,
posix/mem, filesystem/posix, network/cni }
W1012 22:20:30.520395  5633 backend.cpp:76] Failed to create 'aufs' backend: AufsBackend requires
root privileges
W1012 22:20:30.520524  5633 backend.cpp:76] Failed to create 'bind' backend: BindBackend requires
root privileges
I1012 22:20:30.520568  5633 provisioner.cpp:255] Using default backend 'copy'
I1012 22:20:30.522560  5633 cluster.cpp:448] Creating default 'local' authorizer
I1012 22:20:30.525038  5652 slave.cpp:254] Mesos agent started on (827)@172.17.0.4:38372
I1012 22:20:30.525076  5652 slave.cpp:255] Flags at startup: --acls="" --appc_simple_discovery_uri_prefix="http://"
--appc_store_dir="/tmp/Endpoint_SlaveEndpointTest_NoAuthorizer_2_rr6pDF/store/appc" --authenticate_http_readonly="true"
--authenticate_http_readwrite="true" --authenticatee="crammd5" --authentication_backoff_factor="1secs"
--authorizer="local" --cgroups_cpu_enable_pids_and_tids_count="false" --cgroups_enable_cfs="false"
--cgroups_hierarchy="/sys/fs/cgroup" --cgroups_limit_swap="false" --cgroups_root="mesos" --container_disk_watch_interval="15secs"
--containerizers="mesos" --credential="/tmp/Endpoint_SlaveEndpointTest_NoAuthorizer_2_rr6pDF/credential"
--default_role="*" --disallow_sharing_agent_pid_namespace="false" --disk_watch_interval="1mins"
--docker="docker" --docker_kill_orphans="true" --docker_registry="https://registry-1.docker.io"
--docker_remove_delay="6hrs" --docker_socket="/var/run/docker.sock" --docker_stop_timeout="0ns"
--docker_store_dir="/tmp/Endpoint_SlaveEndpointTest_NoAuthorizer_2_rr6pDF/store/docker" --docker_volume_checkpoint_dir="/var/run/mesos/isolators/docker/volume"
--enforce_container_disk_quota="false" --executor_registration_timeout="1mins" --executor_reregistration_timeout="2secs"
--executor_shutdown_grace_period="5secs" --fetcher_cache_dir="/tmp/Endpoint_SlaveEndpointTest_NoAuthorizer_2_rr6pDF/fetch"
--fetcher_cache_size="2GB" --frameworks_home="" --gc_delay="1weeks" --gc_disk_headroom="0.1"
--hadoop_home="" --help="false" --hostname_lookup="true" --http_command_executor="false" --http_credentials="/tmp/Endpoint_SlaveEndpointTest_NoAuthorizer_2_rr6pDF/http_credentials"
--http_heartbeat_interval="30secs" --initialize_driver_logging="true" --isolation="posix/cpu,posix/mem"
--launcher="posix" --launcher_dir="/mesos/mesos-1.5.0/_build/src" --logbufsecs="0" --logging_level="INFO"
--max_completed_executors_per_framework="150" --oversubscribed_resources_interval="15secs"
--perf_duration="10secs" --perf_interval="1mins" --port="5051" --qos_correction_interval_min="0ns"
--quiet="false" --recover="reconnect" --recovery_timeout="15mins" --registration_backoff_factor="10ms"
--resources="cpus:2;gpus:0;mem:1024;disk:1024;ports:[31000-32000]" --revocable_cpu_low_priority="true"
--runtime_dir="/tmp/Endpoint_SlaveEndpointTest_NoAuthorizer_2_rr6pDF" --sandbox_directory="/mnt/mesos/sandbox"
--strict="true" --switch_user="true" --systemd_enable_support="true" --systemd_runtime_directory="/run/systemd/system"
--version="false" --work_dir="/tmp/Endpoint_SlaveEndpointTest_NoAuthorizer_2_YPDhJt" --zk_session_timeout="10secs"
I1012 22:20:30.525534  5652 credentials.hpp:86] Loading credential for authentication from
'/tmp/Endpoint_SlaveEndpointTest_NoAuthorizer_2_rr6pDF/credential'
I1012 22:20:30.525722  5652 slave.cpp:287] Agent using credential for: test-principal
I1012 22:20:30.525748  5652 credentials.hpp:37] Loading credentials for authentication from
'/tmp/Endpoint_SlaveEndpointTest_NoAuthorizer_2_rr6pDF/http_credentials'
I1012 22:20:30.526022  5652 http.cpp:1045] Creating default 'basic' HTTP authenticator for
realm 'mesos-agent-readonly'
I1012 22:20:30.526207  5652 http.cpp:1045] Creating default 'basic' HTTP authenticator for
realm 'mesos-agent-readwrite'
I1012 22:20:30.527845  5652 slave.cpp:585] Agent resources: [{"name":"cpus","scalar":{"value":2.0},"type":"SCALAR"},{"name":"mem","scalar":{"value":1024.0},"type":"SCALAR"},{"name":"disk","scalar":{"value":1024.0},"type":"SCALAR"},{"name":"ports","ranges":{"range":[{"begin":31000,"end":32000}]},"type":"RANGES"}]
I1012 22:20:30.528110  5652 slave.cpp:593] Agent attributes: [  ]
I1012 22:20:30.528125  5652 slave.cpp:602] Agent hostname: e9f78efb6983
I1012 22:20:30.528326  5650 status_update_manager.cpp:177] Pausing sending status updates
I1012 22:20:30.529724  5657 state.cpp:64] Recovering state from '/tmp/Endpoint_SlaveEndpointTest_NoAuthorizer_2_YPDhJt/meta'
I1012 22:20:30.530140  5657 status_update_manager.cpp:203] Recovering status update manager
I1012 22:20:30.530462  5644 containerizer.cpp:648] Recovering containerizer
I1012 22:20:30.532232  5648 provisioner.cpp:416] Provisioner recovery complete
I1012 22:20:30.532830  5639 slave.cpp:6310] Finished recovery
I1012 22:20:30.533313  5639 slave.cpp:6492] Querying resource estimator for oversubscribable
resources
I1012 22:20:30.533629  5638 slave.cpp:6506] Received oversubscribable resources {} from the
resource estimator
I1012 22:20:30.536253  5644 process.cpp:3929] Handling HTTP event for process 'slave(827)'
with path: '/slave(827)/containers'
I1012 22:20:30.537853  5653 http.cpp:1185] HTTP GET for /slave(827)/containers from 172.17.0.4:43906
I1012 22:20:30.537935  5653 http.cpp:976] Authorizing principal 'test-principal' to GET the
'/containers' endpoint
I1012 22:20:30.543169  5633 slave.cpp:869] Agent terminating
[       OK ] Endpoint/SlaveEndpointTest.NoAuthorizer/2 (37 ms)
[----------] 9 tests from Endpoint/SlaveEndpointTest (366 ms total)

[----------] 2 tests from ContainerizerType/DefaultContainerDNSFlagTest
[ RUN      ] ContainerizerType/DefaultContainerDNSFlagTest.ValidateFlag/0
[       OK ] ContainerizerType/DefaultContainerDNSFlagTest.ValidateFlag/0 (10 ms)
[ RUN      ] ContainerizerType/DefaultContainerDNSFlagTest.ValidateFlag/1
[       OK ] ContainerizerType/DefaultContainerDNSFlagTest.ValidateFlag/1 (9 ms)
[----------] 2 tests from ContainerizerType/DefaultContainerDNSFlagTest (19 ms total)

[----------] Global test environment tear-down
[==========] 1695 tests from 185 test cases ran. (585309 ms total)
[  PASSED  ] 1693 tests.
[  FAILED  ] 2 tests, listed below:
[  FAILED  ] ExamplesTest.NoExecutorFramework
[  FAILED  ] ExamplesTest.TestHTTPFramework

 2 FAILED TESTS
  YOU HAVE 21 DISABLED TESTS

I1012 22:20:30.629218  5658 process.cpp:1068] Failed to accept socket: future discarded
make[4]: *** [check-local] Error 1
make[4]: Leaving directory `/mesos/mesos-1.5.0/_build/src'
make[3]: *** [check-am] Error 2
make[3]: Leaving directory `/mesos/mesos-1.5.0/_build/src'
make[2]: *** [check] Error 2
make[2]: Leaving directory `/mesos/mesos-1.5.0/_build/src'
make[1]: *** [check-recursive] Error 1
make[1]: Leaving directory `/mesos/mesos-1.5.0/_build'
make: *** [distcheck] Error 1
+ docker rmi mesos-1507843406-18822
Untagged: mesos-1507843406-18822:latest
Deleted: sha256:e51ea4d5d1c298adc99010b734ea43a68169d6a168b236363e273e0269dc21b3
Deleted: sha256:37951c349f69c238d10ac89c8f2cd9485b2fa35288cad2990a3dca0b8410c6b8
Deleted: sha256:d1291f6a82d5d2d479a30669bb2b503832fa12072285bd3e5c97a380af0e2af0
Deleted: sha256:0eb34f15ea3dcf66d1728892fc3e8d67189442cf94ee40f011c77880009c4ee2
Deleted: sha256:42744c079c5e004d63402138ce8d740fc1012b16a8f38251ba56c57a64880d22
Deleted: sha256:82735a64c31960b4b5f9af9ccbc37a24c52cb56407962723e03f92ecb067982d
Deleted: sha256:c823003a1877f793aec8dc94394093fdef79883240556cc5292729e631b057df
Deleted: sha256:921600176a63fc7382a336962a5c5c9676cfccf67ac63c4461dff2ce4e644fd6
Deleted: sha256:3ee5af217c4f12c4673cb2ab2384cdc5db03a06e586410cab4c56e8e9d959484
Deleted: sha256:eaf69fb9fd85790a94f9bcd2fae2f50e44d59d81556d34a2dffc5a9e2586b549
Deleted: sha256:df23cb98c116eb360094b2aa4d6992c6dbf051734a14220b0f7710acfdbbfedb
Deleted: sha256:aa4ce853c02627f26b65f6aa008e7f7b1f0aeef78018e623896896d6f7dd3c83
Deleted: sha256:8e866adc5f7daa4228950d678ed1d32be30c45746b7a7585fe10327604b38117
Deleted: sha256:5260a53ed31736253b1eb620fe41787894b1303178132b11a783e0de8a49a905
Deleted: sha256:8dbc7f88467f23a49ac5270d183271bd0244268fdcc366aa81f0b3332cb80d07
Deleted: sha256:9f7654325f539e43e0a5cf87ae299a4f0dafc9f734d2e37b377abf71cf19573b
Deleted: sha256:7a3177b246309383ddd5a2bcc062e578e23a3d075652be46749e8588822cd1dc
Deleted: sha256:330386f0e8fcb2ef961457c0b1a8aaa0daeba50ab5d3d50e707dfa94eb91cae2
Deleted: sha256:71c1585cf06c043e87b3239bdec1de9f738a69cf98413c29ed93c070db0a24f8
Deleted: sha256:6def885d73a26a8a11d11f43cd08a33e42c71026652af5bc3b7de57740655c58
Deleted: sha256:701b1f85c4d5185b91fb79dde489b792f2e186d259c7043d6e80cd0fe742ddcf
Deleted: sha256:13feee2efc5145a1b70bacd24e70df70310edcc0cd73c1e068b5337d66d0a75c
Deleted: sha256:13afee3c515e9233ebb753021486df99d51ffe678f655df8fffee692c69932ea
Deleted: sha256:0751666b6e5f583143ad243b671c998a59c63fe58f3b45ba3752c1230f839e3e
Deleted: sha256:6d2260306b8df7414a52daf2a51cd9a772365e53d14a3cee5ac6d48efb7bc78d
Deleted: sha256:e973ab36c0785a9a02f5a0a1f72a8c53a3c8b20b1d71969aae17ebff7ccb5f41
Deleted: sha256:d81b8e154d54ea64e3e5702a44a47688d5adb171b033bbeb289e480149b899e0
Deleted: sha256:f63af3d71d76c35a6eb13951047e5c54909f24adf23d30471dd9dabbbf4ae584
Build step 'Execute shell' marked build as failure


Mime
View raw message