mesos-builds mailing list archives

Site index · List index
Message view « Date » · « Thread »
Top « Date » · « Thread »
From Apache Jenkins Server <jenk...@builds.apache.org>
Subject Build failed in Jenkins: Mesos-Buildbot » autotools,gcc,--verbose --disable-libtool-wrappers,GLOG_v=1 MESOS_VERBOSE=1,ubuntu:14.04,(ubuntu)&&(!ubuntu-us1)&&(!ubuntu-eu2)&&(!qnode3)&&(!H23) #4332
Date Tue, 17 Oct 2017 19:37:10 GMT
See <https://builds.apache.org/job/Mesos-Buildbot/BUILDTOOL=autotools,COMPILER=gcc,CONFIGURATION=--verbose%20--disable-libtool-wrappers,ENVIRONMENT=GLOG_v=1%20MESOS_VERBOSE=1,OS=ubuntu%3A14.04,label_exp=(ubuntu)&&(!ubuntu-us1)&&(!ubuntu-eu2)&&(!qnode3)&&(!H23)/4332/display/redirect?page=changes>

Changes:

[benjamin.hindman] Updated Doxygen style guide docs to latest expectations.

------------------------------------------
[...truncated 32.02 MB...]
I1017 19:37:03.208798  5664 http.cpp:1045] Creating default 'basic' HTTP authenticator for
realm 'mesos-agent-readonly'
I1017 19:37:03.208973  5664 http.cpp:1045] Creating default 'basic' HTTP authenticator for
realm 'mesos-agent-readwrite'
I1017 19:37:03.210320  5664 slave.cpp:585] Agent resources: [{"name":"cpus","scalar":{"value":2.0},"type":"SCALAR"},{"name":"mem","scalar":{"value":1024.0},"type":"SCALAR"},{"name":"disk","scalar":{"value":1024.0},"type":"SCALAR"},{"name":"ports","ranges":{"range":[{"begin":31000,"end":32000}]},"type":"RANGES"}]
I1017 19:37:03.210538  5664 slave.cpp:593] Agent attributes: [  ]
I1017 19:37:03.210551  5664 slave.cpp:602] Agent hostname: 06d864982b17
I1017 19:37:03.210705  5676 status_update_manager.cpp:177] Pausing sending status updates
I1017 19:37:03.212296  5683 state.cpp:64] Recovering state from '/tmp/Endpoint_SlaveEndpointTest_AuthorizedRequest_2_LX4O2e/meta'
I1017 19:37:03.212682  5670 status_update_manager.cpp:203] Recovering status update manager
I1017 19:37:03.212903  5686 containerizer.cpp:649] Recovering containerizer
I1017 19:37:03.214293  5673 provisioner.cpp:416] Provisioner recovery complete
I1017 19:37:03.214643  5676 slave.cpp:6310] Finished recovery
I1017 19:37:03.215222  5676 slave.cpp:6492] Querying resource estimator for oversubscribable
resources
I1017 19:37:03.215517  5667 slave.cpp:6506] Received oversubscribable resources {} from the
resource estimator
I1017 19:37:03.218683  5680 process.cpp:3929] Handling HTTP event for process 'slave(822)'
with path: '/slave(822)/containers'
I1017 19:37:03.220481  5665 http.cpp:1185] HTTP GET for /slave(822)/containers from 172.17.0.2:59520
I1017 19:37:03.220614  5665 http.cpp:976] Authorizing principal 'test-principal' to GET the
'/containers' endpoint
I1017 19:37:03.225446  5670 slave.cpp:869] Agent terminating
[       OK ] Endpoint/SlaveEndpointTest.AuthorizedRequest/2 (36 ms)
[ RUN      ] Endpoint/SlaveEndpointTest.UnauthorizedRequest/0
I1017 19:37:03.240353  5662 containerizer.cpp:292] Using isolation { environment_secret, posix/cpu,
posix/mem, filesystem/posix, network/cni }
W1017 19:37:03.241083  5662 backend.cpp:76] Failed to create 'aufs' backend: AufsBackend requires
root privileges
W1017 19:37:03.241268  5662 backend.cpp:76] Failed to create 'bind' backend: BindBackend requires
root privileges
I1017 19:37:03.241313  5662 provisioner.cpp:255] Using default backend 'copy'
I1017 19:37:03.245999  5685 slave.cpp:254] Mesos agent started on (823)@172.17.0.2:33620
I1017 19:37:03.246040  5685 slave.cpp:255] Flags at startup: --acls="" --appc_simple_discovery_uri_prefix="http://"
--appc_store_dir="/tmp/Endpoint_SlaveEndpointTest_UnauthorizedRequest_0_t5olFV/store/appc"
--authenticate_http_readonly="true" --authenticate_http_readwrite="true" --authenticatee="crammd5"
--authentication_backoff_factor="1secs" --authorizer="local" --cgroups_cpu_enable_pids_and_tids_count="false"
--cgroups_enable_cfs="false" --cgroups_hierarchy="/sys/fs/cgroup" --cgroups_limit_swap="false"
--cgroups_root="mesos" --container_disk_watch_interval="15secs" --containerizers="mesos" --credential="/tmp/Endpoint_SlaveEndpointTest_UnauthorizedRequest_0_t5olFV/credential"
--default_role="*" --disallow_sharing_agent_pid_namespace="false" --disk_watch_interval="1mins"
--docker="docker" --docker_kill_orphans="true" --docker_registry="https://registry-1.docker.io"
--docker_remove_delay="6hrs" --docker_socket="/var/run/docker.sock" --docker_stop_timeout="0ns"
--docker_store_dir="/tmp/Endpoint_SlaveEndpointTest_UnauthorizedRequest_0_t5olFV/store/docker"
--docker_volume_checkpoint_dir="/var/run/mesos/isolators/docker/volume" --enforce_container_disk_quota="false"
--executor_registration_timeout="1mins" --executor_reregistration_timeout="2secs" --executor_shutdown_grace_period="5secs"
--fetcher_cache_dir="/tmp/Endpoint_SlaveEndpointTest_UnauthorizedRequest_0_t5olFV/fetch" --fetcher_cache_size="2GB"
--frameworks_home="" --gc_delay="1weeks" --gc_disk_headroom="0.1" --hadoop_home="" --help="false"
--hostname_lookup="true" --http_command_executor="false" --http_credentials="/tmp/Endpoint_SlaveEndpointTest_UnauthorizedRequest_0_t5olFV/http_credentials"
--http_heartbeat_interval="30secs" --initialize_driver_logging="true" --isolation="posix/cpu,posix/mem"
--launcher="posix" --launcher_dir="/mesos/mesos-1.5.0/_build/src" --logbufsecs="0" --logging_level="INFO"
--max_completed_executors_per_framework="150" --oversubscribed_resources_interval="15secs"
--perf_duration="10secs" --perf_interval="1mins" --port="5051" --qos_correction_interval_min="0ns"
--quiet="false" --recover="reconnect" --recovery_timeout="15mins" --registration_backoff_factor="10ms"
--resources="cpus:2;gpus:0;mem:1024;disk:1024;ports:[31000-32000]" --revocable_cpu_low_priority="true"
--runtime_dir="/tmp/Endpoint_SlaveEndpointTest_UnauthorizedRequest_0_t5olFV" --sandbox_directory="/mnt/mesos/sandbox"
--strict="true" --switch_user="true" --systemd_enable_support="true" --systemd_runtime_directory="/run/systemd/system"
--version="false" --work_dir="/tmp/Endpoint_SlaveEndpointTest_UnauthorizedRequest_0_DL7ojo"
--zk_session_timeout="10secs"
I1017 19:37:03.246548  5685 credentials.hpp:86] Loading credential for authentication from
'/tmp/Endpoint_SlaveEndpointTest_UnauthorizedRequest_0_t5olFV/credential'
I1017 19:37:03.246798  5685 slave.cpp:287] Agent using credential for: test-principal
I1017 19:37:03.246819  5685 credentials.hpp:37] Loading credentials for authentication from
'/tmp/Endpoint_SlaveEndpointTest_UnauthorizedRequest_0_t5olFV/http_credentials'
I1017 19:37:03.247110  5685 http.cpp:1045] Creating default 'basic' HTTP authenticator for
realm 'mesos-agent-readonly'
I1017 19:37:03.247293  5685 http.cpp:1045] Creating default 'basic' HTTP authenticator for
realm 'mesos-agent-readwrite'
I1017 19:37:03.249013  5685 slave.cpp:585] Agent resources: [{"name":"cpus","scalar":{"value":2.0},"type":"SCALAR"},{"name":"mem","scalar":{"value":1024.0},"type":"SCALAR"},{"name":"disk","scalar":{"value":1024.0},"type":"SCALAR"},{"name":"ports","ranges":{"range":[{"begin":31000,"end":32000}]},"type":"RANGES"}]
I1017 19:37:03.249388  5685 slave.cpp:593] Agent attributes: [  ]
I1017 19:37:03.249423  5685 slave.cpp:602] Agent hostname: 06d864982b17
I1017 19:37:03.249747  5676 status_update_manager.cpp:177] Pausing sending status updates
I1017 19:37:03.251646  5679 state.cpp:64] Recovering state from '/tmp/Endpoint_SlaveEndpointTest_UnauthorizedRequest_0_DL7ojo/meta'
I1017 19:37:03.260190  5681 status_update_manager.cpp:203] Recovering status update manager
I1017 19:37:03.260519  5686 containerizer.cpp:649] Recovering containerizer
I1017 19:37:03.262099  5664 provisioner.cpp:416] Provisioner recovery complete
I1017 19:37:03.262696  5669 slave.cpp:6310] Finished recovery
I1017 19:37:03.263285  5669 slave.cpp:6492] Querying resource estimator for oversubscribable
resources
I1017 19:37:03.263761  5685 slave.cpp:6506] Received oversubscribable resources {} from the
resource estimator
I1017 19:37:03.268208  5674 process.cpp:3929] Handling HTTP event for process 'slave(823)'
with path: '/slave(823)/monitor/statistics'
I1017 19:37:03.269826  5676 http.cpp:1185] HTTP GET for /slave(823)/monitor/statistics from
172.17.0.2:59524
I1017 19:37:03.269929  5676 http.cpp:976] Authorizing principal 'test-principal' to GET the
'/monitor/statistics' endpoint
I1017 19:37:03.272835  5676 slave.cpp:869] Agent terminating
[       OK ] Endpoint/SlaveEndpointTest.UnauthorizedRequest/0 (58 ms)
[ RUN      ] Endpoint/SlaveEndpointTest.UnauthorizedRequest/1
I1017 19:37:03.298179  5662 containerizer.cpp:292] Using isolation { environment_secret, posix/cpu,
posix/mem, filesystem/posix, network/cni }
W1017 19:37:03.298758  5662 backend.cpp:76] Failed to create 'aufs' backend: AufsBackend requires
root privileges
W1017 19:37:03.298876  5662 backend.cpp:76] Failed to create 'bind' backend: BindBackend requires
root privileges
I1017 19:37:03.298909  5662 provisioner.cpp:255] Using default backend 'copy'
I1017 19:37:03.302819  5663 slave.cpp:254] Mesos agent started on (824)@172.17.0.2:33620
I1017 19:37:03.302853  5663 slave.cpp:255] Flags at startup: --acls="" --appc_simple_discovery_uri_prefix="http://"
--appc_store_dir="/tmp/Endpoint_SlaveEndpointTest_UnauthorizedRequest_1_FcGCy5/store/appc"
--authenticate_http_readonly="true" --authenticate_http_readwrite="true" --authenticatee="crammd5"
--authentication_backoff_factor="1secs" --authorizer="local" --cgroups_cpu_enable_pids_and_tids_count="false"
--cgroups_enable_cfs="false" --cgroups_hierarchy="/sys/fs/cgroup" --cgroups_limit_swap="false"
--cgroups_root="mesos" --container_disk_watch_interval="15secs" --containerizers="mesos" --credential="/tmp/Endpoint_SlaveEndpointTest_UnauthorizedRequest_1_FcGCy5/credential"
--default_role="*" --disallow_sharing_agent_pid_namespace="false" --disk_watch_interval="1mins"
--docker="docker" --docker_kill_orphans="true" --docker_registry="https://registry-1.docker.io"
--docker_remove_delay="6hrs" --docker_socket="/var/run/docker.sock" --docker_stop_timeout="0ns"
--docker_store_dir="/tmp/Endpoint_SlaveEndpointTest_UnauthorizedRequest_1_FcGCy5/store/docker"
--docker_volume_checkpoint_dir="/var/run/mesos/isolators/docker/volume" --enforce_container_disk_quota="false"
--executor_registration_timeout="1mins" --executor_reregistration_timeout="2secs" --executor_shutdown_grace_period="5secs"
--fetcher_cache_dir="/tmp/Endpoint_SlaveEndpointTest_UnauthorizedRequest_1_FcGCy5/fetch" --fetcher_cache_size="2GB"
--frameworks_home="" --gc_delay="1weeks" --gc_disk_headroom="0.1" --hadoop_home="" --help="false"
--hostname_lookup="true" --http_command_executor="false" --http_credentials="/tmp/Endpoint_SlaveEndpointTest_UnauthorizedRequest_1_FcGCy5/http_credentials"
--http_heartbeat_interval="30secs" --initialize_driver_logging="true" --isolation="posix/cpu,posix/mem"
--launcher="posix" --launcher_dir="/mesos/mesos-1.5.0/_build/src" --logbufsecs="0" --logging_level="INFO"
--max_completed_executors_per_framework="150" --oversubscribed_resources_interval="15secs"
--perf_duration="10secs" --perf_interval="1mins" --port="5051" --qos_correction_interval_min="0ns"
--quiet="false" --recover="reconnect" --recovery_timeout="15mins" --registration_backoff_factor="10ms"
--resources="cpus:2;gpus:0;mem:1024;disk:1024;ports:[31000-32000]" --revocable_cpu_low_priority="true"
--runtime_dir="/tmp/Endpoint_SlaveEndpointTest_UnauthorizedRequest_1_FcGCy5" --sandbox_directory="/mnt/mesos/sandbox"
--strict="true" --switch_user="true" --systemd_enable_support="true" --systemd_runtime_directory="/run/systemd/system"
--version="false" --work_dir="/tmp/Endpoint_SlaveEndpointTest_UnauthorizedRequest_1_8yF03x"
--zk_session_timeout="10secs"
I1017 19:37:03.303413  5663 credentials.hpp:86] Loading credential for authentication from
'/tmp/Endpoint_SlaveEndpointTest_UnauthorizedRequest_1_FcGCy5/credential'
I1017 19:37:03.303676  5663 slave.cpp:287] Agent using credential for: test-principal
I1017 19:37:03.303727  5663 credentials.hpp:37] Loading credentials for authentication from
'/tmp/Endpoint_SlaveEndpointTest_UnauthorizedRequest_1_FcGCy5/http_credentials'
I1017 19:37:03.304051  5663 http.cpp:1045] Creating default 'basic' HTTP authenticator for
realm 'mesos-agent-readonly'
I1017 19:37:03.304287  5663 http.cpp:1045] Creating default 'basic' HTTP authenticator for
realm 'mesos-agent-readwrite'
I1017 19:37:03.306349  5663 slave.cpp:585] Agent resources: [{"name":"cpus","scalar":{"value":2.0},"type":"SCALAR"},{"name":"mem","scalar":{"value":1024.0},"type":"SCALAR"},{"name":"disk","scalar":{"value":1024.0},"type":"SCALAR"},{"name":"ports","ranges":{"range":[{"begin":31000,"end":32000}]},"type":"RANGES"}]
I1017 19:37:03.306726  5663 slave.cpp:593] Agent attributes: [  ]
I1017 19:37:03.306792  5663 slave.cpp:602] Agent hostname: 06d864982b17
I1017 19:37:03.307066  5676 status_update_manager.cpp:177] Pausing sending status updates
I1017 19:37:03.309762  5663 state.cpp:64] Recovering state from '/tmp/Endpoint_SlaveEndpointTest_UnauthorizedRequest_1_8yF03x/meta'
I1017 19:37:03.310303  5672 status_update_manager.cpp:203] Recovering status update manager
I1017 19:37:03.310523  5683 containerizer.cpp:649] Recovering containerizer
I1017 19:37:03.312633  5682 provisioner.cpp:416] Provisioner recovery complete
I1017 19:37:03.313048  5676 slave.cpp:6310] Finished recovery
I1017 19:37:03.313709  5676 slave.cpp:6492] Querying resource estimator for oversubscribable
resources
I1017 19:37:03.314087  5680 slave.cpp:6506] Received oversubscribable resources {} from the
resource estimator
I1017 19:37:03.317495  5665 process.cpp:3929] Handling HTTP event for process 'slave(824)'
with path: '/slave(824)/monitor/statistics.json'
I1017 19:37:03.319412  5666 http.cpp:1185] HTTP GET for /slave(824)/monitor/statistics.json
from 172.17.0.2:59526
I1017 19:37:03.319514  5666 http.cpp:976] Authorizing principal 'test-principal' to GET the
'/monitor/statistics.json' endpoint
I1017 19:37:03.334509  5662 slave.cpp:869] Agent terminating
[       OK ] Endpoint/SlaveEndpointTest.UnauthorizedRequest/1 (47 ms)
[ RUN      ] Endpoint/SlaveEndpointTest.UnauthorizedRequest/2
I1017 19:37:03.346943  5662 containerizer.cpp:292] Using isolation { environment_secret, posix/cpu,
posix/mem, filesystem/posix, network/cni }
W1017 19:37:03.347697  5662 backend.cpp:76] Failed to create 'aufs' backend: AufsBackend requires
root privileges
W1017 19:37:03.347818  5662 backend.cpp:76] Failed to create 'bind' backend: BindBackend requires
root privileges
I1017 19:37:03.347856  5662 provisioner.cpp:255] Using default backend 'copy'
I1017 19:37:03.352237  5679 slave.cpp:254] Mesos agent started on (825)@172.17.0.2:33620
I1017 19:37:03.352289  5679 slave.cpp:255] Flags at startup: --acls="" --appc_simple_discovery_uri_prefix="http://"
--appc_store_dir="/tmp/Endpoint_SlaveEndpointTest_UnauthorizedRequest_2_DLIPUf/store/appc"
--authenticate_http_readonly="true" --authenticate_http_readwrite="true" --authenticatee="crammd5"
--authentication_backoff_factor="1secs" --authorizer="local" --cgroups_cpu_enable_pids_and_tids_count="false"
--cgroups_enable_cfs="false" --cgroups_hierarchy="/sys/fs/cgroup" --cgroups_limit_swap="false"
--cgroups_root="mesos" --container_disk_watch_interval="15secs" --containerizers="mesos" --credential="/tmp/Endpoint_SlaveEndpointTest_UnauthorizedRequest_2_DLIPUf/credential"
--default_role="*" --disallow_sharing_agent_pid_namespace="false" --disk_watch_interval="1mins"
--docker="docker" --docker_kill_orphans="true" --docker_registry="https://registry-1.docker.io"
--docker_remove_delay="6hrs" --docker_socket="/var/run/docker.sock" --docker_stop_timeout="0ns"
--docker_store_dir="/tmp/Endpoint_SlaveEndpointTest_UnauthorizedRequest_2_DLIPUf/store/docker"
--docker_volume_checkpoint_dir="/var/run/mesos/isolators/docker/volume" --enforce_container_disk_quota="false"
--executor_registration_timeout="1mins" --executor_reregistration_timeout="2secs" --executor_shutdown_grace_period="5secs"
--fetcher_cache_dir="/tmp/Endpoint_SlaveEndpointTest_UnauthorizedRequest_2_DLIPUf/fetch" --fetcher_cache_size="2GB"
--frameworks_home="" --gc_delay="1weeks" --gc_disk_headroom="0.1" --hadoop_home="" --help="false"
--hostname_lookup="true" --http_command_executor="false" --http_credentials="/tmp/Endpoint_SlaveEndpointTest_UnauthorizedRequest_2_DLIPUf/http_credentials"
--http_heartbeat_interval="30secs" --initialize_driver_logging="true" --isolation="posix/cpu,posix/mem"
--launcher="posix" --launcher_dir="/mesos/mesos-1.5.0/_build/src" --logbufsecs="0" --logging_level="INFO"
--max_completed_executors_per_framework="150" --oversubscribed_resources_interval="15secs"
--perf_duration="10secs" --perf_interval="1mins" --port="5051" --qos_correction_interval_min="0ns"
--quiet="false" --recover="reconnect" --recovery_timeout="15mins" --registration_backoff_factor="10ms"
--resources="cpus:2;gpus:0;mem:1024;disk:1024;ports:[31000-32000]" --revocable_cpu_low_priority="true"
--runtime_dir="/tmp/Endpoint_SlaveEndpointTest_UnauthorizedRequest_2_DLIPUf" --sandbox_directory="/mnt/mesos/sandbox"
--strict="true" --switch_user="true" --systemd_enable_support="true" --systemd_runtime_directory="/run/systemd/system"
--version="false" --work_dir="/tmp/Endpoint_SlaveEndpointTest_UnauthorizedRequest_2_4wy3iI"
--zk_session_timeout="10secs"
I1017 19:37:03.352691  5679 credentials.hpp:86] Loading credential for authentication from
'/tmp/Endpoint_SlaveEndpointTest_UnauthorizedRequest_2_DLIPUf/credential'
I1017 19:37:03.352893  5679 slave.cpp:287] Agent using credential for: test-principal
I1017 19:37:03.352915  5679 credentials.hpp:37] Loading credentials for authentication from
'/tmp/Endpoint_SlaveEndpointTest_UnauthorizedRequest_2_DLIPUf/http_credentials'
I1017 19:37:03.353204  5679 http.cpp:1045] Creating default 'basic' HTTP authenticator for
realm 'mesos-agent-readonly'
I1017 19:37:03.353402  5679 http.cpp:1045] Creating default 'basic' HTTP authenticator for
realm 'mesos-agent-readwrite'
I1017 19:37:03.354820  5679 slave.cpp:585] Agent resources: [{"name":"cpus","scalar":{"value":2.0},"type":"SCALAR"},{"name":"mem","scalar":{"value":1024.0},"type":"SCALAR"},{"name":"disk","scalar":{"value":1024.0},"type":"SCALAR"},{"name":"ports","ranges":{"range":[{"begin":31000,"end":32000}]},"type":"RANGES"}]
I1017 19:37:03.355041  5679 slave.cpp:593] Agent attributes: [  ]
I1017 19:37:03.355052  5679 slave.cpp:602] Agent hostname: 06d864982b17
I1017 19:37:03.355242  5673 status_update_manager.cpp:177] Pausing sending status updates
I1017 19:37:03.356812  5686 state.cpp:64] Recovering state from '/tmp/Endpoint_SlaveEndpointTest_UnauthorizedRequest_2_4wy3iI/meta'
I1017 19:37:03.357178  5670 status_update_manager.cpp:203] Recovering status update manager
I1017 19:37:03.357404  5666 containerizer.cpp:649] Recovering containerizer
I1017 19:37:03.358966  5684 provisioner.cpp:416] Provisioner recovery complete
I1017 19:37:03.359314  5673 slave.cpp:6310] Finished recovery
I1017 19:37:03.359860  5673 slave.cpp:6492] Querying resource estimator for oversubscribable
resources
I1017 19:37:03.360193  5673 slave.cpp:6506] Received oversubscribable resources {} from the
resource estimator
I1017 19:37:03.363972  5680 process.cpp:3929] Handling HTTP event for process 'slave(825)'
with path: '/slave(825)/containers'
I1017 19:37:03.366400  5666 http.cpp:1185] HTTP GET for /slave(825)/containers from 172.17.0.2:59530
I1017 19:37:03.366763  5666 http.cpp:976] Authorizing principal 'test-principal' to GET the
'/containers' endpoint
I1017 19:37:03.369464  5670 slave.cpp:869] Agent terminating
[       OK ] Endpoint/SlaveEndpointTest.UnauthorizedRequest/2 (44 ms)
[ RUN      ] Endpoint/SlaveEndpointTest.NoAuthorizer/0
I1017 19:37:03.390197  5662 containerizer.cpp:292] Using isolation { environment_secret, posix/cpu,
posix/mem, filesystem/posix, network/cni }
W1017 19:37:03.390784  5662 backend.cpp:76] Failed to create 'aufs' backend: AufsBackend requires
root privileges
W1017 19:37:03.390904  5662 backend.cpp:76] Failed to create 'bind' backend: BindBackend requires
root privileges
I1017 19:37:03.390954  5662 provisioner.cpp:255] Using default backend 'copy'
I1017 19:37:03.392693  5662 cluster.cpp:448] Creating default 'local' authorizer
I1017 19:37:03.395115  5679 slave.cpp:254] Mesos agent started on (826)@172.17.0.2:33620
I1017 19:37:03.395278  5679 slave.cpp:255] Flags at startup: --acls="" --appc_simple_discovery_uri_prefix="http://"
--appc_store_dir="/tmp/Endpoint_SlaveEndpointTest_NoAuthorizer_0_qLyvHq/store/appc" --authenticate_http_readonly="true"
--authenticate_http_readwrite="true" --authenticatee="crammd5" --authentication_backoff_factor="1secs"
--authorizer="local" --cgroups_cpu_enable_pids_and_tids_count="false" --cgroups_enable_cfs="false"
--cgroups_hierarchy="/sys/fs/cgroup" --cgroups_limit_swap="false" --cgroups_root="mesos" --container_disk_watch_interval="15secs"
--containerizers="mesos" --credential="/tmp/Endpoint_SlaveEndpointTest_NoAuthorizer_0_qLyvHq/credential"
--default_role="*" --disallow_sharing_agent_pid_namespace="false" --disk_watch_interval="1mins"
--docker="docker" --docker_kill_orphans="true" --docker_registry="https://registry-1.docker.io"
--docker_remove_delay="6hrs" --docker_socket="/var/run/docker.sock" --docker_stop_timeout="0ns"
--docker_store_dir="/tmp/Endpoint_SlaveEndpointTest_NoAuthorizer_0_qLyvHq/store/docker" --docker_volume_checkpoint_dir="/var/run/mesos/isolators/docker/volume"
--enforce_container_disk_quota="false" --executor_registration_timeout="1mins" --executor_reregistration_timeout="2secs"
--executor_shutdown_grace_period="5secs" --fetcher_cache_dir="/tmp/Endpoint_SlaveEndpointTest_NoAuthorizer_0_qLyvHq/fetch"
--fetcher_cache_size="2GB" --frameworks_home="" --gc_delay="1weeks" --gc_disk_headroom="0.1"
--hadoop_home="" --help="false" --hostname_lookup="true" --http_command_executor="false" --http_credentials="/tmp/Endpoint_SlaveEndpointTest_NoAuthorizer_0_qLyvHq/http_credentials"
--http_heartbeat_interval="30secs" --initialize_driver_logging="true" --isolation="posix/cpu,posix/mem"
--launcher="posix" --launcher_dir="/mesos/mesos-1.5.0/_build/src" --logbufsecs="0" --logging_level="INFO"
--max_completed_executors_per_framework="150" --oversubscribed_resources_interval="15secs"
--perf_duration="10secs" --perf_interval="1mins" --port="5051" --qos_correction_interval_min="0ns"
--quiet="false" --recover="reconnect" --recovery_timeout="15mins" --registration_backoff_factor="10ms"
--resources="cpus:2;gpus:0;mem:1024;disk:1024;ports:[31000-32000]" --revocable_cpu_low_priority="true"
--runtime_dir="/tmp/Endpoint_SlaveEndpointTest_NoAuthorizer_0_qLyvHq" --sandbox_directory="/mnt/mesos/sandbox"
--strict="true" --switch_user="true" --systemd_enable_support="true" --systemd_runtime_directory="/run/systemd/system"
--version="false" --work_dir="/tmp/Endpoint_SlaveEndpointTest_NoAuthorizer_0_e00dZS" --zk_session_timeout="10secs"
I1017 19:37:03.396329  5679 credentials.hpp:86] Loading credential for authentication from
'/tmp/Endpoint_SlaveEndpointTest_NoAuthorizer_0_qLyvHq/credential'
I1017 19:37:03.396759  5679 slave.cpp:287] Agent using credential for: test-principal
I1017 19:37:03.396862  5679 credentials.hpp:37] Loading credentials for authentication from
'/tmp/Endpoint_SlaveEndpointTest_NoAuthorizer_0_qLyvHq/http_credentials'
I1017 19:37:03.397363  5679 http.cpp:1045] Creating default 'basic' HTTP authenticator for
realm 'mesos-agent-readonly'
I1017 19:37:03.397791  5679 http.cpp:1045] Creating default 'basic' HTTP authenticator for
realm 'mesos-agent-readwrite'
I1017 19:37:03.399781  5679 slave.cpp:585] Agent resources: [{"name":"cpus","scalar":{"value":2.0},"type":"SCALAR"},{"name":"mem","scalar":{"value":1024.0},"type":"SCALAR"},{"name":"disk","scalar":{"value":1024.0},"type":"SCALAR"},{"name":"ports","ranges":{"range":[{"begin":31000,"end":32000}]},"type":"RANGES"}]
I1017 19:37:03.400207  5679 slave.cpp:593] Agent attributes: [  ]
I1017 19:37:03.400288  5679 slave.cpp:602] Agent hostname: 06d864982b17
I1017 19:37:03.400668  5682 status_update_manager.cpp:177] Pausing sending status updates
I1017 19:37:03.402431  5672 state.cpp:64] Recovering state from '/tmp/Endpoint_SlaveEndpointTest_NoAuthorizer_0_e00dZS/meta'
I1017 19:37:03.402881  5684 status_update_manager.cpp:203] Recovering status update manager
I1017 19:37:03.403139  5669 containerizer.cpp:649] Recovering containerizer
I1017 19:37:03.404589  5674 provisioner.cpp:416] Provisioner recovery complete
I1017 19:37:03.404985  5681 slave.cpp:6310] Finished recovery
I1017 19:37:03.405654  5681 slave.cpp:6492] Querying resource estimator for oversubscribable
resources
I1017 19:37:03.405977  5676 slave.cpp:6506] Received oversubscribable resources {} from the
resource estimator
I1017 19:37:03.409534  5675 process.cpp:3929] Handling HTTP event for process 'slave(826)'
with path: '/slave(826)/monitor/statistics'
I1017 19:37:03.411736  5663 http.cpp:1185] HTTP GET for /slave(826)/monitor/statistics from
172.17.0.2:59532
I1017 19:37:03.411831  5663 http.cpp:976] Authorizing principal 'test-principal' to GET the
'/monitor/statistics' endpoint
I1017 19:37:03.419508  5662 slave.cpp:869] Agent terminating
[       OK ] Endpoint/SlaveEndpointTest.NoAuthorizer/0 (43 ms)
[ RUN      ] Endpoint/SlaveEndpointTest.NoAuthorizer/1
I1017 19:37:03.433017  5662 containerizer.cpp:292] Using isolation { environment_secret, posix/cpu,
posix/mem, filesystem/posix, network/cni }
W1017 19:37:03.433588  5662 backend.cpp:76] Failed to create 'aufs' backend: AufsBackend requires
root privileges
W1017 19:37:03.433710  5662 backend.cpp:76] Failed to create 'bind' backend: BindBackend requires
root privileges
I1017 19:37:03.433756  5662 provisioner.cpp:255] Using default backend 'copy'
I1017 19:37:03.435719  5662 cluster.cpp:448] Creating default 'local' authorizer
I1017 19:37:03.438372  5680 slave.cpp:254] Mesos agent started on (827)@172.17.0.2:33620
I1017 19:37:03.438427  5680 slave.cpp:255] Flags at startup: --acls="" --appc_simple_discovery_uri_prefix="http://"
--appc_store_dir="/tmp/Endpoint_SlaveEndpointTest_NoAuthorizer_1_vcf6TB/store/appc" --authenticate_http_readonly="true"
--authenticate_http_readwrite="true" --authenticatee="crammd5" --authentication_backoff_factor="1secs"
--authorizer="local" --cgroups_cpu_enable_pids_and_tids_count="false" --cgroups_enable_cfs="false"
--cgroups_hierarchy="/sys/fs/cgroup" --cgroups_limit_swap="false" --cgroups_root="mesos" --container_disk_watch_interval="15secs"
--containerizers="mesos" --credential="/tmp/Endpoint_SlaveEndpointTest_NoAuthorizer_1_vcf6TB/credential"
--default_role="*" --disallow_sharing_agent_pid_namespace="false" --disk_watch_interval="1mins"
--docker="docker" --docker_kill_orphans="true" --docker_registry="https://registry-1.docker.io"
--docker_remove_delay="6hrs" --docker_socket="/var/run/docker.sock" --docker_stop_timeout="0ns"
--docker_store_dir="/tmp/Endpoint_SlaveEndpointTest_NoAuthorizer_1_vcf6TB/store/docker" --docker_volume_checkpoint_dir="/var/run/mesos/isolators/docker/volume"
--enforce_container_disk_quota="false" --executor_registration_timeout="1mins" --executor_reregistration_timeout="2secs"
--executor_shutdown_grace_period="5secs" --fetcher_cache_dir="/tmp/Endpoint_SlaveEndpointTest_NoAuthorizer_1_vcf6TB/fetch"
--fetcher_cache_size="2GB" --frameworks_home="" --gc_delay="1weeks" --gc_disk_headroom="0.1"
--hadoop_home="" --help="false" --hostname_lookup="true" --http_command_executor="false" --http_credentials="/tmp/Endpoint_SlaveEndpointTest_NoAuthorizer_1_vcf6TB/http_credentials"
--http_heartbeat_interval="30secs" --initialize_driver_logging="true" --isolation="posix/cpu,posix/mem"
--launcher="posix" --launcher_dir="/mesos/mesos-1.5.0/_build/src" --logbufsecs="0" --logging_level="INFO"
--max_completed_executors_per_framework="150" --oversubscribed_resources_interval="15secs"
--perf_duration="10secs" --perf_interval="1mins" --port="5051" --qos_correction_interval_min="0ns"
--quiet="false" --recover="reconnect" --recovery_timeout="15mins" --registration_backoff_factor="10ms"
--resources="cpus:2;gpus:0;mem:1024;disk:1024;ports:[31000-32000]" --revocable_cpu_low_priority="true"
--runtime_dir="/tmp/Endpoint_SlaveEndpointTest_NoAuthorizer_1_vcf6TB" --sandbox_directory="/mnt/mesos/sandbox"
--strict="true" --switch_user="true" --systemd_enable_support="true" --systemd_runtime_directory="/run/systemd/system"
--version="false" --work_dir="/tmp/Endpoint_SlaveEndpointTest_NoAuthorizer_1_Oqvr53" --zk_session_timeout="10secs"
I1017 19:37:03.439102  5680 credentials.hpp:86] Loading credential for authentication from
'/tmp/Endpoint_SlaveEndpointTest_NoAuthorizer_1_vcf6TB/credential'
I1017 19:37:03.439421  5680 slave.cpp:287] Agent using credential for: test-principal
I1017 19:37:03.439492  5680 credentials.hpp:37] Loading credentials for authentication from
'/tmp/Endpoint_SlaveEndpointTest_NoAuthorizer_1_vcf6TB/http_credentials'
I1017 19:37:03.439827  5680 http.cpp:1045] Creating default 'basic' HTTP authenticator for
realm 'mesos-agent-readonly'
I1017 19:37:03.440136  5680 http.cpp:1045] Creating default 'basic' HTTP authenticator for
realm 'mesos-agent-readwrite'
I1017 19:37:03.441893  5680 slave.cpp:585] Agent resources: [{"name":"cpus","scalar":{"value":2.0},"type":"SCALAR"},{"name":"mem","scalar":{"value":1024.0},"type":"SCALAR"},{"name":"disk","scalar":{"value":1024.0},"type":"SCALAR"},{"name":"ports","ranges":{"range":[{"begin":31000,"end":32000}]},"type":"RANGES"}]
I1017 19:37:03.442173  5680 slave.cpp:593] Agent attributes: [  ]
I1017 19:37:03.442190  5680 slave.cpp:602] Agent hostname: 06d864982b17
I1017 19:37:03.442410  5677 status_update_manager.cpp:177] Pausing sending status updates
I1017 19:37:03.444166  5672 state.cpp:64] Recovering state from '/tmp/Endpoint_SlaveEndpointTest_NoAuthorizer_1_Oqvr53/meta'
I1017 19:37:03.444536  5682 status_update_manager.cpp:203] Recovering status update manager
I1017 19:37:03.444805  5671 containerizer.cpp:649] Recovering containerizer
I1017 19:37:03.446578  5684 provisioner.cpp:416] Provisioner recovery complete
I1017 19:37:03.447690  5683 slave.cpp:6310] Finished recovery
I1017 19:37:03.448506  5683 slave.cpp:6492] Querying resource estimator for oversubscribable
resources
I1017 19:37:03.449021  5664 slave.cpp:6506] Received oversubscribable resources {} from the
resource estimator
I1017 19:37:03.453544  5679 process.cpp:3929] Handling HTTP event for process 'slave(827)'
with path: '/slave(827)/monitor/statistics.json'
I1017 19:37:03.455556  5686 http.cpp:1185] HTTP GET for /slave(827)/monitor/statistics.json
from 172.17.0.2:59534
I1017 19:37:03.455821  5686 http.cpp:976] Authorizing principal 'test-principal' to GET the
'/monitor/statistics.json' endpoint
I1017 19:37:03.459594  5673 slave.cpp:869] Agent terminating
[       OK ] Endpoint/SlaveEndpointTest.NoAuthorizer/1 (38 ms)
[ RUN      ] Endpoint/SlaveEndpointTest.NoAuthorizer/2
I1017 19:37:03.472596  5662 containerizer.cpp:292] Using isolation { environment_secret, posix/cpu,
posix/mem, filesystem/posix, network/cni }
W1017 19:37:03.473451  5662 backend.cpp:76] Failed to create 'aufs' backend: AufsBackend requires
root privileges
W1017 19:37:03.473615  5662 backend.cpp:76] Failed to create 'bind' backend: BindBackend requires
root privileges
I1017 19:37:03.473656  5662 provisioner.cpp:255] Using default backend 'copy'
I1017 19:37:03.475960  5662 cluster.cpp:448] Creating default 'local' authorizer
I1017 19:37:03.478260  5670 slave.cpp:254] Mesos agent started on (828)@172.17.0.2:33620
I1017 19:37:03.478315  5670 slave.cpp:255] Flags at startup: --acls="" --appc_simple_discovery_uri_prefix="http://"
--appc_store_dir="/tmp/Endpoint_SlaveEndpointTest_NoAuthorizer_2_14IkuN/store/appc" --authenticate_http_readonly="true"
--authenticate_http_readwrite="true" --authenticatee="crammd5" --authentication_backoff_factor="1secs"
--authorizer="local" --cgroups_cpu_enable_pids_and_tids_count="false" --cgroups_enable_cfs="false"
--cgroups_hierarchy="/sys/fs/cgroup" --cgroups_limit_swap="false" --cgroups_root="mesos" --container_disk_watch_interval="15secs"
--containerizers="mesos" --credential="/tmp/Endpoint_SlaveEndpointTest_NoAuthorizer_2_14IkuN/credential"
--default_role="*" --disallow_sharing_agent_pid_namespace="false" --disk_watch_interval="1mins"
--docker="docker" --docker_kill_orphans="true" --docker_registry="https://registry-1.docker.io"
--docker_remove_delay="6hrs" --docker_socket="/var/run/docker.sock" --docker_stop_timeout="0ns"
--docker_store_dir="/tmp/Endpoint_SlaveEndpointTest_NoAuthorizer_2_14IkuN/store/docker" --docker_volume_checkpoint_dir="/var/run/mesos/isolators/docker/volume"
--enforce_container_disk_quota="false" --executor_registration_timeout="1mins" --executor_reregistration_timeout="2secs"
--executor_shutdown_grace_period="5secs" --fetcher_cache_dir="/tmp/Endpoint_SlaveEndpointTest_NoAuthorizer_2_14IkuN/fetch"
--fetcher_cache_size="2GB" --frameworks_home="" --gc_delay="1weeks" --gc_disk_headroom="0.1"
--hadoop_home="" --help="false" --hostname_lookup="true" --http_command_executor="false" --http_credentials="/tmp/Endpoint_SlaveEndpointTest_NoAuthorizer_2_14IkuN/http_credentials"
--http_heartbeat_interval="30secs" --initialize_driver_logging="true" --isolation="posix/cpu,posix/mem"
--launcher="posix" --launcher_dir="/mesos/mesos-1.5.0/_build/src" --logbufsecs="0" --logging_level="INFO"
--max_completed_executors_per_framework="150" --oversubscribed_resources_interval="15secs"
--perf_duration="10secs" --perf_interval="1mins" --port="5051" --qos_correction_interval_min="0ns"
--quiet="false" --recover="reconnect" --recovery_timeout="15mins" --registration_backoff_factor="10ms"
--resources="cpus:2;gpus:0;mem:1024;disk:1024;ports:[31000-32000]" --revocable_cpu_low_priority="true"
--runtime_dir="/tmp/Endpoint_SlaveEndpointTest_NoAuthorizer_2_14IkuN" --sandbox_directory="/mnt/mesos/sandbox"
--strict="true" --switch_user="true" --systemd_enable_support="true" --systemd_runtime_directory="/run/systemd/system"
--version="false" --work_dir="/tmp/Endpoint_SlaveEndpointTest_NoAuthorizer_2_dnEVzf" --zk_session_timeout="10secs"
I1017 19:37:03.478917  5670 credentials.hpp:86] Loading credential for authentication from
'/tmp/Endpoint_SlaveEndpointTest_NoAuthorizer_2_14IkuN/credential'
I1017 19:37:03.479184  5670 slave.cpp:287] Agent using credential for: test-principal
I1017 19:37:03.479207  5670 credentials.hpp:37] Loading credentials for authentication from
'/tmp/Endpoint_SlaveEndpointTest_NoAuthorizer_2_14IkuN/http_credentials'
I1017 19:37:03.479461  5670 http.cpp:1045] Creating default 'basic' HTTP authenticator for
realm 'mesos-agent-readonly'
I1017 19:37:03.479712  5670 http.cpp:1045] Creating default 'basic' HTTP authenticator for
realm 'mesos-agent-readwrite'
I1017 19:37:03.481673  5670 slave.cpp:585] Agent resources: [{"name":"cpus","scalar":{"value":2.0},"type":"SCALAR"},{"name":"mem","scalar":{"value":1024.0},"type":"SCALAR"},{"name":"disk","scalar":{"value":1024.0},"type":"SCALAR"},{"name":"ports","ranges":{"range":[{"begin":31000,"end":32000}]},"type":"RANGES"}]
I1017 19:37:03.482230  5670 slave.cpp:593] Agent attributes: [  ]
I1017 19:37:03.482252  5670 slave.cpp:602] Agent hostname: 06d864982b17
I1017 19:37:03.482424  5664 status_update_manager.cpp:177] Pausing sending status updates
I1017 19:37:03.484369  5673 state.cpp:64] Recovering state from '/tmp/Endpoint_SlaveEndpointTest_NoAuthorizer_2_dnEVzf/meta'
I1017 19:37:03.484766  5667 status_update_manager.cpp:203] Recovering status update manager
I1017 19:37:03.485026  5668 containerizer.cpp:649] Recovering containerizer
I1017 19:37:03.486642  5684 provisioner.cpp:416] Provisioner recovery complete
I1017 19:37:03.487200  5686 slave.cpp:6310] Finished recovery
I1017 19:37:03.487805  5686 slave.cpp:6492] Querying resource estimator for oversubscribable
resources
I1017 19:37:03.488227  5680 slave.cpp:6506] Received oversubscribable resources {} from the
resource estimator
I1017 19:37:03.492261  5676 process.cpp:3929] Handling HTTP event for process 'slave(828)'
with path: '/slave(828)/containers'
I1017 19:37:03.493875  5681 http.cpp:1185] HTTP GET for /slave(828)/containers from 172.17.0.2:59538
I1017 19:37:03.493983  5681 http.cpp:976] Authorizing principal 'test-principal' to GET the
'/containers' endpoint
I1017 19:37:03.497464  5666 slave.cpp:869] Agent terminating
[       OK ] Endpoint/SlaveEndpointTest.NoAuthorizer/2 (37 ms)
[----------] 9 tests from Endpoint/SlaveEndpointTest (386 ms total)

[----------] 2 tests from ContainerizerType/DefaultContainerDNSFlagTest
[ RUN      ] ContainerizerType/DefaultContainerDNSFlagTest.ValidateFlag/0
[       OK ] ContainerizerType/DefaultContainerDNSFlagTest.ValidateFlag/0 (12 ms)
[ RUN      ] ContainerizerType/DefaultContainerDNSFlagTest.ValidateFlag/1
[       OK ] ContainerizerType/DefaultContainerDNSFlagTest.ValidateFlag/1 (12 ms)
[----------] 2 tests from ContainerizerType/DefaultContainerDNSFlagTest (24 ms total)

[----------] Global test environment tear-down
[==========] 1696 tests from 185 test cases ran. (475557 ms total)
[  PASSED  ] 1695 tests.
[  FAILED  ] 1 test, listed below:
[  FAILED  ] MasterTest.IgnoreOldAgentReregistration

 1 FAILED TEST
  YOU HAVE 21 DISABLED TESTS

I1017 19:37:03.588454  5687 process.cpp:1068] Failed to accept socket: future discarded
make[4]: *** [check-local] Error 1
make[4]: Leaving directory `/mesos/mesos-1.5.0/_build/src'
make[3]: *** [check-am] Error 2
make[3]: Leaving directory `/mesos/mesos-1.5.0/_build/src'
make[2]: *** [check] Error 2
make[2]: Leaving directory `/mesos/mesos-1.5.0/_build/src'
make[1]: *** [check-recursive] Error 1
make[1]: Leaving directory `/mesos/mesos-1.5.0/_build'
make: *** [distcheck] Error 1
+ docker rmi mesos-1508265697-6387
Untagged: mesos-1508265697-6387:latest
Deleted: sha256:cc1166984a0a597686fccfe4442d3b12eee2374306886515d004a26c62da8330
Deleted: sha256:602ba7f3efc091dff4c6356f8343197074c99032ca726790e6e3f8f6f468b581
Deleted: sha256:7e87ed77a2db01bbce341828e9d6f2635fe8db5b6b4d21cef7b2b4f484865a83
Deleted: sha256:301cf0166eb9cba47dff9c30033a5f1a41aedf8bdb8155557925ce2e3dfa7072
Deleted: sha256:6a5d1fe41c757b7f0cbaa04877ece49b5c9bdd1101c8620fda3c553bba4721ac
Deleted: sha256:193f820d6a2ecfae9755d198110ec5f7c24410ee16775612353e35f5d10ce1ed
Deleted: sha256:68987110c22424f2a8dd8d5a67a17d1ddcb934e177838fbffb1a168204d0bedf
Deleted: sha256:82791a1084da28d22c022da1b6c11ee93b190e546948c9be77e9a9736f6865e9
Deleted: sha256:61a6d9e161e79af00705b6997ae68ccb014e3e133246ba63e199e36e46c8bd07
Deleted: sha256:03cd46946b846eff589699de9e13ae0891a94c5dd7e3b9e9336cdbb91750b7e7
Deleted: sha256:230398e6bf6439d9568742ae9a5a3633860215e57e48b5e7729fb9904a47041f
Deleted: sha256:3824b731e743697c90fa76c435921d249b1c55d773273d45cca8853b0fe7dab0
Deleted: sha256:f37e47371d6f14f094283830e3ef6449fbf73b8484571f636eefbade26cfc164
Deleted: sha256:aa3ea49f34d45d5be193c95a52759075bc36e5814b21e45890863bc201a90afc
Deleted: sha256:733e7c4bb8db711bbf849984f832b28ce39834d3f42936b4e21854d971dc7029
Deleted: sha256:22740878c6a6830f6f4707660ef032303075dc68bd4ef3ddff48f7f21e806615
Deleted: sha256:e8efbbee499968fd749f7bf3cfd10aec375c435ed35cdde36913294cb7b55a94
Deleted: sha256:d55f3bc9fbb41314e5bedee2e007ce2166255e8dd12f0c8d0df75c6b363ec7aa
Deleted: sha256:41d2c7013d9576226c25e98aa84c88494e6a4afe05de65a03da34201901ec8b6
Deleted: sha256:cae5ac33a74ee86107c8b49982a63a70092ea633322cc959cd9cce0385e441e8
Deleted: sha256:0df4336977ffeb5b7e76d5e319a78a9bdb4c4d9a747634f049d3212da922ff12
Deleted: sha256:5d213aa719416daec31fd52d025f9a018b73131ffbdc4d585fa8649137b246d8
Deleted: sha256:64d7ca8cfbcab2cb5914cab9ad154eb40ebb59490d9f284cf30c580b207e08b4
Deleted: sha256:f030872b91d4e0b3a0db21e039fedfce502f6f8fc633824db8de04a4a70d49e8
Deleted: sha256:5eefb04707feb54baee42f4a5d8212cad56685c81a9094f836c948eb06559194
Deleted: sha256:40b75d7c6fc98d8a62b596c0939831093c04b8b094ec6f4fb09b57db5e995ce7
Deleted: sha256:807953da2f886c5c888c87bf19316aa977e8d269f351b5508a8768b54f1a7864
Deleted: sha256:1603dabef641c6943a6cffafe39ccc062f6ff4655bc750a6ec803c7a537d1e0e
Build step 'Execute shell' marked build as failure
Not sending mail to unregistered user benjamin.hindman@gmail.com


Mime
View raw message