mesos-builds mailing list archives

Site index · List index
Message view « Date » · « Thread »
Top « Date » · « Thread »
From Apache Jenkins Server <jenk...@builds.apache.org>
Subject Build failed in Jenkins: Mesos-Buildbot » autotools,gcc,--verbose --disable-libtool-wrappers,GLOG_v=1 MESOS_VERBOSE=1,centos:7,(ubuntu)&&(!ubuntu-us1)&&(!ubuntu-eu2)&&(!qnode3)&&(!H23) #4299
Date Mon, 09 Oct 2017 22:31:48 GMT
See <https://builds.apache.org/job/Mesos-Buildbot/BUILDTOOL=autotools,COMPILER=gcc,CONFIGURATION=--verbose%20--disable-libtool-wrappers,ENVIRONMENT=GLOG_v=1%20MESOS_VERBOSE=1,OS=centos%3A7,label_exp=(ubuntu)&&(!ubuntu-us1)&&(!ubuntu-eu2)&&(!qnode3)&&(!H23)/4299/display/redirect?page=changes>

Changes:

[xujyan] Fixed a typo.

------------------------------------------
[...truncated 32.08 MB...]
I1009 22:31:39.591526  6591 http.cpp:1045] Creating default 'basic' HTTP authenticator for
realm 'mesos-agent-readwrite'
I1009 22:31:39.593407  6591 slave.cpp:585] Agent resources: [{"name":"cpus","scalar":{"value":2.0},"type":"SCALAR"},{"name":"mem","scalar":{"value":1024.0},"type":"SCALAR"},{"name":"disk","scalar":{"value":1024.0},"type":"SCALAR"},{"name":"ports","ranges":{"range":[{"begin":31000,"end":32000}]},"type":"RANGES"}]
I1009 22:31:39.593650  6591 slave.cpp:593] Agent attributes: [  ]
I1009 22:31:39.593674  6591 slave.cpp:602] Agent hostname: a57666fd2364
I1009 22:31:39.593889  6585 status_update_manager.cpp:177] Pausing sending status updates
I1009 22:31:39.595561  6581 state.cpp:64] Recovering state from '/tmp/Endpoint_SlaveEndpointTest_AuthorizedRequest_2_xbKgDN/meta'
I1009 22:31:39.595906  6588 status_update_manager.cpp:203] Recovering status update manager
I1009 22:31:39.596187  6590 containerizer.cpp:648] Recovering containerizer
I1009 22:31:39.597851  6596 provisioner.cpp:416] Provisioner recovery complete
I1009 22:31:39.598274  6593 slave.cpp:6326] Finished recovery
I1009 22:31:39.598805  6593 slave.cpp:6512] Querying resource estimator for oversubscribable
resources
I1009 22:31:39.599071  6588 slave.cpp:6526] Received oversubscribable resources {} from the
resource estimator
I1009 22:31:39.601658  6590 process.cpp:3929] Handling HTTP event for process 'slave(819)'
with path: '/slave(819)/containers'
I1009 22:31:39.603444  6596 http.cpp:1185] HTTP GET for /slave(819)/containers from 172.17.0.2:39454
I1009 22:31:39.603525  6596 http.cpp:976] Authorizing principal 'test-principal' to GET the
'/containers' endpoint
I1009 22:31:39.608069  6577 slave.cpp:869] Agent terminating
[       OK ] Endpoint/SlaveEndpointTest.AuthorizedRequest/2 (36 ms)
[ RUN      ] Endpoint/SlaveEndpointTest.UnauthorizedRequest/0
I1009 22:31:39.623740  6577 containerizer.cpp:292] Using isolation { environment_secret, posix/cpu,
posix/mem, filesystem/posix, network/cni }
W1009 22:31:39.624524  6577 backend.cpp:76] Failed to create 'aufs' backend: AufsBackend requires
root privileges
W1009 22:31:39.624697  6577 backend.cpp:76] Failed to create 'bind' backend: BindBackend requires
root privileges
I1009 22:31:39.624764  6577 provisioner.cpp:255] Using default backend 'copy'
I1009 22:31:39.630688  6590 slave.cpp:254] Mesos agent started on (820)@172.17.0.2:35247
I1009 22:31:39.630722  6590 slave.cpp:255] Flags at startup: --acls="" --appc_simple_discovery_uri_prefix="http://"
--appc_store_dir="/tmp/Endpoint_SlaveEndpointTest_UnauthorizedRequest_0_ZNwYIt/store/appc"
--authenticate_http_readonly="true" --authenticate_http_readwrite="true" --authenticatee="crammd5"
--authentication_backoff_factor="1secs" --authorizer="local" --cgroups_cpu_enable_pids_and_tids_count="false"
--cgroups_enable_cfs="false" --cgroups_hierarchy="/sys/fs/cgroup" --cgroups_limit_swap="false"
--cgroups_root="mesos" --container_disk_watch_interval="15secs" --containerizers="mesos" --credential="/tmp/Endpoint_SlaveEndpointTest_UnauthorizedRequest_0_ZNwYIt/credential"
--default_role="*" --disallow_sharing_agent_pid_namespace="false" --disk_watch_interval="1mins"
--docker="docker" --docker_kill_orphans="true" --docker_registry="https://registry-1.docker.io"
--docker_remove_delay="6hrs" --docker_socket="/var/run/docker.sock" --docker_stop_timeout="0ns"
--docker_store_dir="/tmp/Endpoint_SlaveEndpointTest_UnauthorizedRequest_0_ZNwYIt/store/docker"
--docker_volume_checkpoint_dir="/var/run/mesos/isolators/docker/volume" --enforce_container_disk_quota="false"
--executor_registration_timeout="1mins" --executor_reregistration_timeout="2secs" --executor_shutdown_grace_period="5secs"
--fetcher_cache_dir="/tmp/Endpoint_SlaveEndpointTest_UnauthorizedRequest_0_ZNwYIt/fetch" --fetcher_cache_size="2GB"
--frameworks_home="" --gc_delay="1weeks" --gc_disk_headroom="0.1" --hadoop_home="" --help="false"
--hostname_lookup="true" --http_command_executor="false" --http_credentials="/tmp/Endpoint_SlaveEndpointTest_UnauthorizedRequest_0_ZNwYIt/http_credentials"
--http_heartbeat_interval="30secs" --initialize_driver_logging="true" --isolation="posix/cpu,posix/mem"
--launcher="posix" --launcher_dir="/mesos/mesos-1.5.0/_build/src" --logbufsecs="0" --logging_level="INFO"
--max_completed_executors_per_framework="150" --oversubscribed_resources_interval="15secs"
--perf_duration="10secs" --perf_interval="1mins" --port="5051" --qos_correction_interval_min="0ns"
--quiet="false" --recover="reconnect" --recovery_timeout="15mins" --registration_backoff_factor="10ms"
--resources="cpus:2;gpus:0;mem:1024;disk:1024;ports:[31000-32000]" --revocable_cpu_low_priority="true"
--runtime_dir="/tmp/Endpoint_SlaveEndpointTest_UnauthorizedRequest_0_ZNwYIt" --sandbox_directory="/mnt/mesos/sandbox"
--strict="true" --switch_user="true" --systemd_enable_support="true" --systemd_runtime_directory="/run/systemd/system"
--version="false" --work_dir="/tmp/Endpoint_SlaveEndpointTest_UnauthorizedRequest_0_BF8HE8"
--zk_session_timeout="10secs"
I1009 22:31:39.631343  6590 credentials.hpp:86] Loading credential for authentication from
'/tmp/Endpoint_SlaveEndpointTest_UnauthorizedRequest_0_ZNwYIt/credential'
I1009 22:31:39.631513  6590 slave.cpp:287] Agent using credential for: test-principal
I1009 22:31:39.631537  6590 credentials.hpp:37] Loading credentials for authentication from
'/tmp/Endpoint_SlaveEndpointTest_UnauthorizedRequest_0_ZNwYIt/http_credentials'
I1009 22:31:39.631796  6590 http.cpp:1045] Creating default 'basic' HTTP authenticator for
realm 'mesos-agent-readonly'
I1009 22:31:39.631976  6590 http.cpp:1045] Creating default 'basic' HTTP authenticator for
realm 'mesos-agent-readwrite'
I1009 22:31:39.634207  6590 slave.cpp:585] Agent resources: [{"name":"cpus","scalar":{"value":2.0},"type":"SCALAR"},{"name":"mem","scalar":{"value":1024.0},"type":"SCALAR"},{"name":"disk","scalar":{"value":1024.0},"type":"SCALAR"},{"name":"ports","ranges":{"range":[{"begin":31000,"end":32000}]},"type":"RANGES"}]
I1009 22:31:39.634619  6590 slave.cpp:593] Agent attributes: [  ]
I1009 22:31:39.634658  6590 slave.cpp:602] Agent hostname: a57666fd2364
I1009 22:31:39.634807  6587 status_update_manager.cpp:177] Pausing sending status updates
I1009 22:31:39.636564  6588 state.cpp:64] Recovering state from '/tmp/Endpoint_SlaveEndpointTest_UnauthorizedRequest_0_BF8HE8/meta'
I1009 22:31:39.636960  6585 status_update_manager.cpp:203] Recovering status update manager
I1009 22:31:39.637190  6585 containerizer.cpp:648] Recovering containerizer
I1009 22:31:39.638820  6593 provisioner.cpp:416] Provisioner recovery complete
I1009 22:31:39.639364  6581 slave.cpp:6326] Finished recovery
I1009 22:31:39.640063  6581 slave.cpp:6512] Querying resource estimator for oversubscribable
resources
I1009 22:31:39.640282  6583 slave.cpp:6526] Received oversubscribable resources {} from the
resource estimator
I1009 22:31:39.643344  6594 process.cpp:3929] Handling HTTP event for process 'slave(820)'
with path: '/slave(820)/monitor/statistics'
I1009 22:31:39.644963  6589 http.cpp:1185] HTTP GET for /slave(820)/monitor/statistics from
172.17.0.2:39456
I1009 22:31:39.645099  6589 http.cpp:976] Authorizing principal 'test-principal' to GET the
'/monitor/statistics' endpoint
I1009 22:31:39.648248  6577 slave.cpp:869] Agent terminating
[       OK ] Endpoint/SlaveEndpointTest.UnauthorizedRequest/0 (39 ms)
[ RUN      ] Endpoint/SlaveEndpointTest.UnauthorizedRequest/1
I1009 22:31:39.661520  6577 containerizer.cpp:292] Using isolation { environment_secret, posix/cpu,
posix/mem, filesystem/posix, network/cni }
W1009 22:31:39.662094  6577 backend.cpp:76] Failed to create 'aufs' backend: AufsBackend requires
root privileges
W1009 22:31:39.662204  6577 backend.cpp:76] Failed to create 'bind' backend: BindBackend requires
root privileges
I1009 22:31:39.662236  6577 provisioner.cpp:255] Using default backend 'copy'
I1009 22:31:39.666956  6580 slave.cpp:254] Mesos agent started on (821)@172.17.0.2:35247
I1009 22:31:39.666985  6580 slave.cpp:255] Flags at startup: --acls="" --appc_simple_discovery_uri_prefix="http://"
--appc_store_dir="/tmp/Endpoint_SlaveEndpointTest_UnauthorizedRequest_1_NnH8jQ/store/appc"
--authenticate_http_readonly="true" --authenticate_http_readwrite="true" --authenticatee="crammd5"
--authentication_backoff_factor="1secs" --authorizer="local" --cgroups_cpu_enable_pids_and_tids_count="false"
--cgroups_enable_cfs="false" --cgroups_hierarchy="/sys/fs/cgroup" --cgroups_limit_swap="false"
--cgroups_root="mesos" --container_disk_watch_interval="15secs" --containerizers="mesos" --credential="/tmp/Endpoint_SlaveEndpointTest_UnauthorizedRequest_1_NnH8jQ/credential"
--default_role="*" --disallow_sharing_agent_pid_namespace="false" --disk_watch_interval="1mins"
--docker="docker" --docker_kill_orphans="true" --docker_registry="https://registry-1.docker.io"
--docker_remove_delay="6hrs" --docker_socket="/var/run/docker.sock" --docker_stop_timeout="0ns"
--docker_store_dir="/tmp/Endpoint_SlaveEndpointTest_UnauthorizedRequest_1_NnH8jQ/store/docker"
--docker_volume_checkpoint_dir="/var/run/mesos/isolators/docker/volume" --enforce_container_disk_quota="false"
--executor_registration_timeout="1mins" --executor_reregistration_timeout="2secs" --executor_shutdown_grace_period="5secs"
--fetcher_cache_dir="/tmp/Endpoint_SlaveEndpointTest_UnauthorizedRequest_1_NnH8jQ/fetch" --fetcher_cache_size="2GB"
--frameworks_home="" --gc_delay="1weeks" --gc_disk_headroom="0.1" --hadoop_home="" --help="false"
--hostname_lookup="true" --http_command_executor="false" --http_credentials="/tmp/Endpoint_SlaveEndpointTest_UnauthorizedRequest_1_NnH8jQ/http_credentials"
--http_heartbeat_interval="30secs" --initialize_driver_logging="true" --isolation="posix/cpu,posix/mem"
--launcher="posix" --launcher_dir="/mesos/mesos-1.5.0/_build/src" --logbufsecs="0" --logging_level="INFO"
--max_completed_executors_per_framework="150" --oversubscribed_resources_interval="15secs"
--perf_duration="10secs" --perf_interval="1mins" --port="5051" --qos_correction_interval_min="0ns"
--quiet="false" --recover="reconnect" --recovery_timeout="15mins" --registration_backoff_factor="10ms"
--resources="cpus:2;gpus:0;mem:1024;disk:1024;ports:[31000-32000]" --revocable_cpu_low_priority="true"
--runtime_dir="/tmp/Endpoint_SlaveEndpointTest_UnauthorizedRequest_1_NnH8jQ" --sandbox_directory="/mnt/mesos/sandbox"
--strict="true" --switch_user="true" --systemd_enable_support="true" --systemd_runtime_directory="/run/systemd/system"
--version="false" --work_dir="/tmp/Endpoint_SlaveEndpointTest_UnauthorizedRequest_1_ssF39u"
--zk_session_timeout="10secs"
I1009 22:31:39.667431  6580 credentials.hpp:86] Loading credential for authentication from
'/tmp/Endpoint_SlaveEndpointTest_UnauthorizedRequest_1_NnH8jQ/credential'
I1009 22:31:39.667577  6580 slave.cpp:287] Agent using credential for: test-principal
I1009 22:31:39.667600  6580 credentials.hpp:37] Loading credentials for authentication from
'/tmp/Endpoint_SlaveEndpointTest_UnauthorizedRequest_1_NnH8jQ/http_credentials'
I1009 22:31:39.667821  6580 http.cpp:1045] Creating default 'basic' HTTP authenticator for
realm 'mesos-agent-readonly'
I1009 22:31:39.667979  6580 http.cpp:1045] Creating default 'basic' HTTP authenticator for
realm 'mesos-agent-readwrite'
I1009 22:31:39.669272  6580 slave.cpp:585] Agent resources: [{"name":"cpus","scalar":{"value":2.0},"type":"SCALAR"},{"name":"mem","scalar":{"value":1024.0},"type":"SCALAR"},{"name":"disk","scalar":{"value":1024.0},"type":"SCALAR"},{"name":"ports","ranges":{"range":[{"begin":31000,"end":32000}]},"type":"RANGES"}]
I1009 22:31:39.669505  6580 slave.cpp:593] Agent attributes: [  ]
I1009 22:31:39.669517  6580 slave.cpp:602] Agent hostname: a57666fd2364
I1009 22:31:39.669684  6597 status_update_manager.cpp:177] Pausing sending status updates
I1009 22:31:39.670944  6582 state.cpp:64] Recovering state from '/tmp/Endpoint_SlaveEndpointTest_UnauthorizedRequest_1_ssF39u/meta'
I1009 22:31:39.671447  6582 status_update_manager.cpp:203] Recovering status update manager
I1009 22:31:39.671690  6599 containerizer.cpp:648] Recovering containerizer
I1009 22:31:39.673367  6592 provisioner.cpp:416] Provisioner recovery complete
I1009 22:31:39.673890  6592 slave.cpp:6326] Finished recovery
I1009 22:31:39.674423  6592 slave.cpp:6512] Querying resource estimator for oversubscribable
resources
I1009 22:31:39.674705  6596 slave.cpp:6526] Received oversubscribable resources {} from the
resource estimator
I1009 22:31:39.677286  6590 process.cpp:3929] Handling HTTP event for process 'slave(821)'
with path: '/slave(821)/monitor/statistics.json'
I1009 22:31:39.678508  6581 http.cpp:1185] HTTP GET for /slave(821)/monitor/statistics.json
from 172.17.0.2:39458
I1009 22:31:39.678612  6581 http.cpp:976] Authorizing principal 'test-principal' to GET the
'/monitor/statistics.json' endpoint
I1009 22:31:39.681609  6577 slave.cpp:869] Agent terminating
[       OK ] Endpoint/SlaveEndpointTest.UnauthorizedRequest/1 (34 ms)
[ RUN      ] Endpoint/SlaveEndpointTest.UnauthorizedRequest/2
I1009 22:31:39.695698  6577 containerizer.cpp:292] Using isolation { environment_secret, posix/cpu,
posix/mem, filesystem/posix, network/cni }
W1009 22:31:39.696259  6577 backend.cpp:76] Failed to create 'aufs' backend: AufsBackend requires
root privileges
W1009 22:31:39.696375  6577 backend.cpp:76] Failed to create 'bind' backend: BindBackend requires
root privileges
I1009 22:31:39.696409  6577 provisioner.cpp:255] Using default backend 'copy'
I1009 22:31:39.700860  6589 slave.cpp:254] Mesos agent started on (822)@172.17.0.2:35247
I1009 22:31:39.700904  6589 slave.cpp:255] Flags at startup: --acls="" --appc_simple_discovery_uri_prefix="http://"
--appc_store_dir="/tmp/Endpoint_SlaveEndpointTest_UnauthorizedRequest_2_zskPfd/store/appc"
--authenticate_http_readonly="true" --authenticate_http_readwrite="true" --authenticatee="crammd5"
--authentication_backoff_factor="1secs" --authorizer="local" --cgroups_cpu_enable_pids_and_tids_count="false"
--cgroups_enable_cfs="false" --cgroups_hierarchy="/sys/fs/cgroup" --cgroups_limit_swap="false"
--cgroups_root="mesos" --container_disk_watch_interval="15secs" --containerizers="mesos" --credential="/tmp/Endpoint_SlaveEndpointTest_UnauthorizedRequest_2_zskPfd/credential"
--default_role="*" --disallow_sharing_agent_pid_namespace="false" --disk_watch_interval="1mins"
--docker="docker" --docker_kill_orphans="true" --docker_registry="https://registry-1.docker.io"
--docker_remove_delay="6hrs" --docker_socket="/var/run/docker.sock" --docker_stop_timeout="0ns"
--docker_store_dir="/tmp/Endpoint_SlaveEndpointTest_UnauthorizedRequest_2_zskPfd/store/docker"
--docker_volume_checkpoint_dir="/var/run/mesos/isolators/docker/volume" --enforce_container_disk_quota="false"
--executor_registration_timeout="1mins" --executor_reregistration_timeout="2secs" --executor_shutdown_grace_period="5secs"
--fetcher_cache_dir="/tmp/Endpoint_SlaveEndpointTest_UnauthorizedRequest_2_zskPfd/fetch" --fetcher_cache_size="2GB"
--frameworks_home="" --gc_delay="1weeks" --gc_disk_headroom="0.1" --hadoop_home="" --help="false"
--hostname_lookup="true" --http_command_executor="false" --http_credentials="/tmp/Endpoint_SlaveEndpointTest_UnauthorizedRequest_2_zskPfd/http_credentials"
--http_heartbeat_interval="30secs" --initialize_driver_logging="true" --isolation="posix/cpu,posix/mem"
--launcher="posix" --launcher_dir="/mesos/mesos-1.5.0/_build/src" --logbufsecs="0" --logging_level="INFO"
--max_completed_executors_per_framework="150" --oversubscribed_resources_interval="15secs"
--perf_duration="10secs" --perf_interval="1mins" --port="5051" --qos_correction_interval_min="0ns"
--quiet="false" --recover="reconnect" --recovery_timeout="15mins" --registration_backoff_factor="10ms"
--resources="cpus:2;gpus:0;mem:1024;disk:1024;ports:[31000-32000]" --revocable_cpu_low_priority="true"
--runtime_dir="/tmp/Endpoint_SlaveEndpointTest_UnauthorizedRequest_2_zskPfd" --sandbox_directory="/mnt/mesos/sandbox"
--strict="true" --switch_user="true" --systemd_enable_support="true" --systemd_runtime_directory="/run/systemd/system"
--version="false" --work_dir="/tmp/Endpoint_SlaveEndpointTest_UnauthorizedRequest_2_06PC0R"
--zk_session_timeout="10secs"
I1009 22:31:39.701431  6589 credentials.hpp:86] Loading credential for authentication from
'/tmp/Endpoint_SlaveEndpointTest_UnauthorizedRequest_2_zskPfd/credential'
I1009 22:31:39.701689  6589 slave.cpp:287] Agent using credential for: test-principal
I1009 22:31:39.701721  6589 credentials.hpp:37] Loading credentials for authentication from
'/tmp/Endpoint_SlaveEndpointTest_UnauthorizedRequest_2_zskPfd/http_credentials'
I1009 22:31:39.702070  6589 http.cpp:1045] Creating default 'basic' HTTP authenticator for
realm 'mesos-agent-readonly'
I1009 22:31:39.702272  6589 http.cpp:1045] Creating default 'basic' HTTP authenticator for
realm 'mesos-agent-readwrite'
I1009 22:31:39.703747  6589 slave.cpp:585] Agent resources: [{"name":"cpus","scalar":{"value":2.0},"type":"SCALAR"},{"name":"mem","scalar":{"value":1024.0},"type":"SCALAR"},{"name":"disk","scalar":{"value":1024.0},"type":"SCALAR"},{"name":"ports","ranges":{"range":[{"begin":31000,"end":32000}]},"type":"RANGES"}]
I1009 22:31:39.704005  6589 slave.cpp:593] Agent attributes: [  ]
I1009 22:31:39.704020  6589 slave.cpp:602] Agent hostname: a57666fd2364
I1009 22:31:39.704226  6595 status_update_manager.cpp:177] Pausing sending status updates
I1009 22:31:39.706280  6580 state.cpp:64] Recovering state from '/tmp/Endpoint_SlaveEndpointTest_UnauthorizedRequest_2_06PC0R/meta'
I1009 22:31:39.706593  6584 status_update_manager.cpp:203] Recovering status update manager
I1009 22:31:39.706854  6592 containerizer.cpp:648] Recovering containerizer
I1009 22:31:39.708353  6582 provisioner.cpp:416] Provisioner recovery complete
I1009 22:31:39.708928  6596 slave.cpp:6326] Finished recovery
I1009 22:31:39.709625  6596 slave.cpp:6512] Querying resource estimator for oversubscribable
resources
I1009 22:31:39.709959  6597 slave.cpp:6526] Received oversubscribable resources {} from the
resource estimator
I1009 22:31:39.712463  6591 process.cpp:3929] Handling HTTP event for process 'slave(822)'
with path: '/slave(822)/containers'
I1009 22:31:39.713755  6586 http.cpp:1185] HTTP GET for /slave(822)/containers from 172.17.0.2:39460
I1009 22:31:39.713829  6586 http.cpp:976] Authorizing principal 'test-principal' to GET the
'/containers' endpoint
I1009 22:31:39.716715  6577 slave.cpp:869] Agent terminating
[       OK ] Endpoint/SlaveEndpointTest.UnauthorizedRequest/2 (33 ms)
[ RUN      ] Endpoint/SlaveEndpointTest.NoAuthorizer/0
I1009 22:31:39.729858  6577 containerizer.cpp:292] Using isolation { environment_secret, posix/cpu,
posix/mem, filesystem/posix, network/cni }
W1009 22:31:39.730391  6577 backend.cpp:76] Failed to create 'aufs' backend: AufsBackend requires
root privileges
W1009 22:31:39.730515  6577 backend.cpp:76] Failed to create 'bind' backend: BindBackend requires
root privileges
I1009 22:31:39.730559  6577 provisioner.cpp:255] Using default backend 'copy'
I1009 22:31:39.732370  6577 cluster.cpp:448] Creating default 'local' authorizer
I1009 22:31:39.734710  6594 slave.cpp:254] Mesos agent started on (823)@172.17.0.2:35247
I1009 22:31:39.734740  6594 slave.cpp:255] Flags at startup: --acls="" --appc_simple_discovery_uri_prefix="http://"
--appc_store_dir="/tmp/Endpoint_SlaveEndpointTest_NoAuthorizer_0_j55WvA/store/appc" --authenticate_http_readonly="true"
--authenticate_http_readwrite="true" --authenticatee="crammd5" --authentication_backoff_factor="1secs"
--authorizer="local" --cgroups_cpu_enable_pids_and_tids_count="false" --cgroups_enable_cfs="false"
--cgroups_hierarchy="/sys/fs/cgroup" --cgroups_limit_swap="false" --cgroups_root="mesos" --container_disk_watch_interval="15secs"
--containerizers="mesos" --credential="/tmp/Endpoint_SlaveEndpointTest_NoAuthorizer_0_j55WvA/credential"
--default_role="*" --disallow_sharing_agent_pid_namespace="false" --disk_watch_interval="1mins"
--docker="docker" --docker_kill_orphans="true" --docker_registry="https://registry-1.docker.io"
--docker_remove_delay="6hrs" --docker_socket="/var/run/docker.sock" --docker_stop_timeout="0ns"
--docker_store_dir="/tmp/Endpoint_SlaveEndpointTest_NoAuthorizer_0_j55WvA/store/docker" --docker_volume_checkpoint_dir="/var/run/mesos/isolators/docker/volume"
--enforce_container_disk_quota="false" --executor_registration_timeout="1mins" --executor_reregistration_timeout="2secs"
--executor_shutdown_grace_period="5secs" --fetcher_cache_dir="/tmp/Endpoint_SlaveEndpointTest_NoAuthorizer_0_j55WvA/fetch"
--fetcher_cache_size="2GB" --frameworks_home="" --gc_delay="1weeks" --gc_disk_headroom="0.1"
--hadoop_home="" --help="false" --hostname_lookup="true" --http_command_executor="false" --http_credentials="/tmp/Endpoint_SlaveEndpointTest_NoAuthorizer_0_j55WvA/http_credentials"
--http_heartbeat_interval="30secs" --initialize_driver_logging="true" --isolation="posix/cpu,posix/mem"
--launcher="posix" --launcher_dir="/mesos/mesos-1.5.0/_build/src" --logbufsecs="0" --logging_level="INFO"
--max_completed_executors_per_framework="150" --oversubscribed_resources_interval="15secs"
--perf_duration="10secs" --perf_interval="1mins" --port="5051" --qos_correction_interval_min="0ns"
--quiet="false" --recover="reconnect" --recovery_timeout="15mins" --registration_backoff_factor="10ms"
--resources="cpus:2;gpus:0;mem:1024;disk:1024;ports:[31000-32000]" --revocable_cpu_low_priority="true"
--runtime_dir="/tmp/Endpoint_SlaveEndpointTest_NoAuthorizer_0_j55WvA" --sandbox_directory="/mnt/mesos/sandbox"
--strict="true" --switch_user="true" --systemd_enable_support="true" --systemd_runtime_directory="/run/systemd/system"
--version="false" --work_dir="/tmp/Endpoint_SlaveEndpointTest_NoAuthorizer_0_yrJGbf" --zk_session_timeout="10secs"
I1009 22:31:39.735196  6594 credentials.hpp:86] Loading credential for authentication from
'/tmp/Endpoint_SlaveEndpointTest_NoAuthorizer_0_j55WvA/credential'
I1009 22:31:39.735349  6594 slave.cpp:287] Agent using credential for: test-principal
I1009 22:31:39.735373  6594 credentials.hpp:37] Loading credentials for authentication from
'/tmp/Endpoint_SlaveEndpointTest_NoAuthorizer_0_j55WvA/http_credentials'
I1009 22:31:39.735631  6594 http.cpp:1045] Creating default 'basic' HTTP authenticator for
realm 'mesos-agent-readonly'
I1009 22:31:39.735823  6594 http.cpp:1045] Creating default 'basic' HTTP authenticator for
realm 'mesos-agent-readwrite'
I1009 22:31:39.737315  6594 slave.cpp:585] Agent resources: [{"name":"cpus","scalar":{"value":2.0},"type":"SCALAR"},{"name":"mem","scalar":{"value":1024.0},"type":"SCALAR"},{"name":"disk","scalar":{"value":1024.0},"type":"SCALAR"},{"name":"ports","ranges":{"range":[{"begin":31000,"end":32000}]},"type":"RANGES"}]
I1009 22:31:39.737550  6594 slave.cpp:593] Agent attributes: [  ]
I1009 22:31:39.737565  6594 slave.cpp:602] Agent hostname: a57666fd2364
I1009 22:31:39.737754  6582 status_update_manager.cpp:177] Pausing sending status updates
I1009 22:31:39.739272  6589 state.cpp:64] Recovering state from '/tmp/Endpoint_SlaveEndpointTest_NoAuthorizer_0_yrJGbf/meta'
I1009 22:31:39.739629  6584 status_update_manager.cpp:203] Recovering status update manager
I1009 22:31:39.739924  6585 containerizer.cpp:648] Recovering containerizer
I1009 22:31:39.741417  6586 provisioner.cpp:416] Provisioner recovery complete
I1009 22:31:39.741825  6598 slave.cpp:6326] Finished recovery
I1009 22:31:39.742260  6598 slave.cpp:6512] Querying resource estimator for oversubscribable
resources
I1009 22:31:39.742549  6578 slave.cpp:6526] Received oversubscribable resources {} from the
resource estimator
I1009 22:31:39.745009  6591 process.cpp:3929] Handling HTTP event for process 'slave(823)'
with path: '/slave(823)/monitor/statistics'
I1009 22:31:39.746209  6592 http.cpp:1185] HTTP GET for /slave(823)/monitor/statistics from
172.17.0.2:39462
I1009 22:31:39.746289  6592 http.cpp:976] Authorizing principal 'test-principal' to GET the
'/monitor/statistics' endpoint
I1009 22:31:39.749789  6577 slave.cpp:869] Agent terminating
[       OK ] Endpoint/SlaveEndpointTest.NoAuthorizer/0 (32 ms)
[ RUN      ] Endpoint/SlaveEndpointTest.NoAuthorizer/1
I1009 22:31:39.763200  6577 containerizer.cpp:292] Using isolation { environment_secret, posix/cpu,
posix/mem, filesystem/posix, network/cni }
W1009 22:31:39.763784  6577 backend.cpp:76] Failed to create 'aufs' backend: AufsBackend requires
root privileges
W1009 22:31:39.763902  6577 backend.cpp:76] Failed to create 'bind' backend: BindBackend requires
root privileges
I1009 22:31:39.763954  6577 provisioner.cpp:255] Using default backend 'copy'
I1009 22:31:39.766139  6577 cluster.cpp:448] Creating default 'local' authorizer
I1009 22:31:39.768425  6600 slave.cpp:254] Mesos agent started on (824)@172.17.0.2:35247
I1009 22:31:39.768463  6600 slave.cpp:255] Flags at startup: --acls="" --appc_simple_discovery_uri_prefix="http://"
--appc_store_dir="/tmp/Endpoint_SlaveEndpointTest_NoAuthorizer_1_h43L5X/store/appc" --authenticate_http_readonly="true"
--authenticate_http_readwrite="true" --authenticatee="crammd5" --authentication_backoff_factor="1secs"
--authorizer="local" --cgroups_cpu_enable_pids_and_tids_count="false" --cgroups_enable_cfs="false"
--cgroups_hierarchy="/sys/fs/cgroup" --cgroups_limit_swap="false" --cgroups_root="mesos" --container_disk_watch_interval="15secs"
--containerizers="mesos" --credential="/tmp/Endpoint_SlaveEndpointTest_NoAuthorizer_1_h43L5X/credential"
--default_role="*" --disallow_sharing_agent_pid_namespace="false" --disk_watch_interval="1mins"
--docker="docker" --docker_kill_orphans="true" --docker_registry="https://registry-1.docker.io"
--docker_remove_delay="6hrs" --docker_socket="/var/run/docker.sock" --docker_stop_timeout="0ns"
--docker_store_dir="/tmp/Endpoint_SlaveEndpointTest_NoAuthorizer_1_h43L5X/store/docker" --docker_volume_checkpoint_dir="/var/run/mesos/isolators/docker/volume"
--enforce_container_disk_quota="false" --executor_registration_timeout="1mins" --executor_reregistration_timeout="2secs"
--executor_shutdown_grace_period="5secs" --fetcher_cache_dir="/tmp/Endpoint_SlaveEndpointTest_NoAuthorizer_1_h43L5X/fetch"
--fetcher_cache_size="2GB" --frameworks_home="" --gc_delay="1weeks" --gc_disk_headroom="0.1"
--hadoop_home="" --help="false" --hostname_lookup="true" --http_command_executor="false" --http_credentials="/tmp/Endpoint_SlaveEndpointTest_NoAuthorizer_1_h43L5X/http_credentials"
--http_heartbeat_interval="30secs" --initialize_driver_logging="true" --isolation="posix/cpu,posix/mem"
--launcher="posix" --launcher_dir="/mesos/mesos-1.5.0/_build/src" --logbufsecs="0" --logging_level="INFO"
--max_completed_executors_per_framework="150" --oversubscribed_resources_interval="15secs"
--perf_duration="10secs" --perf_interval="1mins" --port="5051" --qos_correction_interval_min="0ns"
--quiet="false" --recover="reconnect" --recovery_timeout="15mins" --registration_backoff_factor="10ms"
--resources="cpus:2;gpus:0;mem:1024;disk:1024;ports:[31000-32000]" --revocable_cpu_low_priority="true"
--runtime_dir="/tmp/Endpoint_SlaveEndpointTest_NoAuthorizer_1_h43L5X" --sandbox_directory="/mnt/mesos/sandbox"
--strict="true" --switch_user="true" --systemd_enable_support="true" --systemd_runtime_directory="/run/systemd/system"
--version="false" --work_dir="/tmp/Endpoint_SlaveEndpointTest_NoAuthorizer_1_AGYyGC" --zk_session_timeout="10secs"
I1009 22:31:39.769187  6600 credentials.hpp:86] Loading credential for authentication from
'/tmp/Endpoint_SlaveEndpointTest_NoAuthorizer_1_h43L5X/credential'
I1009 22:31:39.769377  6600 slave.cpp:287] Agent using credential for: test-principal
I1009 22:31:39.769400  6600 credentials.hpp:37] Loading credentials for authentication from
'/tmp/Endpoint_SlaveEndpointTest_NoAuthorizer_1_h43L5X/http_credentials'
I1009 22:31:39.769726  6600 http.cpp:1045] Creating default 'basic' HTTP authenticator for
realm 'mesos-agent-readonly'
I1009 22:31:39.769954  6600 http.cpp:1045] Creating default 'basic' HTTP authenticator for
realm 'mesos-agent-readwrite'
I1009 22:31:39.772188  6600 slave.cpp:585] Agent resources: [{"name":"cpus","scalar":{"value":2.0},"type":"SCALAR"},{"name":"mem","scalar":{"value":1024.0},"type":"SCALAR"},{"name":"disk","scalar":{"value":1024.0},"type":"SCALAR"},{"name":"ports","ranges":{"range":[{"begin":31000,"end":32000}]},"type":"RANGES"}]
I1009 22:31:39.772604  6600 slave.cpp:593] Agent attributes: [  ]
I1009 22:31:39.772629  6600 slave.cpp:602] Agent hostname: a57666fd2364
I1009 22:31:39.772810  6592 status_update_manager.cpp:177] Pausing sending status updates
I1009 22:31:39.774446  6581 state.cpp:64] Recovering state from '/tmp/Endpoint_SlaveEndpointTest_NoAuthorizer_1_AGYyGC/meta'
I1009 22:31:39.774798  6595 status_update_manager.cpp:203] Recovering status update manager
I1009 22:31:39.774991  6593 containerizer.cpp:648] Recovering containerizer
I1009 22:31:39.776351  6591 provisioner.cpp:416] Provisioner recovery complete
I1009 22:31:39.776757  6592 slave.cpp:6326] Finished recovery
I1009 22:31:39.777192  6592 slave.cpp:6512] Querying resource estimator for oversubscribable
resources
I1009 22:31:39.777431  6581 slave.cpp:6526] Received oversubscribable resources {} from the
resource estimator
I1009 22:31:39.779660  6580 process.cpp:3929] Handling HTTP event for process 'slave(824)'
with path: '/slave(824)/monitor/statistics.json'
I1009 22:31:39.780745  6589 http.cpp:1185] HTTP GET for /slave(824)/monitor/statistics.json
from 172.17.0.2:39464
I1009 22:31:39.780812  6589 http.cpp:976] Authorizing principal 'test-principal' to GET the
'/monitor/statistics.json' endpoint
I1009 22:31:39.784669  6588 slave.cpp:869] Agent terminating
[       OK ] Endpoint/SlaveEndpointTest.NoAuthorizer/1 (35 ms)
[ RUN      ] Endpoint/SlaveEndpointTest.NoAuthorizer/2
I1009 22:31:39.798498  6577 containerizer.cpp:292] Using isolation { environment_secret, posix/cpu,
posix/mem, filesystem/posix, network/cni }
W1009 22:31:39.798988  6577 backend.cpp:76] Failed to create 'aufs' backend: AufsBackend requires
root privileges
W1009 22:31:39.799093  6577 backend.cpp:76] Failed to create 'bind' backend: BindBackend requires
root privileges
I1009 22:31:39.799124  6577 provisioner.cpp:255] Using default backend 'copy'
I1009 22:31:39.800977  6577 cluster.cpp:448] Creating default 'local' authorizer
I1009 22:31:39.803082  6580 slave.cpp:254] Mesos agent started on (825)@172.17.0.2:35247
I1009 22:31:39.803103  6580 slave.cpp:255] Flags at startup: --acls="" --appc_simple_discovery_uri_prefix="http://"
--appc_store_dir="/tmp/Endpoint_SlaveEndpointTest_NoAuthorizer_2_nQBG0l/store/appc" --authenticate_http_readonly="true"
--authenticate_http_readwrite="true" --authenticatee="crammd5" --authentication_backoff_factor="1secs"
--authorizer="local" --cgroups_cpu_enable_pids_and_tids_count="false" --cgroups_enable_cfs="false"
--cgroups_hierarchy="/sys/fs/cgroup" --cgroups_limit_swap="false" --cgroups_root="mesos" --container_disk_watch_interval="15secs"
--containerizers="mesos" --credential="/tmp/Endpoint_SlaveEndpointTest_NoAuthorizer_2_nQBG0l/credential"
--default_role="*" --disallow_sharing_agent_pid_namespace="false" --disk_watch_interval="1mins"
--docker="docker" --docker_kill_orphans="true" --docker_registry="https://registry-1.docker.io"
--docker_remove_delay="6hrs" --docker_socket="/var/run/docker.sock" --docker_stop_timeout="0ns"
--docker_store_dir="/tmp/Endpoint_SlaveEndpointTest_NoAuthorizer_2_nQBG0l/store/docker" --docker_volume_checkpoint_dir="/var/run/mesos/isolators/docker/volume"
--enforce_container_disk_quota="false" --executor_registration_timeout="1mins" --executor_reregistration_timeout="2secs"
--executor_shutdown_grace_period="5secs" --fetcher_cache_dir="/tmp/Endpoint_SlaveEndpointTest_NoAuthorizer_2_nQBG0l/fetch"
--fetcher_cache_size="2GB" --frameworks_home="" --gc_delay="1weeks" --gc_disk_headroom="0.1"
--hadoop_home="" --help="false" --hostname_lookup="true" --http_command_executor="false" --http_credentials="/tmp/Endpoint_SlaveEndpointTest_NoAuthorizer_2_nQBG0l/http_credentials"
--http_heartbeat_interval="30secs" --initialize_driver_logging="true" --isolation="posix/cpu,posix/mem"
--launcher="posix" --launcher_dir="/mesos/mesos-1.5.0/_build/src" --logbufsecs="0" --logging_level="INFO"
--max_completed_executors_per_framework="150" --oversubscribed_resources_interval="15secs"
--perf_duration="10secs" --perf_interval="1mins" --port="5051" --qos_correction_interval_min="0ns"
--quiet="false" --recover="reconnect" --recovery_timeout="15mins" --registration_backoff_factor="10ms"
--resources="cpus:2;gpus:0;mem:1024;disk:1024;ports:[31000-32000]" --revocable_cpu_low_priority="true"
--runtime_dir="/tmp/Endpoint_SlaveEndpointTest_NoAuthorizer_2_nQBG0l" --sandbox_directory="/mnt/mesos/sandbox"
--strict="true" --switch_user="true" --systemd_enable_support="true" --systemd_runtime_directory="/run/systemd/system"
--version="false" --work_dir="/tmp/Endpoint_SlaveEndpointTest_NoAuthorizer_2_6sacw0" --zk_session_timeout="10secs"
I1009 22:31:39.803467  6580 credentials.hpp:86] Loading credential for authentication from
'/tmp/Endpoint_SlaveEndpointTest_NoAuthorizer_2_nQBG0l/credential'
I1009 22:31:39.803617  6580 slave.cpp:287] Agent using credential for: test-principal
I1009 22:31:39.803639  6580 credentials.hpp:37] Loading credentials for authentication from
'/tmp/Endpoint_SlaveEndpointTest_NoAuthorizer_2_nQBG0l/http_credentials'
I1009 22:31:39.803858  6580 http.cpp:1045] Creating default 'basic' HTTP authenticator for
realm 'mesos-agent-readonly'
I1009 22:31:39.804006  6580 http.cpp:1045] Creating default 'basic' HTTP authenticator for
realm 'mesos-agent-readwrite'
I1009 22:31:39.805352  6580 slave.cpp:585] Agent resources: [{"name":"cpus","scalar":{"value":2.0},"type":"SCALAR"},{"name":"mem","scalar":{"value":1024.0},"type":"SCALAR"},{"name":"disk","scalar":{"value":1024.0},"type":"SCALAR"},{"name":"ports","ranges":{"range":[{"begin":31000,"end":32000}]},"type":"RANGES"}]
I1009 22:31:39.805583  6580 slave.cpp:593] Agent attributes: [  ]
I1009 22:31:39.805595  6580 slave.cpp:602] Agent hostname: a57666fd2364
I1009 22:31:39.805737  6588 status_update_manager.cpp:177] Pausing sending status updates
I1009 22:31:39.807059  6587 state.cpp:64] Recovering state from '/tmp/Endpoint_SlaveEndpointTest_NoAuthorizer_2_6sacw0/meta'
I1009 22:31:39.807374  6592 status_update_manager.cpp:203] Recovering status update manager
I1009 22:31:39.807559  6592 containerizer.cpp:648] Recovering containerizer
I1009 22:31:39.809208  6582 provisioner.cpp:416] Provisioner recovery complete
I1009 22:31:39.809595  6579 slave.cpp:6326] Finished recovery
I1009 22:31:39.810035  6579 slave.cpp:6512] Querying resource estimator for oversubscribable
resources
I1009 22:31:39.810297  6590 slave.cpp:6526] Received oversubscribable resources {} from the
resource estimator
I1009 22:31:39.812698  6593 process.cpp:3929] Handling HTTP event for process 'slave(825)'
with path: '/slave(825)/containers'
I1009 22:31:39.814046  6585 http.cpp:1185] HTTP GET for /slave(825)/containers from 172.17.0.2:39466
I1009 22:31:39.814118  6585 http.cpp:976] Authorizing principal 'test-principal' to GET the
'/containers' endpoint
I1009 22:31:39.818073  6594 slave.cpp:869] Agent terminating
[       OK ] Endpoint/SlaveEndpointTest.NoAuthorizer/2 (32 ms)
[----------] 9 tests from Endpoint/SlaveEndpointTest (317 ms total)

[----------] 2 tests from ContainerizerType/DefaultContainerDNSFlagTest
[ RUN      ] ContainerizerType/DefaultContainerDNSFlagTest.ValidateFlag/0
[       OK ] ContainerizerType/DefaultContainerDNSFlagTest.ValidateFlag/0 (11 ms)
[ RUN      ] ContainerizerType/DefaultContainerDNSFlagTest.ValidateFlag/1
[       OK ] ContainerizerType/DefaultContainerDNSFlagTest.ValidateFlag/1 (10 ms)
[----------] 2 tests from ContainerizerType/DefaultContainerDNSFlagTest (21 ms total)

[----------] Global test environment tear-down
[==========] 1685 tests from 185 test cases ran. (464985 ms total)
[  PASSED  ] 1684 tests.
[  FAILED  ] 1 test, listed below:
[  FAILED  ] ExamplesTest.TestHTTPFramework

 1 FAILED TEST
  YOU HAVE 21 DISABLED TESTS

I1009 22:31:39.912042  6602 process.cpp:1068] Failed to accept socket: future discarded
make[4]: *** [check-local] Error 1
make[4]: Leaving directory `/mesos/mesos-1.5.0/_build/src'
make[3]: *** [check-am] Error 2
make[3]: Leaving directory `/mesos/mesos-1.5.0/_build/src'
make[2]: *** [check] Error 2
make[2]: Leaving directory `/mesos/mesos-1.5.0/_build/src'
make[1]: *** [check-recursive] Error 1
make[1]: Leaving directory `/mesos/mesos-1.5.0/_build'
make: *** [distcheck] Error 1
+ docker rmi mesos-1507585769-31621
Untagged: mesos-1507585769-31621:latest
Deleted: sha256:102c6029bc51bf0a5bd3dca1834601e8a31e2551f4b41853662c7b2e79a1b640
Deleted: sha256:4fd9732304eae3ed00c7a9b992105728e1dd532327b2a761b9a1565db4812b2b
Deleted: sha256:a4ce97fc53eac26faa2a9173cf6d8bfad4f76e4df3a75a6393e5679b9d1914d3
Deleted: sha256:04cca4a7ab655575cefc10938c4632ff72090d463e1b27119bd5a3605a180a69
Deleted: sha256:2438fb8bfce24ea5ce11dcd811de3df14b6b1fd5b31fb0dd13c08c8f8a619efa
Deleted: sha256:7c170595721619da8ff4e47220c60c48114f01a91856f24b9f3b6d70b8ac134a
Deleted: sha256:29c6cde7e600faa5c0cf610cc746b9eb4c7d7ba5da62e4062e7b456c81468fb1
Deleted: sha256:da90114bbac2b12589f5e01ec0666eb3d10a7422a8843be427e7f1724d9e8f5f
Deleted: sha256:621529ddc23235005507a91b50364087bd78fd8503047e636ce8cf6dfc64848b
Deleted: sha256:14d5a10144756790ba260fb71e9fcc6a41a60f71c9a1aa699e6887615de02ae8
Deleted: sha256:4996f9e2a5a77182051b6c875d42691e2538d8d4ef04bb5a8c76e9f9d416f0e1
Deleted: sha256:d78107620a2c7d3c2be3cf51cdf486b62e61c2249256b1713068ed33d8410519
Deleted: sha256:613cbbbf131b72926100f2f477b6314151a88a816f1c718de1c5663b03a231d3
Deleted: sha256:bb83a35bbaf9956c6feec4b0e37fc0c76b931a2dfb1797348508dd441aa829ed
Deleted: sha256:16142f5a3b80c8948360305fb53fcf923b17e34bba8f8175b8a7e7accc07f339
Deleted: sha256:5d5928bd2da4f2f4ddb8c3897c46ea30d6f6d48df606e4fccaf0bc7470aef946
Deleted: sha256:34b4eb011074d3204c0d90c65c01690775d5d2610065c1bccd099e87b2bdc4f9
Deleted: sha256:0b69c65cbb1242025d38d7200eb306a18e5ac4b1699382251fc54355991613aa
Deleted: sha256:2b93dae0e9710a7420b33534c83d9c2fb236e494f28af5f95abe4e7b28b08c50
Deleted: sha256:7ab90f0aa652690a540019bbcef4eb1e3b8c872a4aff8788e8957e59263862ea
Deleted: sha256:a4f6701a2b9f02d06ba871ec2fd3bdce1152bd32fdc863eddc50a200cb70873a
Deleted: sha256:3d7791e47f9f34294938077c0fbb4f659b2437578ff70333c96e71bb0fd5ae0e
Deleted: sha256:57f46f1abaf93f034c597c2be9d4690f10627a7641e37b4fa724b334b9599552
Deleted: sha256:71c2235bd4e3ad59e83268c50cc85f7affd4cfd29b80957816799a6962a5375a
Deleted: sha256:d120fa1301cec52c46875090757badde1269bb62409733474c1bd57fa8b396e7
Deleted: sha256:a3bc6f1150acb3f26897db4eb8204ffab86fab171c70c8dfb60de620592214ef
Deleted: sha256:b34342bc87661aedc4bbd55ba4077ebfcdf073b9fc8dd01438f94a45c6f42f7b
Deleted: sha256:00e8e44b119da9767fd233d51e567e9430a0f12867caeb2735ea4c4486d1d417
Deleted: sha256:c8da5bd57219b46179854fce5d5dc0ef8dc2e100220175312b80d8ec1c23f4ad
Build step 'Execute shell' marked build as failure
Not sending mail to unregistered user xujyan@apple.com


Mime
View raw message