mesos-builds mailing list archives

Site index · List index
Message view « Date » · « Thread »
Top « Date » · « Thread »
From Apache Jenkins Server <jenk...@builds.apache.org>
Subject Build failed in Jenkins: Mesos-Buildbot » autotools,clang,--verbose --disable-libtool-wrappers --enable-libevent --enable-ssl,GLOG_v=1 MESOS_VERBOSE=1,ubuntu:14.04,(ubuntu)&&(!ubuntu-us1)&&(!ubuntu-eu2)&&(!qnode3)&&(!H23) #4313
Date Thu, 12 Oct 2017 17:10:53 GMT
See <https://builds.apache.org/job/Mesos-Buildbot/BUILDTOOL=autotools,COMPILER=clang,CONFIGURATION=--verbose%20--disable-libtool-wrappers%20--enable-libevent%20--enable-ssl,ENVIRONMENT=GLOG_v=1%20MESOS_VERBOSE=1,OS=ubuntu%3A14.04,label_exp=(ubuntu)&&(!ubuntu-us1)&&(!ubuntu-eu2)&&(!qnode3)&&(!H23)/4313/display/redirect?page=changes>

Changes:

[alexr] Sent TASK_STARTING from the built-in executors.

[alexr] Fix unit tests that were broken by the additional TASK_STARTING update.

[alexr] Added MESOS-7941 to changelog and to upgrade guidelines.

------------------------------------------
[...truncated 33.97 MB...]
I1012 17:10:43.536149 16969 slave.cpp:255] Flags at startup: --acls="" --appc_simple_discovery_uri_prefix="http://"
--appc_store_dir="/tmp/Endpoint_SlaveEndpointTest_UnauthorizedRequest_0_0mavg2/store/appc"
--authenticate_http_executors="true" --authenticate_http_readonly="true" --authenticate_http_readwrite="true"
--authenticatee="crammd5" --authentication_backoff_factor="1secs" --authorizer="local" --cgroups_cpu_enable_pids_and_tids_count="false"
--cgroups_enable_cfs="false" --cgroups_hierarchy="/sys/fs/cgroup" --cgroups_limit_swap="false"
--cgroups_root="mesos" --container_disk_watch_interval="15secs" --containerizers="mesos" --credential="/tmp/Endpoint_SlaveEndpointTest_UnauthorizedRequest_0_0mavg2/credential"
--default_role="*" --disallow_sharing_agent_pid_namespace="false" --disk_watch_interval="1mins"
--docker="docker" --docker_kill_orphans="true" --docker_registry="https://registry-1.docker.io"
--docker_remove_delay="6hrs" --docker_socket="/var/run/docker.sock" --docker_stop_timeout="0ns"
--docker_store_dir="/tmp/Endpoint_SlaveEndpointTest_UnauthorizedRequest_0_0mavg2/store/docker"
--docker_volume_checkpoint_dir="/var/run/mesos/isolators/docker/volume" --enforce_container_disk_quota="false"
--executor_registration_timeout="1mins" --executor_reregistration_timeout="2secs" --executor_secret_key="/tmp/Endpoint_SlaveEndpointTest_UnauthorizedRequest_0_0mavg2/executor_secret_key"
--executor_shutdown_grace_period="5secs" --fetcher_cache_dir="/tmp/Endpoint_SlaveEndpointTest_UnauthorizedRequest_0_0mavg2/fetch"
--fetcher_cache_size="2GB" --frameworks_home="" --gc_delay="1weeks" --gc_disk_headroom="0.1"
--hadoop_home="" --help="false" --hostname_lookup="true" --http_command_executor="false" --http_credentials="/tmp/Endpoint_SlaveEndpointTest_UnauthorizedRequest_0_0mavg2/http_credentials"
--http_heartbeat_interval="30secs" --initialize_driver_logging="true" --isolation="posix/cpu,posix/mem"
--launcher="posix" --launcher_dir="/mesos/mesos-1.5.0/_build/src" --logbufsecs="0" --logging_level="INFO"
--max_completed_executors_per_framework="150" --oversubscribed_resources_interval="15secs"
--perf_duration="10secs" --perf_interval="1mins" --port="5051" --qos_correction_interval_min="0ns"
--quiet="false" --recover="reconnect" --recovery_timeout="15mins" --registration_backoff_factor="10ms"
--resources="cpus:2;gpus:0;mem:1024;disk:1024;ports:[31000-32000]" --revocable_cpu_low_priority="true"
--runtime_dir="/tmp/Endpoint_SlaveEndpointTest_UnauthorizedRequest_0_0mavg2" --sandbox_directory="/mnt/mesos/sandbox"
--strict="true" --switch_user="true" --systemd_enable_support="true" --systemd_runtime_directory="/run/systemd/system"
--version="false" --work_dir="/tmp/Endpoint_SlaveEndpointTest_UnauthorizedRequest_0_cxhdLF"
--zk_session_timeout="10secs"
I1012 17:10:43.536577 16969 credentials.hpp:86] Loading credential for authentication from
'/tmp/Endpoint_SlaveEndpointTest_UnauthorizedRequest_0_0mavg2/credential'
I1012 17:10:43.536762 16969 slave.cpp:287] Agent using credential for: test-principal
I1012 17:10:43.536794 16969 credentials.hpp:37] Loading credentials for authentication from
'/tmp/Endpoint_SlaveEndpointTest_UnauthorizedRequest_0_0mavg2/http_credentials'
I1012 17:10:43.537101 16969 http.cpp:1045] Creating default 'basic' HTTP authenticator for
realm 'mesos-agent-executor'
I1012 17:10:43.537235 16969 http.cpp:1066] Creating default 'jwt' HTTP authenticator for realm
'mesos-agent-executor'
I1012 17:10:43.537474 16969 http.cpp:1045] Creating default 'basic' HTTP authenticator for
realm 'mesos-agent-readonly'
I1012 17:10:43.537571 16969 http.cpp:1066] Creating default 'jwt' HTTP authenticator for realm
'mesos-agent-readonly'
I1012 17:10:43.537771 16969 http.cpp:1045] Creating default 'basic' HTTP authenticator for
realm 'mesos-agent-readwrite'
I1012 17:10:43.537859 16969 http.cpp:1066] Creating default 'jwt' HTTP authenticator for realm
'mesos-agent-readwrite'
I1012 17:10:43.539238 16969 slave.cpp:585] Agent resources: [{"name":"cpus","scalar":{"value":2.0},"type":"SCALAR"},{"name":"mem","scalar":{"value":1024.0},"type":"SCALAR"},{"name":"disk","scalar":{"value":1024.0},"type":"SCALAR"},{"name":"ports","ranges":{"range":[{"begin":31000,"end":32000}]},"type":"RANGES"}]
I1012 17:10:43.539435 16969 slave.cpp:593] Agent attributes: [  ]
I1012 17:10:43.539449 16969 slave.cpp:602] Agent hostname: 30f6be8a8068
I1012 17:10:43.539585 16983 status_update_manager.cpp:177] Pausing sending status updates
I1012 17:10:43.541210 16980 state.cpp:64] Recovering state from '/tmp/Endpoint_SlaveEndpointTest_UnauthorizedRequest_0_cxhdLF/meta'
I1012 17:10:43.542639 16974 status_update_manager.cpp:203] Recovering status update manager
I1012 17:10:43.542831 16976 containerizer.cpp:648] Recovering containerizer
I1012 17:10:43.543951 16970 provisioner.cpp:416] Provisioner recovery complete
I1012 17:10:43.544258 16975 slave.cpp:6310] Finished recovery
I1012 17:10:43.544749 16975 slave.cpp:6492] Querying resource estimator for oversubscribable
resources
I1012 17:10:43.544966 16969 slave.cpp:6506] Received oversubscribable resources {} from the
resource estimator
I1012 17:10:43.547731 16979 process.cpp:3929] Handling HTTP event for process 'slave(828)'
with path: '/slave(828)/monitor/statistics'
I1012 17:10:43.549620 16983 http.cpp:1185] HTTP GET for /slave(828)/monitor/statistics from
172.17.0.2:58462
I1012 17:10:43.549732 16983 http.cpp:976] Authorizing principal 'test-principal' to GET the
'/monitor/statistics' endpoint
I1012 17:10:43.551723 16967 slave.cpp:869] Agent terminating
[       OK ] Endpoint/SlaveEndpointTest.UnauthorizedRequest/0 (40 ms)
[ RUN      ] Endpoint/SlaveEndpointTest.UnauthorizedRequest/1
I1012 17:10:43.573981  6768 containerizer.cpp:292] Using isolation { environment_secret, posix/cpu,
posix/mem, filesystem/posix, network/cni }
W1012 17:10:43.574632  6768 backend.cpp:76] Failed to create 'aufs' backend: AufsBackend requires
root privileges
W1012 17:10:43.574762  6768 backend.cpp:76] Failed to create 'bind' backend: BindBackend requires
root privileges
I1012 17:10:43.574805  6768 provisioner.cpp:255] Using default backend 'copy'
I1012 17:10:43.578742 16967 slave.cpp:254] Mesos agent started on (829)@172.17.0.2:46656
I1012 17:10:43.578781 16967 slave.cpp:255] Flags at startup: --acls="" --appc_simple_discovery_uri_prefix="http://"
--appc_store_dir="/tmp/Endpoint_SlaveEndpointTest_UnauthorizedRequest_1_TlDyBu/store/appc"
--authenticate_http_executors="true" --authenticate_http_readonly="true" --authenticate_http_readwrite="true"
--authenticatee="crammd5" --authentication_backoff_factor="1secs" --authorizer="local" --cgroups_cpu_enable_pids_and_tids_count="false"
--cgroups_enable_cfs="false" --cgroups_hierarchy="/sys/fs/cgroup" --cgroups_limit_swap="false"
--cgroups_root="mesos" --container_disk_watch_interval="15secs" --containerizers="mesos" --credential="/tmp/Endpoint_SlaveEndpointTest_UnauthorizedRequest_1_TlDyBu/credential"
--default_role="*" --disallow_sharing_agent_pid_namespace="false" --disk_watch_interval="1mins"
--docker="docker" --docker_kill_orphans="true" --docker_registry="https://registry-1.docker.io"
--docker_remove_delay="6hrs" --docker_socket="/var/run/docker.sock" --docker_stop_timeout="0ns"
--docker_store_dir="/tmp/Endpoint_SlaveEndpointTest_UnauthorizedRequest_1_TlDyBu/store/docker"
--docker_volume_checkpoint_dir="/var/run/mesos/isolators/docker/volume" --enforce_container_disk_quota="false"
--executor_registration_timeout="1mins" --executor_reregistration_timeout="2secs" --executor_secret_key="/tmp/Endpoint_SlaveEndpointTest_UnauthorizedRequest_1_TlDyBu/executor_secret_key"
--executor_shutdown_grace_period="5secs" --fetcher_cache_dir="/tmp/Endpoint_SlaveEndpointTest_UnauthorizedRequest_1_TlDyBu/fetch"
--fetcher_cache_size="2GB" --frameworks_home="" --gc_delay="1weeks" --gc_disk_headroom="0.1"
--hadoop_home="" --help="false" --hostname_lookup="true" --http_command_executor="false" --http_credentials="/tmp/Endpoint_SlaveEndpointTest_UnauthorizedRequest_1_TlDyBu/http_credentials"
--http_heartbeat_interval="30secs" --initialize_driver_logging="true" --isolation="posix/cpu,posix/mem"
--launcher="posix" --launcher_dir="/mesos/mesos-1.5.0/_build/src" --logbufsecs="0" --logging_level="INFO"
--max_completed_executors_per_framework="150" --oversubscribed_resources_interval="15secs"
--perf_duration="10secs" --perf_interval="1mins" --port="5051" --qos_correction_interval_min="0ns"
--quiet="false" --recover="reconnect" --recovery_timeout="15mins" --registration_backoff_factor="10ms"
--resources="cpus:2;gpus:0;mem:1024;disk:1024;ports:[31000-32000]" --revocable_cpu_low_priority="true"
--runtime_dir="/tmp/Endpoint_SlaveEndpointTest_UnauthorizedRequest_1_TlDyBu" --sandbox_directory="/mnt/mesos/sandbox"
--strict="true" --switch_user="true" --systemd_enable_support="true" --systemd_runtime_directory="/run/systemd/system"
--version="false" --work_dir="/tmp/Endpoint_SlaveEndpointTest_UnauthorizedRequest_1_tuwd07"
--zk_session_timeout="10secs"
I1012 17:10:43.579272 16967 credentials.hpp:86] Loading credential for authentication from
'/tmp/Endpoint_SlaveEndpointTest_UnauthorizedRequest_1_TlDyBu/credential'
I1012 17:10:43.579459 16967 slave.cpp:287] Agent using credential for: test-principal
I1012 17:10:43.579484 16967 credentials.hpp:37] Loading credentials for authentication from
'/tmp/Endpoint_SlaveEndpointTest_UnauthorizedRequest_1_TlDyBu/http_credentials'
I1012 17:10:43.579809 16967 http.cpp:1045] Creating default 'basic' HTTP authenticator for
realm 'mesos-agent-executor'
I1012 17:10:43.579952 16967 http.cpp:1066] Creating default 'jwt' HTTP authenticator for realm
'mesos-agent-executor'
I1012 17:10:43.580181 16967 http.cpp:1045] Creating default 'basic' HTTP authenticator for
realm 'mesos-agent-readonly'
I1012 17:10:43.580281 16967 http.cpp:1066] Creating default 'jwt' HTTP authenticator for realm
'mesos-agent-readonly'
I1012 17:10:43.580538 16967 http.cpp:1045] Creating default 'basic' HTTP authenticator for
realm 'mesos-agent-readwrite'
I1012 17:10:43.580652 16967 http.cpp:1066] Creating default 'jwt' HTTP authenticator for realm
'mesos-agent-readwrite'
I1012 17:10:43.582432 16967 slave.cpp:585] Agent resources: [{"name":"cpus","scalar":{"value":2.0},"type":"SCALAR"},{"name":"mem","scalar":{"value":1024.0},"type":"SCALAR"},{"name":"disk","scalar":{"value":1024.0},"type":"SCALAR"},{"name":"ports","ranges":{"range":[{"begin":31000,"end":32000}]},"type":"RANGES"}]
I1012 17:10:43.582710 16967 slave.cpp:593] Agent attributes: [  ]
I1012 17:10:43.582728 16967 slave.cpp:602] Agent hostname: 30f6be8a8068
I1012 17:10:43.583487 16976 status_update_manager.cpp:177] Pausing sending status updates
I1012 17:10:43.584676 16979 state.cpp:64] Recovering state from '/tmp/Endpoint_SlaveEndpointTest_UnauthorizedRequest_1_tuwd07/meta'
I1012 17:10:43.584985 16979 status_update_manager.cpp:203] Recovering status update manager
I1012 17:10:43.585188 16984 containerizer.cpp:648] Recovering containerizer
I1012 17:10:43.586866 16978 provisioner.cpp:416] Provisioner recovery complete
I1012 17:10:43.587430 16976 slave.cpp:6310] Finished recovery
I1012 17:10:43.587942 16976 slave.cpp:6492] Querying resource estimator for oversubscribable
resources
I1012 17:10:43.588229 16985 slave.cpp:6506] Received oversubscribable resources {} from the
resource estimator
I1012 17:10:43.590600 16971 process.cpp:3929] Handling HTTP event for process 'slave(829)'
with path: '/slave(829)/monitor/statistics.json'
I1012 17:10:43.592353 16969 http.cpp:1185] HTTP GET for /slave(829)/monitor/statistics.json
from 172.17.0.2:58464
I1012 17:10:43.592442 16969 http.cpp:976] Authorizing principal 'test-principal' to GET the
'/monitor/statistics.json' endpoint
I1012 17:10:43.594455  6768 slave.cpp:869] Agent terminating
[       OK ] Endpoint/SlaveEndpointTest.UnauthorizedRequest/1 (51 ms)
[ RUN      ] Endpoint/SlaveEndpointTest.UnauthorizedRequest/2
I1012 17:10:43.629971  6768 containerizer.cpp:292] Using isolation { environment_secret, posix/cpu,
posix/mem, filesystem/posix, network/cni }
W1012 17:10:43.631117  6768 backend.cpp:76] Failed to create 'aufs' backend: AufsBackend requires
root privileges
W1012 17:10:43.631525  6768 backend.cpp:76] Failed to create 'bind' backend: BindBackend requires
root privileges
I1012 17:10:43.631785  6768 provisioner.cpp:255] Using default backend 'copy'
I1012 17:10:43.637596 16969 slave.cpp:254] Mesos agent started on (830)@172.17.0.2:46656
I1012 17:10:43.637814 16969 slave.cpp:255] Flags at startup: --acls="" --appc_simple_discovery_uri_prefix="http://"
--appc_store_dir="/tmp/Endpoint_SlaveEndpointTest_UnauthorizedRequest_2_FvqzqX/store/appc"
--authenticate_http_executors="true" --authenticate_http_readonly="true" --authenticate_http_readwrite="true"
--authenticatee="crammd5" --authentication_backoff_factor="1secs" --authorizer="local" --cgroups_cpu_enable_pids_and_tids_count="false"
--cgroups_enable_cfs="false" --cgroups_hierarchy="/sys/fs/cgroup" --cgroups_limit_swap="false"
--cgroups_root="mesos" --container_disk_watch_interval="15secs" --containerizers="mesos" --credential="/tmp/Endpoint_SlaveEndpointTest_UnauthorizedRequest_2_FvqzqX/credential"
--default_role="*" --disallow_sharing_agent_pid_namespace="false" --disk_watch_interval="1mins"
--docker="docker" --docker_kill_orphans="true" --docker_registry="https://registry-1.docker.io"
--docker_remove_delay="6hrs" --docker_socket="/var/run/docker.sock" --docker_stop_timeout="0ns"
--docker_store_dir="/tmp/Endpoint_SlaveEndpointTest_UnauthorizedRequest_2_FvqzqX/store/docker"
--docker_volume_checkpoint_dir="/var/run/mesos/isolators/docker/volume" --enforce_container_disk_quota="false"
--executor_registration_timeout="1mins" --executor_reregistration_timeout="2secs" --executor_secret_key="/tmp/Endpoint_SlaveEndpointTest_UnauthorizedRequest_2_FvqzqX/executor_secret_key"
--executor_shutdown_grace_period="5secs" --fetcher_cache_dir="/tmp/Endpoint_SlaveEndpointTest_UnauthorizedRequest_2_FvqzqX/fetch"
--fetcher_cache_size="2GB" --frameworks_home="" --gc_delay="1weeks" --gc_disk_headroom="0.1"
--hadoop_home="" --help="false" --hostname_lookup="true" --http_command_executor="false" --http_credentials="/tmp/Endpoint_SlaveEndpointTest_UnauthorizedRequest_2_FvqzqX/http_credentials"
--http_heartbeat_interval="30secs" --initialize_driver_logging="true" --isolation="posix/cpu,posix/mem"
--launcher="posix" --launcher_dir="/mesos/mesos-1.5.0/_build/src" --logbufsecs="0" --logging_level="INFO"
--max_completed_executors_per_framework="150" --oversubscribed_resources_interval="15secs"
--perf_duration="10secs" --perf_interval="1mins" --port="5051" --qos_correction_interval_min="0ns"
--quiet="false" --recover="reconnect" --recovery_timeout="15mins" --registration_backoff_factor="10ms"
--resources="cpus:2;gpus:0;mem:1024;disk:1024;ports:[31000-32000]" --revocable_cpu_low_priority="true"
--runtime_dir="/tmp/Endpoint_SlaveEndpointTest_UnauthorizedRequest_2_FvqzqX" --sandbox_directory="/mnt/mesos/sandbox"
--strict="true" --switch_user="true" --systemd_enable_support="true" --systemd_runtime_directory="/run/systemd/system"
--version="false" --work_dir="/tmp/Endpoint_SlaveEndpointTest_UnauthorizedRequest_2_U4RjHA"
--zk_session_timeout="10secs"
I1012 17:10:43.638770 16969 credentials.hpp:86] Loading credential for authentication from
'/tmp/Endpoint_SlaveEndpointTest_UnauthorizedRequest_2_FvqzqX/credential'
I1012 17:10:43.639194 16969 slave.cpp:287] Agent using credential for: test-principal
I1012 17:10:43.639304 16969 credentials.hpp:37] Loading credentials for authentication from
'/tmp/Endpoint_SlaveEndpointTest_UnauthorizedRequest_2_FvqzqX/http_credentials'
I1012 17:10:43.639802 16969 http.cpp:1045] Creating default 'basic' HTTP authenticator for
realm 'mesos-agent-executor'
I1012 17:10:43.640067 16969 http.cpp:1066] Creating default 'jwt' HTTP authenticator for realm
'mesos-agent-executor'
I1012 17:10:43.640460 16969 http.cpp:1045] Creating default 'basic' HTTP authenticator for
realm 'mesos-agent-readonly'
I1012 17:10:43.640812 16969 http.cpp:1066] Creating default 'jwt' HTTP authenticator for realm
'mesos-agent-readonly'
I1012 17:10:43.641146 16969 http.cpp:1045] Creating default 'basic' HTTP authenticator for
realm 'mesos-agent-readwrite'
I1012 17:10:43.641368 16969 http.cpp:1066] Creating default 'jwt' HTTP authenticator for realm
'mesos-agent-readwrite'
I1012 17:10:43.643352 16969 slave.cpp:585] Agent resources: [{"name":"cpus","scalar":{"value":2.0},"type":"SCALAR"},{"name":"mem","scalar":{"value":1024.0},"type":"SCALAR"},{"name":"disk","scalar":{"value":1024.0},"type":"SCALAR"},{"name":"ports","ranges":{"range":[{"begin":31000,"end":32000}]},"type":"RANGES"}]
I1012 17:10:43.643597 16969 slave.cpp:593] Agent attributes: [  ]
I1012 17:10:43.643618 16969 slave.cpp:602] Agent hostname: 30f6be8a8068
I1012 17:10:43.643807 16975 status_update_manager.cpp:177] Pausing sending status updates
I1012 17:10:43.645223 16973 state.cpp:64] Recovering state from '/tmp/Endpoint_SlaveEndpointTest_UnauthorizedRequest_2_U4RjHA/meta'
I1012 17:10:43.645565 16978 status_update_manager.cpp:203] Recovering status update manager
I1012 17:10:43.645773 16970 containerizer.cpp:648] Recovering containerizer
I1012 17:10:43.647214 16981 provisioner.cpp:416] Provisioner recovery complete
I1012 17:10:43.647632 16975 slave.cpp:6310] Finished recovery
I1012 17:10:43.648265 16975 slave.cpp:6492] Querying resource estimator for oversubscribable
resources
I1012 17:10:43.648532 16990 slave.cpp:6506] Received oversubscribable resources {} from the
resource estimator
I1012 17:10:43.651096 16985 process.cpp:3929] Handling HTTP event for process 'slave(830)'
with path: '/slave(830)/containers'
I1012 17:10:43.652986 16984 http.cpp:1185] HTTP GET for /slave(830)/containers from 172.17.0.2:58466
I1012 17:10:43.653064 16984 http.cpp:976] Authorizing principal 'test-principal' to GET the
'/containers' endpoint
I1012 17:10:43.655078 16984 slave.cpp:869] Agent terminating
[       OK ] Endpoint/SlaveEndpointTest.UnauthorizedRequest/2 (42 ms)
[ RUN      ] Endpoint/SlaveEndpointTest.NoAuthorizer/0
I1012 17:10:43.667022  6768 containerizer.cpp:292] Using isolation { environment_secret, posix/cpu,
posix/mem, filesystem/posix, network/cni }
W1012 17:10:43.667517  6768 backend.cpp:76] Failed to create 'aufs' backend: AufsBackend requires
root privileges
W1012 17:10:43.667635  6768 backend.cpp:76] Failed to create 'bind' backend: BindBackend requires
root privileges
I1012 17:10:43.667670  6768 provisioner.cpp:255] Using default backend 'copy'
I1012 17:10:43.669378  6768 cluster.cpp:448] Creating default 'local' authorizer
I1012 17:10:43.671252 16971 slave.cpp:254] Mesos agent started on (831)@172.17.0.2:46656
I1012 17:10:43.671291 16971 slave.cpp:255] Flags at startup: --acls="" --appc_simple_discovery_uri_prefix="http://"
--appc_store_dir="/tmp/Endpoint_SlaveEndpointTest_NoAuthorizer_0_3oINGq/store/appc" --authenticate_http_executors="true"
--authenticate_http_readonly="true" --authenticate_http_readwrite="true" --authenticatee="crammd5"
--authentication_backoff_factor="1secs" --authorizer="local" --cgroups_cpu_enable_pids_and_tids_count="false"
--cgroups_enable_cfs="false" --cgroups_hierarchy="/sys/fs/cgroup" --cgroups_limit_swap="false"
--cgroups_root="mesos" --container_disk_watch_interval="15secs" --containerizers="mesos" --credential="/tmp/Endpoint_SlaveEndpointTest_NoAuthorizer_0_3oINGq/credential"
--default_role="*" --disallow_sharing_agent_pid_namespace="false" --disk_watch_interval="1mins"
--docker="docker" --docker_kill_orphans="true" --docker_registry="https://registry-1.docker.io"
--docker_remove_delay="6hrs" --docker_socket="/var/run/docker.sock" --docker_stop_timeout="0ns"
--docker_store_dir="/tmp/Endpoint_SlaveEndpointTest_NoAuthorizer_0_3oINGq/store/docker" --docker_volume_checkpoint_dir="/var/run/mesos/isolators/docker/volume"
--enforce_container_disk_quota="false" --executor_registration_timeout="1mins" --executor_reregistration_timeout="2secs"
--executor_secret_key="/tmp/Endpoint_SlaveEndpointTest_NoAuthorizer_0_3oINGq/executor_secret_key"
--executor_shutdown_grace_period="5secs" --fetcher_cache_dir="/tmp/Endpoint_SlaveEndpointTest_NoAuthorizer_0_3oINGq/fetch"
--fetcher_cache_size="2GB" --frameworks_home="" --gc_delay="1weeks" --gc_disk_headroom="0.1"
--hadoop_home="" --help="false" --hostname_lookup="true" --http_command_executor="false" --http_credentials="/tmp/Endpoint_SlaveEndpointTest_NoAuthorizer_0_3oINGq/http_credentials"
--http_heartbeat_interval="30secs" --initialize_driver_logging="true" --isolation="posix/cpu,posix/mem"
--launcher="posix" --launcher_dir="/mesos/mesos-1.5.0/_build/src" --logbufsecs="0" --logging_level="INFO"
--max_completed_executors_per_framework="150" --oversubscribed_resources_interval="15secs"
--perf_duration="10secs" --perf_interval="1mins" --port="5051" --qos_correction_interval_min="0ns"
--quiet="false" --recover="reconnect" --recovery_timeout="15mins" --registration_backoff_factor="10ms"
--resources="cpus:2;gpus:0;mem:1024;disk:1024;ports:[31000-32000]" --revocable_cpu_low_priority="true"
--runtime_dir="/tmp/Endpoint_SlaveEndpointTest_NoAuthorizer_0_3oINGq" --sandbox_directory="/mnt/mesos/sandbox"
--strict="true" --switch_user="true" --systemd_enable_support="true" --systemd_runtime_directory="/run/systemd/system"
--version="false" --work_dir="/tmp/Endpoint_SlaveEndpointTest_NoAuthorizer_0_DnTyR3" --zk_session_timeout="10secs"
I1012 17:10:43.671731 16971 credentials.hpp:86] Loading credential for authentication from
'/tmp/Endpoint_SlaveEndpointTest_NoAuthorizer_0_3oINGq/credential'
I1012 17:10:43.671953 16971 slave.cpp:287] Agent using credential for: test-principal
I1012 17:10:43.671974 16971 credentials.hpp:37] Loading credentials for authentication from
'/tmp/Endpoint_SlaveEndpointTest_NoAuthorizer_0_3oINGq/http_credentials'
I1012 17:10:43.672245 16971 http.cpp:1045] Creating default 'basic' HTTP authenticator for
realm 'mesos-agent-executor'
I1012 17:10:43.672379 16971 http.cpp:1066] Creating default 'jwt' HTTP authenticator for realm
'mesos-agent-executor'
I1012 17:10:43.672583 16971 http.cpp:1045] Creating default 'basic' HTTP authenticator for
realm 'mesos-agent-readonly'
I1012 17:10:43.672673 16971 http.cpp:1066] Creating default 'jwt' HTTP authenticator for realm
'mesos-agent-readonly'
I1012 17:10:43.672859 16971 http.cpp:1045] Creating default 'basic' HTTP authenticator for
realm 'mesos-agent-readwrite'
I1012 17:10:43.672950 16971 http.cpp:1066] Creating default 'jwt' HTTP authenticator for realm
'mesos-agent-readwrite'
I1012 17:10:43.674346 16971 slave.cpp:585] Agent resources: [{"name":"cpus","scalar":{"value":2.0},"type":"SCALAR"},{"name":"mem","scalar":{"value":1024.0},"type":"SCALAR"},{"name":"disk","scalar":{"value":1024.0},"type":"SCALAR"},{"name":"ports","ranges":{"range":[{"begin":31000,"end":32000}]},"type":"RANGES"}]
I1012 17:10:43.674553 16971 slave.cpp:593] Agent attributes: [  ]
I1012 17:10:43.674567 16971 slave.cpp:602] Agent hostname: 30f6be8a8068
I1012 17:10:43.674731 16987 status_update_manager.cpp:177] Pausing sending status updates
I1012 17:10:43.676257 16976 state.cpp:64] Recovering state from '/tmp/Endpoint_SlaveEndpointTest_NoAuthorizer_0_DnTyR3/meta'
I1012 17:10:43.676537 16983 status_update_manager.cpp:203] Recovering status update manager
I1012 17:10:43.676793 16981 containerizer.cpp:648] Recovering containerizer
I1012 17:10:43.678136 16988 provisioner.cpp:416] Provisioner recovery complete
I1012 17:10:43.678486 16986 slave.cpp:6310] Finished recovery
I1012 17:10:43.679085 16986 slave.cpp:6492] Querying resource estimator for oversubscribable
resources
I1012 17:10:43.679293 16982 slave.cpp:6506] Received oversubscribable resources {} from the
resource estimator
I1012 17:10:43.681743 16975 process.cpp:3929] Handling HTTP event for process 'slave(831)'
with path: '/slave(831)/monitor/statistics'
I1012 17:10:43.683418 16987 http.cpp:1185] HTTP GET for /slave(831)/monitor/statistics from
172.17.0.2:58468
I1012 17:10:43.683526 16987 http.cpp:976] Authorizing principal 'test-principal' to GET the
'/monitor/statistics' endpoint
I1012 17:10:43.686826  6768 slave.cpp:869] Agent terminating
[       OK ] Endpoint/SlaveEndpointTest.NoAuthorizer/0 (31 ms)
[ RUN      ] Endpoint/SlaveEndpointTest.NoAuthorizer/1
I1012 17:10:43.697921  6768 containerizer.cpp:292] Using isolation { environment_secret, posix/cpu,
posix/mem, filesystem/posix, network/cni }
W1012 17:10:43.698452  6768 backend.cpp:76] Failed to create 'aufs' backend: AufsBackend requires
root privileges
W1012 17:10:43.698577  6768 backend.cpp:76] Failed to create 'bind' backend: BindBackend requires
root privileges
I1012 17:10:43.698616  6768 provisioner.cpp:255] Using default backend 'copy'
I1012 17:10:43.700366  6768 cluster.cpp:448] Creating default 'local' authorizer
I1012 17:10:43.702246 16986 slave.cpp:254] Mesos agent started on (832)@172.17.0.2:46656
I1012 17:10:43.702298 16986 slave.cpp:255] Flags at startup: --acls="" --appc_simple_discovery_uri_prefix="http://"
--appc_store_dir="/tmp/Endpoint_SlaveEndpointTest_NoAuthorizer_1_f7VmfU/store/appc" --authenticate_http_executors="true"
--authenticate_http_readonly="true" --authenticate_http_readwrite="true" --authenticatee="crammd5"
--authentication_backoff_factor="1secs" --authorizer="local" --cgroups_cpu_enable_pids_and_tids_count="false"
--cgroups_enable_cfs="false" --cgroups_hierarchy="/sys/fs/cgroup" --cgroups_limit_swap="false"
--cgroups_root="mesos" --container_disk_watch_interval="15secs" --containerizers="mesos" --credential="/tmp/Endpoint_SlaveEndpointTest_NoAuthorizer_1_f7VmfU/credential"
--default_role="*" --disallow_sharing_agent_pid_namespace="false" --disk_watch_interval="1mins"
--docker="docker" --docker_kill_orphans="true" --docker_registry="https://registry-1.docker.io"
--docker_remove_delay="6hrs" --docker_socket="/var/run/docker.sock" --docker_stop_timeout="0ns"
--docker_store_dir="/tmp/Endpoint_SlaveEndpointTest_NoAuthorizer_1_f7VmfU/store/docker" --docker_volume_checkpoint_dir="/var/run/mesos/isolators/docker/volume"
--enforce_container_disk_quota="false" --executor_registration_timeout="1mins" --executor_reregistration_timeout="2secs"
--executor_secret_key="/tmp/Endpoint_SlaveEndpointTest_NoAuthorizer_1_f7VmfU/executor_secret_key"
--executor_shutdown_grace_period="5secs" --fetcher_cache_dir="/tmp/Endpoint_SlaveEndpointTest_NoAuthorizer_1_f7VmfU/fetch"
--fetcher_cache_size="2GB" --frameworks_home="" --gc_delay="1weeks" --gc_disk_headroom="0.1"
--hadoop_home="" --help="false" --hostname_lookup="true" --http_command_executor="false" --http_credentials="/tmp/Endpoint_SlaveEndpointTest_NoAuthorizer_1_f7VmfU/http_credentials"
--http_heartbeat_interval="30secs" --initialize_driver_logging="true" --isolation="posix/cpu,posix/mem"
--launcher="posix" --launcher_dir="/mesos/mesos-1.5.0/_build/src" --logbufsecs="0" --logging_level="INFO"
--max_completed_executors_per_framework="150" --oversubscribed_resources_interval="15secs"
--perf_duration="10secs" --perf_interval="1mins" --port="5051" --qos_correction_interval_min="0ns"
--quiet="false" --recover="reconnect" --recovery_timeout="15mins" --registration_backoff_factor="10ms"
--resources="cpus:2;gpus:0;mem:1024;disk:1024;ports:[31000-32000]" --revocable_cpu_low_priority="true"
--runtime_dir="/tmp/Endpoint_SlaveEndpointTest_NoAuthorizer_1_f7VmfU" --sandbox_directory="/mnt/mesos/sandbox"
--strict="true" --switch_user="true" --systemd_enable_support="true" --systemd_runtime_directory="/run/systemd/system"
--version="false" --work_dir="/tmp/Endpoint_SlaveEndpointTest_NoAuthorizer_1_9oTxlx" --zk_session_timeout="10secs"
I1012 17:10:43.702725 16986 credentials.hpp:86] Loading credential for authentication from
'/tmp/Endpoint_SlaveEndpointTest_NoAuthorizer_1_f7VmfU/credential'
I1012 17:10:43.702929 16986 slave.cpp:287] Agent using credential for: test-principal
I1012 17:10:43.702955 16986 credentials.hpp:37] Loading credentials for authentication from
'/tmp/Endpoint_SlaveEndpointTest_NoAuthorizer_1_f7VmfU/http_credentials'
I1012 17:10:43.703241 16986 http.cpp:1045] Creating default 'basic' HTTP authenticator for
realm 'mesos-agent-executor'
I1012 17:10:43.703379 16986 http.cpp:1066] Creating default 'jwt' HTTP authenticator for realm
'mesos-agent-executor'
I1012 17:10:43.703594 16986 http.cpp:1045] Creating default 'basic' HTTP authenticator for
realm 'mesos-agent-readonly'
I1012 17:10:43.703685 16986 http.cpp:1066] Creating default 'jwt' HTTP authenticator for realm
'mesos-agent-readonly'
I1012 17:10:43.703855 16986 http.cpp:1045] Creating default 'basic' HTTP authenticator for
realm 'mesos-agent-readwrite'
I1012 17:10:43.703948 16986 http.cpp:1066] Creating default 'jwt' HTTP authenticator for realm
'mesos-agent-readwrite'
I1012 17:10:43.705337 16986 slave.cpp:585] Agent resources: [{"name":"cpus","scalar":{"value":2.0},"type":"SCALAR"},{"name":"mem","scalar":{"value":1024.0},"type":"SCALAR"},{"name":"disk","scalar":{"value":1024.0},"type":"SCALAR"},{"name":"ports","ranges":{"range":[{"begin":31000,"end":32000}]},"type":"RANGES"}]
I1012 17:10:43.705540 16986 slave.cpp:593] Agent attributes: [  ]
I1012 17:10:43.705554 16986 slave.cpp:602] Agent hostname: 30f6be8a8068
I1012 17:10:43.705726 16971 status_update_manager.cpp:177] Pausing sending status updates
I1012 17:10:43.707307 16979 state.cpp:64] Recovering state from '/tmp/Endpoint_SlaveEndpointTest_NoAuthorizer_1_9oTxlx/meta'
I1012 17:10:43.707666 16976 status_update_manager.cpp:203] Recovering status update manager
I1012 17:10:43.707859 16984 containerizer.cpp:648] Recovering containerizer
I1012 17:10:43.709352 16975 provisioner.cpp:416] Provisioner recovery complete
I1012 17:10:43.709714 16971 slave.cpp:6310] Finished recovery
I1012 17:10:43.710299 16971 slave.cpp:6492] Querying resource estimator for oversubscribable
resources
I1012 17:10:43.710549 16982 slave.cpp:6506] Received oversubscribable resources {} from the
resource estimator
I1012 17:10:43.713089 16973 process.cpp:3929] Handling HTTP event for process 'slave(832)'
with path: '/slave(832)/monitor/statistics.json'
I1012 17:10:43.715169 16975 http.cpp:1185] HTTP GET for /slave(832)/monitor/statistics.json
from 172.17.0.2:58470
I1012 17:10:43.715291 16975 http.cpp:976] Authorizing principal 'test-principal' to GET the
'/monitor/statistics.json' endpoint
I1012 17:10:43.719074 16986 slave.cpp:869] Agent terminating
[       OK ] Endpoint/SlaveEndpointTest.NoAuthorizer/1 (37 ms)
[ RUN      ] Endpoint/SlaveEndpointTest.NoAuthorizer/2
I1012 17:10:43.736433  6768 containerizer.cpp:292] Using isolation { environment_secret, posix/cpu,
posix/mem, filesystem/posix, network/cni }
W1012 17:10:43.737061  6768 backend.cpp:76] Failed to create 'aufs' backend: AufsBackend requires
root privileges
W1012 17:10:43.737215  6768 backend.cpp:76] Failed to create 'bind' backend: BindBackend requires
root privileges
I1012 17:10:43.737262  6768 provisioner.cpp:255] Using default backend 'copy'
I1012 17:10:43.739202  6768 cluster.cpp:448] Creating default 'local' authorizer
I1012 17:10:43.741194 16982 slave.cpp:254] Mesos agent started on (833)@172.17.0.2:46656
I1012 17:10:43.741271 16982 slave.cpp:255] Flags at startup: --acls="" --appc_simple_discovery_uri_prefix="http://"
--appc_store_dir="/tmp/Endpoint_SlaveEndpointTest_NoAuthorizer_2_WKVh9n/store/appc" --authenticate_http_executors="true"
--authenticate_http_readonly="true" --authenticate_http_readwrite="true" --authenticatee="crammd5"
--authentication_backoff_factor="1secs" --authorizer="local" --cgroups_cpu_enable_pids_and_tids_count="false"
--cgroups_enable_cfs="false" --cgroups_hierarchy="/sys/fs/cgroup" --cgroups_limit_swap="false"
--cgroups_root="mesos" --container_disk_watch_interval="15secs" --containerizers="mesos" --credential="/tmp/Endpoint_SlaveEndpointTest_NoAuthorizer_2_WKVh9n/credential"
--default_role="*" --disallow_sharing_agent_pid_namespace="false" --disk_watch_interval="1mins"
--docker="docker" --docker_kill_orphans="true" --docker_registry="https://registry-1.docker.io"
--docker_remove_delay="6hrs" --docker_socket="/var/run/docker.sock" --docker_stop_timeout="0ns"
--docker_store_dir="/tmp/Endpoint_SlaveEndpointTest_NoAuthorizer_2_WKVh9n/store/docker" --docker_volume_checkpoint_dir="/var/run/mesos/isolators/docker/volume"
--enforce_container_disk_quota="false" --executor_registration_timeout="1mins" --executor_reregistration_timeout="2secs"
--executor_secret_key="/tmp/Endpoint_SlaveEndpointTest_NoAuthorizer_2_WKVh9n/executor_secret_key"
--executor_shutdown_grace_period="5secs" --fetcher_cache_dir="/tmp/Endpoint_SlaveEndpointTest_NoAuthorizer_2_WKVh9n/fetch"
--fetcher_cache_size="2GB" --frameworks_home="" --gc_delay="1weeks" --gc_disk_headroom="0.1"
--hadoop_home="" --help="false" --hostname_lookup="true" --http_command_executor="false" --http_credentials="/tmp/Endpoint_SlaveEndpointTest_NoAuthorizer_2_WKVh9n/http_credentials"
--http_heartbeat_interval="30secs" --initialize_driver_logging="true" --isolation="posix/cpu,posix/mem"
--launcher="posix" --launcher_dir="/mesos/mesos-1.5.0/_build/src" --logbufsecs="0" --logging_level="INFO"
--max_completed_executors_per_framework="150" --oversubscribed_resources_interval="15secs"
--perf_duration="10secs" --perf_interval="1mins" --port="5051" --qos_correction_interval_min="0ns"
--quiet="false" --recover="reconnect" --recovery_timeout="15mins" --registration_backoff_factor="10ms"
--resources="cpus:2;gpus:0;mem:1024;disk:1024;ports:[31000-32000]" --revocable_cpu_low_priority="true"
--runtime_dir="/tmp/Endpoint_SlaveEndpointTest_NoAuthorizer_2_WKVh9n" --sandbox_directory="/mnt/mesos/sandbox"
--strict="true" --switch_user="true" --systemd_enable_support="true" --systemd_runtime_directory="/run/systemd/system"
--version="false" --work_dir="/tmp/Endpoint_SlaveEndpointTest_NoAuthorizer_2_0WAS90" --zk_session_timeout="10secs"
I1012 17:10:43.741961 16982 credentials.hpp:86] Loading credential for authentication from
'/tmp/Endpoint_SlaveEndpointTest_NoAuthorizer_2_WKVh9n/credential'
I1012 17:10:43.742375 16982 slave.cpp:287] Agent using credential for: test-principal
I1012 17:10:43.742413 16982 credentials.hpp:37] Loading credentials for authentication from
'/tmp/Endpoint_SlaveEndpointTest_NoAuthorizer_2_WKVh9n/http_credentials'
I1012 17:10:43.742751 16982 http.cpp:1045] Creating default 'basic' HTTP authenticator for
realm 'mesos-agent-executor'
I1012 17:10:43.742929 16982 http.cpp:1066] Creating default 'jwt' HTTP authenticator for realm
'mesos-agent-executor'
I1012 17:10:43.743196 16982 http.cpp:1045] Creating default 'basic' HTTP authenticator for
realm 'mesos-agent-readonly'
I1012 17:10:43.743296 16982 http.cpp:1066] Creating default 'jwt' HTTP authenticator for realm
'mesos-agent-readonly'
I1012 17:10:43.743530 16982 http.cpp:1045] Creating default 'basic' HTTP authenticator for
realm 'mesos-agent-readwrite'
I1012 17:10:43.743633 16982 http.cpp:1066] Creating default 'jwt' HTTP authenticator for realm
'mesos-agent-readwrite'
I1012 17:10:43.745178 16982 slave.cpp:585] Agent resources: [{"name":"cpus","scalar":{"value":2.0},"type":"SCALAR"},{"name":"mem","scalar":{"value":1024.0},"type":"SCALAR"},{"name":"disk","scalar":{"value":1024.0},"type":"SCALAR"},{"name":"ports","ranges":{"range":[{"begin":31000,"end":32000}]},"type":"RANGES"}]
I1012 17:10:43.745430 16982 slave.cpp:593] Agent attributes: [  ]
I1012 17:10:43.745445 16982 slave.cpp:602] Agent hostname: 30f6be8a8068
I1012 17:10:43.745606 16974 status_update_manager.cpp:177] Pausing sending status updates
I1012 17:10:43.747447 16979 state.cpp:64] Recovering state from '/tmp/Endpoint_SlaveEndpointTest_NoAuthorizer_2_0WAS90/meta'
I1012 17:10:43.747818 16971 status_update_manager.cpp:203] Recovering status update manager
I1012 17:10:43.748008 16989 containerizer.cpp:648] Recovering containerizer
I1012 17:10:43.749305 16984 provisioner.cpp:416] Provisioner recovery complete
I1012 17:10:43.749714 16984 slave.cpp:6310] Finished recovery
I1012 17:10:43.750349 16984 slave.cpp:6492] Querying resource estimator for oversubscribable
resources
I1012 17:10:43.750619 16983 slave.cpp:6506] Received oversubscribable resources {} from the
resource estimator
I1012 17:10:43.753150 16968 process.cpp:3929] Handling HTTP event for process 'slave(833)'
with path: '/slave(833)/containers'
I1012 17:10:43.755517 16974 http.cpp:1185] HTTP GET for /slave(833)/containers from 172.17.0.2:58474
I1012 17:10:43.755646 16974 http.cpp:976] Authorizing principal 'test-principal' to GET the
'/containers' endpoint
I1012 17:10:43.760030 16978 slave.cpp:869] Agent terminating
[       OK ] Endpoint/SlaveEndpointTest.NoAuthorizer/2 (36 ms)
[----------] 9 tests from Endpoint/SlaveEndpointTest (342 ms total)

[----------] 2 tests from ContainerizerType/DefaultContainerDNSFlagTest
[ RUN      ] ContainerizerType/DefaultContainerDNSFlagTest.ValidateFlag/0
[       OK ] ContainerizerType/DefaultContainerDNSFlagTest.ValidateFlag/0 (10 ms)
[ RUN      ] ContainerizerType/DefaultContainerDNSFlagTest.ValidateFlag/1
[       OK ] ContainerizerType/DefaultContainerDNSFlagTest.ValidateFlag/1 (12 ms)
[----------] 2 tests from ContainerizerType/DefaultContainerDNSFlagTest (22 ms total)

[----------] Global test environment tear-down
[==========] 1703 tests from 187 test cases ran. (488439 ms total)
[  PASSED  ] 1701 tests.
[  FAILED  ] 2 tests, listed below:
[  FAILED  ] ExecutorAuthorizationTest.RunTaskGroup
[  FAILED  ] SlaveTest.RestartSlaveRequireExecutorAuthentication

 2 FAILED TESTS
  YOU HAVE 21 DISABLED TESTS

I1012 17:10:43.853766 16991 process.cpp:1068] Failed to accept socket: future discarded
make[4]: *** [check-local] Error 1
make[4]: Leaving directory `/mesos/mesos-1.5.0/_build/src'
make[3]: *** [check-am] Error 2
make[3]: Leaving directory `/mesos/mesos-1.5.0/_build/src'
make[2]: *** [check] Error 2
make[2]: Leaving directory `/mesos/mesos-1.5.0/_build/src'
make[1]: *** [check-recursive] Error 1
make[1]: Leaving directory `/mesos/mesos-1.5.0/_build'
make: *** [distcheck] Error 1
+ docker rmi mesos-1507825132-24535
Untagged: mesos-1507825132-24535:latest
Deleted: sha256:e3ad202d8eceb46ef638b741b0fe0c20b6b5ddb1f402d471a8cc955c6a560661
Deleted: sha256:ecee2979771ca85bbb3b424a1b89836d194315628de9cfb021e02d2c87ef2127
Deleted: sha256:f09b5d2f3bb58d8709c12300ffb6164a3ef02d29364b96ed8b675c9be5d1690b
Deleted: sha256:9dacf7ae6b1db5aacf732f04b691814947757aa03e87372dd4cc0bdc46cba520
Deleted: sha256:9b3e54f0c6e7960f864b9665fec6adae14cb41409a95bbbbd3230ca6d15de2fd
Deleted: sha256:6e2f804adb1722fd83f93d6ceedbf4f2fab877e5fada3cf77794c8e50ac898b3
Deleted: sha256:c175b99fa893100971d850fbeda067a52fa36b6fa195baccde324b4a85009d58
Deleted: sha256:ce2928a2605097bee31cb8748f7c4b360b375a611be95cb7f7dfe87c059421fb
Deleted: sha256:f76c81b6a7a00a4601cf9499dfd4f83fb0f82dfe828b9ec5ce7d2ca17c6e5fdd
Deleted: sha256:6b402ee2df7c65e5606bb3613a2c2fb10755f8e5550aa373b2ec471f2332918b
Deleted: sha256:3c325b27c88c99f493d061ce29e47a1a1f77113421885e4529ac882f83fe52f9
Deleted: sha256:2a82eaa3850af48a71531a410faacbfb72f0c688d50159261f303af3db4034c3
Deleted: sha256:619d2a38dc246a11621be287d949f27c00c59c759d050693b5c31d5a71b0d5ca
Deleted: sha256:e7f66d9fe5c0084b8409a7c03d052e02b64ffde1a973dc2d6557ba5f9bf85eea
Deleted: sha256:2e0a23b7056013e8699c9370ed18fffba4bd2fbac8bfeecd79cf0d92f9a56426
Deleted: sha256:005c37db4ef500bcd241da14b235512700a3fcaf2330bcdda7cf43755a3c95bc
Deleted: sha256:fd662112805774491abecf012283dc3d29ce8ceb825f9cf136ba34a93662fdd8
Deleted: sha256:ca9e342610c40d2f11e57127cbcedfaf6e93179043c1e5311f8ab24d456c1107
Deleted: sha256:ccf2622ec789412938ed3257b023e34b92aca0a61df4569f84da4a4de99642fe
Deleted: sha256:bd123c65cd6bfb25406fd8595a98b155fa3bd279c109e47205472458e2819032
Deleted: sha256:34463ae3431138f076d3f5996476a6ce6e6d236d9f6e7cf692582f2546627474
Deleted: sha256:8df7d7dfc8927c763ade29aa21ace32e9b0895fd4909e0533621acdb55b9dfc5
Deleted: sha256:656b0962a890353312c20f936d6ef02b1132a6b0a8c9e9fd9707660bf24b8437
Deleted: sha256:304ddf995c2aa5881b7860846f6a47eeeb373b36f1a81368065347902aad88ab
Deleted: sha256:e106404b170f396a45d772a75c2835800ed5b4defb69cf1edd3512eea7954c1a
Deleted: sha256:c426cfe30e090e8629886cdb71429cccd1c07fa18bd90a748dddb1189abf77b7
Deleted: sha256:1315b9bb8e32b5a57d2e17040f977594e907ef31b9b7431a5de95ddad313b156
Deleted: sha256:9c120f79d9638db7c0ba1336c48d90d4a1af6459cb7eabf6bb5c2b0ae421ff78
Build step 'Execute shell' marked build as failure


Mime
View raw message