mesos-builds mailing list archives

Site index · List index
Message view « Date » · « Thread »
Top « Date » · « Thread »
From Apache Jenkins Server <jenk...@builds.apache.org>
Subject Build failed in Jenkins: Mesos-Buildbot » autotools,gcc,--verbose --disable-libtool-wrappers --enable-libevent --enable-ssl,GLOG_v=1 MESOS_VERBOSE=1,ubuntu:14.04,(ubuntu)&&(!ubuntu-us1)&&(!ubuntu-eu2)&&(!qnode3)&&(!H23) #4316
Date Fri, 13 Oct 2017 00:38:14 GMT
See <https://builds.apache.org/job/Mesos-Buildbot/BUILDTOOL=autotools,COMPILER=gcc,CONFIGURATION=--verbose%20--disable-libtool-wrappers%20--enable-libevent%20--enable-ssl,ENVIRONMENT=GLOG_v=1%20MESOS_VERBOSE=1,OS=ubuntu%3A14.04,label_exp=(ubuntu)&&(!ubuntu-us1)&&(!ubuntu-eu2)&&(!qnode3)&&(!H23)/4316/display/redirect?page=changes>

Changes:

[bmahler] Used protobuf arenas for creating messages in ProtobufProcess.

[alexr] Revert "Sent TASK_STARTING from the built-in executors.".

[alexr] Revert "Fix unit tests that were broken by the additional...".

[songzihao1990] Updated doc for the changes of pid namespace sharing.

------------------------------------------
[...truncated 33.41 MB...]
I1013 00:34:28.437986 18711 slave.cpp:287] Agent using credential for: test-principal
I1013 00:34:28.438009 18711 credentials.hpp:37] Loading credentials for authentication from
'/tmp/Endpoint_SlaveEndpointTest_UnauthorizedRequest_0_xoclZY/http_credentials'
I1013 00:34:28.438288 18711 http.cpp:1045] Creating default 'basic' HTTP authenticator for
realm 'mesos-agent-executor'
I1013 00:34:28.438416 18711 http.cpp:1066] Creating default 'jwt' HTTP authenticator for realm
'mesos-agent-executor'
I1013 00:34:28.438637 18711 http.cpp:1045] Creating default 'basic' HTTP authenticator for
realm 'mesos-agent-readonly'
I1013 00:34:28.438738 18711 http.cpp:1066] Creating default 'jwt' HTTP authenticator for realm
'mesos-agent-readonly'
I1013 00:34:28.438936 18711 http.cpp:1045] Creating default 'basic' HTTP authenticator for
realm 'mesos-agent-readwrite'
I1013 00:34:28.439041 18711 http.cpp:1066] Creating default 'jwt' HTTP authenticator for realm
'mesos-agent-readwrite'
I1013 00:34:28.440515 18711 slave.cpp:585] Agent resources: [{"name":"cpus","scalar":{"value":2.0},"type":"SCALAR"},{"name":"mem","scalar":{"value":1024.0},"type":"SCALAR"},{"name":"disk","scalar":{"value":1024.0},"type":"SCALAR"},{"name":"ports","ranges":{"range":[{"begin":31000,"end":32000}]},"type":"RANGES"}]
I1013 00:34:28.440744 18711 slave.cpp:593] Agent attributes: [  ]
I1013 00:34:28.440758 18711 slave.cpp:602] Agent hostname: 4184b8220f05
I1013 00:34:28.440887 18720 status_update_manager.cpp:177] Pausing sending status updates
I1013 00:34:28.442386 18703 state.cpp:64] Recovering state from '/tmp/Endpoint_SlaveEndpointTest_UnauthorizedRequest_0_8rNy3j/meta'
I1013 00:34:28.442745 18703 status_update_manager.cpp:203] Recovering status update manager
I1013 00:34:28.442934 18703 containerizer.cpp:648] Recovering containerizer
I1013 00:34:28.444178 18706 provisioner.cpp:416] Provisioner recovery complete
I1013 00:34:28.444474 18720 slave.cpp:6310] Finished recovery
I1013 00:34:28.444926 18720 slave.cpp:6492] Querying resource estimator for oversubscribable
resources
I1013 00:34:28.445184 18715 slave.cpp:6506] Received oversubscribable resources {} from the
resource estimator
I1013 00:34:28.447616 18717 process.cpp:3929] Handling HTTP event for process 'slave(828)'
with path: '/slave(828)/monitor/statistics'
I1013 00:34:28.449424 18706 http.cpp:1185] HTTP GET for /slave(828)/monitor/statistics from
172.17.0.2:59748
I1013 00:34:28.449496 18706 http.cpp:976] Authorizing principal 'test-principal' to GET the
'/monitor/statistics' endpoint
I1013 00:34:28.451467 18713 slave.cpp:869] Agent terminating
[       OK ] Endpoint/SlaveEndpointTest.UnauthorizedRequest/0 (30 ms)
[ RUN      ] Endpoint/SlaveEndpointTest.UnauthorizedRequest/1
I1013 00:34:28.462496  8533 containerizer.cpp:292] Using isolation { environment_secret, posix/cpu,
posix/mem, filesystem/posix, network/cni }
W1013 00:34:28.462990  8533 backend.cpp:76] Failed to create 'aufs' backend: AufsBackend requires
root privileges
W1013 00:34:28.463100  8533 backend.cpp:76] Failed to create 'bind' backend: BindBackend requires
root privileges
I1013 00:34:28.463131  8533 provisioner.cpp:255] Using default backend 'copy'
I1013 00:34:28.466588 18701 slave.cpp:254] Mesos agent started on (829)@172.17.0.2:46387
I1013 00:34:28.466616 18701 slave.cpp:255] Flags at startup: --acls="" --appc_simple_discovery_uri_prefix="http://"
--appc_store_dir="/tmp/Endpoint_SlaveEndpointTest_UnauthorizedRequest_1_PLyPXC/store/appc"
--authenticate_http_executors="true" --authenticate_http_readonly="true" --authenticate_http_readwrite="true"
--authenticatee="crammd5" --authentication_backoff_factor="1secs" --authorizer="local" --cgroups_cpu_enable_pids_and_tids_count="false"
--cgroups_enable_cfs="false" --cgroups_hierarchy="/sys/fs/cgroup" --cgroups_limit_swap="false"
--cgroups_root="mesos" --container_disk_watch_interval="15secs" --containerizers="mesos" --credential="/tmp/Endpoint_SlaveEndpointTest_UnauthorizedRequest_1_PLyPXC/credential"
--default_role="*" --disallow_sharing_agent_pid_namespace="false" --disk_watch_interval="1mins"
--docker="docker" --docker_kill_orphans="true" --docker_registry="https://registry-1.docker.io"
--docker_remove_delay="6hrs" --docker_socket="/var/run/docker.sock" --docker_stop_timeout="0ns"
--docker_store_dir="/tmp/Endpoint_SlaveEndpointTest_UnauthorizedRequest_1_PLyPXC/store/docker"
--docker_volume_checkpoint_dir="/var/run/mesos/isolators/docker/volume" --enforce_container_disk_quota="false"
--executor_registration_timeout="1mins" --executor_reregistration_timeout="2secs" --executor_secret_key="/tmp/Endpoint_SlaveEndpointTest_UnauthorizedRequest_1_PLyPXC/executor_secret_key"
--executor_shutdown_grace_period="5secs" --fetcher_cache_dir="/tmp/Endpoint_SlaveEndpointTest_UnauthorizedRequest_1_PLyPXC/fetch"
--fetcher_cache_size="2GB" --frameworks_home="" --gc_delay="1weeks" --gc_disk_headroom="0.1"
--hadoop_home="" --help="false" --hostname_lookup="true" --http_command_executor="false" --http_credentials="/tmp/Endpoint_SlaveEndpointTest_UnauthorizedRequest_1_PLyPXC/http_credentials"
--http_heartbeat_interval="30secs" --initialize_driver_logging="true" --isolation="posix/cpu,posix/mem"
--launcher="posix" --launcher_dir="/mesos/mesos-1.5.0/_build/src" --logbufsecs="0" --logging_level="INFO"
--max_completed_executors_per_framework="150" --oversubscribed_resources_interval="15secs"
--perf_duration="10secs" --perf_interval="1mins" --port="5051" --qos_correction_interval_min="0ns"
--quiet="false" --recover="reconnect" --recovery_timeout="15mins" --registration_backoff_factor="10ms"
--resources="cpus:2;gpus:0;mem:1024;disk:1024;ports:[31000-32000]" --revocable_cpu_low_priority="true"
--runtime_dir="/tmp/Endpoint_SlaveEndpointTest_UnauthorizedRequest_1_PLyPXC" --sandbox_directory="/mnt/mesos/sandbox"
--strict="true" --switch_user="true" --systemd_enable_support="true" --systemd_runtime_directory="/run/systemd/system"
--version="false" --work_dir="/tmp/Endpoint_SlaveEndpointTest_UnauthorizedRequest_1_K4gzXX"
--zk_session_timeout="10secs"
I1013 00:34:28.466996 18701 credentials.hpp:86] Loading credential for authentication from
'/tmp/Endpoint_SlaveEndpointTest_UnauthorizedRequest_1_PLyPXC/credential'
I1013 00:34:28.467154 18701 slave.cpp:287] Agent using credential for: test-principal
I1013 00:34:28.467177 18701 credentials.hpp:37] Loading credentials for authentication from
'/tmp/Endpoint_SlaveEndpointTest_UnauthorizedRequest_1_PLyPXC/http_credentials'
I1013 00:34:28.467453 18701 http.cpp:1045] Creating default 'basic' HTTP authenticator for
realm 'mesos-agent-executor'
I1013 00:34:28.467583 18701 http.cpp:1066] Creating default 'jwt' HTTP authenticator for realm
'mesos-agent-executor'
I1013 00:34:28.467792 18701 http.cpp:1045] Creating default 'basic' HTTP authenticator for
realm 'mesos-agent-readonly'
I1013 00:34:28.467897 18701 http.cpp:1066] Creating default 'jwt' HTTP authenticator for realm
'mesos-agent-readonly'
I1013 00:34:28.468082 18701 http.cpp:1045] Creating default 'basic' HTTP authenticator for
realm 'mesos-agent-readwrite'
I1013 00:34:28.468188 18701 http.cpp:1066] Creating default 'jwt' HTTP authenticator for realm
'mesos-agent-readwrite'
I1013 00:34:28.469625 18701 slave.cpp:585] Agent resources: [{"name":"cpus","scalar":{"value":2.0},"type":"SCALAR"},{"name":"mem","scalar":{"value":1024.0},"type":"SCALAR"},{"name":"disk","scalar":{"value":1024.0},"type":"SCALAR"},{"name":"ports","ranges":{"range":[{"begin":31000,"end":32000}]},"type":"RANGES"}]
I1013 00:34:28.469849 18701 slave.cpp:593] Agent attributes: [  ]
I1013 00:34:28.469868 18701 slave.cpp:602] Agent hostname: 4184b8220f05
I1013 00:34:28.470016 18711 status_update_manager.cpp:177] Pausing sending status updates
I1013 00:34:28.471336 18703 state.cpp:64] Recovering state from '/tmp/Endpoint_SlaveEndpointTest_UnauthorizedRequest_1_K4gzXX/meta'
I1013 00:34:28.471635 18704 status_update_manager.cpp:203] Recovering status update manager
I1013 00:34:28.471812 18721 containerizer.cpp:648] Recovering containerizer
I1013 00:34:28.473054 18705 provisioner.cpp:416] Provisioner recovery complete
I1013 00:34:28.473383 18722 slave.cpp:6310] Finished recovery
I1013 00:34:28.473809 18722 slave.cpp:6492] Querying resource estimator for oversubscribable
resources
I1013 00:34:28.474035 18710 slave.cpp:6506] Received oversubscribable resources {} from the
resource estimator
I1013 00:34:28.475915 18716 process.cpp:3929] Handling HTTP event for process 'slave(829)'
with path: '/slave(829)/monitor/statistics.json'
I1013 00:34:28.477545 18705 http.cpp:1185] HTTP GET for /slave(829)/monitor/statistics.json
from 172.17.0.2:59750
I1013 00:34:28.477612 18705 http.cpp:976] Authorizing principal 'test-principal' to GET the
'/monitor/statistics.json' endpoint
I1013 00:34:28.479810 18703 slave.cpp:869] Agent terminating
[       OK ] Endpoint/SlaveEndpointTest.UnauthorizedRequest/1 (27 ms)
[ RUN      ] Endpoint/SlaveEndpointTest.UnauthorizedRequest/2
I1013 00:34:28.490352  8533 containerizer.cpp:292] Using isolation { environment_secret, posix/cpu,
posix/mem, filesystem/posix, network/cni }
W1013 00:34:28.490833  8533 backend.cpp:76] Failed to create 'aufs' backend: AufsBackend requires
root privileges
W1013 00:34:28.490939  8533 backend.cpp:76] Failed to create 'bind' backend: BindBackend requires
root privileges
I1013 00:34:28.490970  8533 provisioner.cpp:255] Using default backend 'copy'
I1013 00:34:28.494289 18701 slave.cpp:254] Mesos agent started on (830)@172.17.0.2:46387
I1013 00:34:28.494316 18701 slave.cpp:255] Flags at startup: --acls="" --appc_simple_discovery_uri_prefix="http://"
--appc_store_dir="/tmp/Endpoint_SlaveEndpointTest_UnauthorizedRequest_2_Nm96ch/store/appc"
--authenticate_http_executors="true" --authenticate_http_readonly="true" --authenticate_http_readwrite="true"
--authenticatee="crammd5" --authentication_backoff_factor="1secs" --authorizer="local" --cgroups_cpu_enable_pids_and_tids_count="false"
--cgroups_enable_cfs="false" --cgroups_hierarchy="/sys/fs/cgroup" --cgroups_limit_swap="false"
--cgroups_root="mesos" --container_disk_watch_interval="15secs" --containerizers="mesos" --credential="/tmp/Endpoint_SlaveEndpointTest_UnauthorizedRequest_2_Nm96ch/credential"
--default_role="*" --disallow_sharing_agent_pid_namespace="false" --disk_watch_interval="1mins"
--docker="docker" --docker_kill_orphans="true" --docker_registry="https://registry-1.docker.io"
--docker_remove_delay="6hrs" --docker_socket="/var/run/docker.sock" --docker_stop_timeout="0ns"
--docker_store_dir="/tmp/Endpoint_SlaveEndpointTest_UnauthorizedRequest_2_Nm96ch/store/docker"
--docker_volume_checkpoint_dir="/var/run/mesos/isolators/docker/volume" --enforce_container_disk_quota="false"
--executor_registration_timeout="1mins" --executor_reregistration_timeout="2secs" --executor_secret_key="/tmp/Endpoint_SlaveEndpointTest_UnauthorizedRequest_2_Nm96ch/executor_secret_key"
--executor_shutdown_grace_period="5secs" --fetcher_cache_dir="/tmp/Endpoint_SlaveEndpointTest_UnauthorizedRequest_2_Nm96ch/fetch"
--fetcher_cache_size="2GB" --frameworks_home="" --gc_delay="1weeks" --gc_disk_headroom="0.1"
--hadoop_home="" --help="false" --hostname_lookup="true" --http_command_executor="false" --http_credentials="/tmp/Endpoint_SlaveEndpointTest_UnauthorizedRequest_2_Nm96ch/http_credentials"
--http_heartbeat_interval="30secs" --initialize_driver_logging="true" --isolation="posix/cpu,posix/mem"
--launcher="posix" --launcher_dir="/mesos/mesos-1.5.0/_build/src" --logbufsecs="0" --logging_level="INFO"
--max_completed_executors_per_framework="150" --oversubscribed_resources_interval="15secs"
--perf_duration="10secs" --perf_interval="1mins" --port="5051" --qos_correction_interval_min="0ns"
--quiet="false" --recover="reconnect" --recovery_timeout="15mins" --registration_backoff_factor="10ms"
--resources="cpus:2;gpus:0;mem:1024;disk:1024;ports:[31000-32000]" --revocable_cpu_low_priority="true"
--runtime_dir="/tmp/Endpoint_SlaveEndpointTest_UnauthorizedRequest_2_Nm96ch" --sandbox_directory="/mnt/mesos/sandbox"
--strict="true" --switch_user="true" --systemd_enable_support="true" --systemd_runtime_directory="/run/systemd/system"
--version="false" --work_dir="/tmp/Endpoint_SlaveEndpointTest_UnauthorizedRequest_2_YRSG8B"
--zk_session_timeout="10secs"
I1013 00:34:28.494678 18701 credentials.hpp:86] Loading credential for authentication from
'/tmp/Endpoint_SlaveEndpointTest_UnauthorizedRequest_2_Nm96ch/credential'
I1013 00:34:28.494829 18701 slave.cpp:287] Agent using credential for: test-principal
I1013 00:34:28.494850 18701 credentials.hpp:37] Loading credentials for authentication from
'/tmp/Endpoint_SlaveEndpointTest_UnauthorizedRequest_2_Nm96ch/http_credentials'
I1013 00:34:28.495124 18701 http.cpp:1045] Creating default 'basic' HTTP authenticator for
realm 'mesos-agent-executor'
I1013 00:34:28.495246 18701 http.cpp:1066] Creating default 'jwt' HTTP authenticator for realm
'mesos-agent-executor'
I1013 00:34:28.495455 18701 http.cpp:1045] Creating default 'basic' HTTP authenticator for
realm 'mesos-agent-readonly'
I1013 00:34:28.495565 18701 http.cpp:1066] Creating default 'jwt' HTTP authenticator for realm
'mesos-agent-readonly'
I1013 00:34:28.495754 18701 http.cpp:1045] Creating default 'basic' HTTP authenticator for
realm 'mesos-agent-readwrite'
I1013 00:34:28.495863 18701 http.cpp:1066] Creating default 'jwt' HTTP authenticator for realm
'mesos-agent-readwrite'
I1013 00:34:28.497251 18701 slave.cpp:585] Agent resources: [{"name":"cpus","scalar":{"value":2.0},"type":"SCALAR"},{"name":"mem","scalar":{"value":1024.0},"type":"SCALAR"},{"name":"disk","scalar":{"value":1024.0},"type":"SCALAR"},{"name":"ports","ranges":{"range":[{"begin":31000,"end":32000}]},"type":"RANGES"}]
I1013 00:34:28.497472 18701 slave.cpp:593] Agent attributes: [  ]
I1013 00:34:28.497485 18701 slave.cpp:602] Agent hostname: 4184b8220f05
I1013 00:34:28.497627 18718 status_update_manager.cpp:177] Pausing sending status updates
I1013 00:34:28.498929 18715 state.cpp:64] Recovering state from '/tmp/Endpoint_SlaveEndpointTest_UnauthorizedRequest_2_YRSG8B/meta'
I1013 00:34:28.499204 18705 status_update_manager.cpp:203] Recovering status update manager
I1013 00:34:28.499390 18711 containerizer.cpp:648] Recovering containerizer
I1013 00:34:28.500597 18704 provisioner.cpp:416] Provisioner recovery complete
I1013 00:34:28.500915 18710 slave.cpp:6310] Finished recovery
I1013 00:34:28.501319 18710 slave.cpp:6492] Querying resource estimator for oversubscribable
resources
I1013 00:34:28.501551 18715 slave.cpp:6506] Received oversubscribable resources {} from the
resource estimator
I1013 00:34:28.503370 18712 process.cpp:3929] Handling HTTP event for process 'slave(830)'
with path: '/slave(830)/containers'
I1013 00:34:28.504987 18704 http.cpp:1185] HTTP GET for /slave(830)/containers from 172.17.0.2:59752
I1013 00:34:28.505056 18704 http.cpp:976] Authorizing principal 'test-principal' to GET the
'/containers' endpoint
I1013 00:34:28.506824 18720 slave.cpp:869] Agent terminating
[       OK ] Endpoint/SlaveEndpointTest.UnauthorizedRequest/2 (26 ms)
[ RUN      ] Endpoint/SlaveEndpointTest.NoAuthorizer/0
I1013 00:34:28.519966  8533 containerizer.cpp:292] Using isolation { environment_secret, posix/cpu,
posix/mem, filesystem/posix, network/cni }
W1013 00:34:28.520751  8533 backend.cpp:76] Failed to create 'aufs' backend: AufsBackend requires
root privileges
W1013 00:34:28.520925  8533 backend.cpp:76] Failed to create 'bind' backend: BindBackend requires
root privileges
I1013 00:34:28.520982  8533 provisioner.cpp:255] Using default backend 'copy'
I1013 00:34:28.523596  8533 cluster.cpp:448] Creating default 'local' authorizer
I1013 00:34:28.525840 18706 slave.cpp:254] Mesos agent started on (831)@172.17.0.2:46387
I1013 00:34:28.525868 18706 slave.cpp:255] Flags at startup: --acls="" --appc_simple_discovery_uri_prefix="http://"
--appc_store_dir="/tmp/Endpoint_SlaveEndpointTest_NoAuthorizer_0_HdTDIV/store/appc" --authenticate_http_executors="true"
--authenticate_http_readonly="true" --authenticate_http_readwrite="true" --authenticatee="crammd5"
--authentication_backoff_factor="1secs" --authorizer="local" --cgroups_cpu_enable_pids_and_tids_count="false"
--cgroups_enable_cfs="false" --cgroups_hierarchy="/sys/fs/cgroup" --cgroups_limit_swap="false"
--cgroups_root="mesos" --container_disk_watch_interval="15secs" --containerizers="mesos" --credential="/tmp/Endpoint_SlaveEndpointTest_NoAuthorizer_0_HdTDIV/credential"
--default_role="*" --disallow_sharing_agent_pid_namespace="false" --disk_watch_interval="1mins"
--docker="docker" --docker_kill_orphans="true" --docker_registry="https://registry-1.docker.io"
--docker_remove_delay="6hrs" --docker_socket="/var/run/docker.sock" --docker_stop_timeout="0ns"
--docker_store_dir="/tmp/Endpoint_SlaveEndpointTest_NoAuthorizer_0_HdTDIV/store/docker" --docker_volume_checkpoint_dir="/var/run/mesos/isolators/docker/volume"
--enforce_container_disk_quota="false" --executor_registration_timeout="1mins" --executor_reregistration_timeout="2secs"
--executor_secret_key="/tmp/Endpoint_SlaveEndpointTest_NoAuthorizer_0_HdTDIV/executor_secret_key"
--executor_shutdown_grace_period="5secs" --fetcher_cache_dir="/tmp/Endpoint_SlaveEndpointTest_NoAuthorizer_0_HdTDIV/fetch"
--fetcher_cache_size="2GB" --frameworks_home="" --gc_delay="1weeks" --gc_disk_headroom="0.1"
--hadoop_home="" --help="false" --hostname_lookup="true" --http_command_executor="false" --http_credentials="/tmp/Endpoint_SlaveEndpointTest_NoAuthorizer_0_HdTDIV/http_credentials"
--http_heartbeat_interval="30secs" --initialize_driver_logging="true" --isolation="posix/cpu,posix/mem"
--launcher="posix" --launcher_dir="/mesos/mesos-1.5.0/_build/src" --logbufsecs="0" --logging_level="INFO"
--max_completed_executors_per_framework="150" --oversubscribed_resources_interval="15secs"
--perf_duration="10secs" --perf_interval="1mins" --port="5051" --qos_correction_interval_min="0ns"
--quiet="false" --recover="reconnect" --recovery_timeout="15mins" --registration_backoff_factor="10ms"
--resources="cpus:2;gpus:0;mem:1024;disk:1024;ports:[31000-32000]" --revocable_cpu_low_priority="true"
--runtime_dir="/tmp/Endpoint_SlaveEndpointTest_NoAuthorizer_0_HdTDIV" --sandbox_directory="/mnt/mesos/sandbox"
--strict="true" --switch_user="true" --systemd_enable_support="true" --systemd_runtime_directory="/run/systemd/system"
--version="false" --work_dir="/tmp/Endpoint_SlaveEndpointTest_NoAuthorizer_0_Xwa8zg" --zk_session_timeout="10secs"
I1013 00:34:28.526253 18706 credentials.hpp:86] Loading credential for authentication from
'/tmp/Endpoint_SlaveEndpointTest_NoAuthorizer_0_HdTDIV/credential'
I1013 00:34:28.526407 18706 slave.cpp:287] Agent using credential for: test-principal
I1013 00:34:28.526428 18706 credentials.hpp:37] Loading credentials for authentication from
'/tmp/Endpoint_SlaveEndpointTest_NoAuthorizer_0_HdTDIV/http_credentials'
I1013 00:34:28.526707 18706 http.cpp:1045] Creating default 'basic' HTTP authenticator for
realm 'mesos-agent-executor'
I1013 00:34:28.526831 18706 http.cpp:1066] Creating default 'jwt' HTTP authenticator for realm
'mesos-agent-executor'
I1013 00:34:28.527040 18706 http.cpp:1045] Creating default 'basic' HTTP authenticator for
realm 'mesos-agent-readonly'
I1013 00:34:28.527139 18706 http.cpp:1066] Creating default 'jwt' HTTP authenticator for realm
'mesos-agent-readonly'
I1013 00:34:28.527336 18706 http.cpp:1045] Creating default 'basic' HTTP authenticator for
realm 'mesos-agent-readwrite'
I1013 00:34:28.527436 18706 http.cpp:1066] Creating default 'jwt' HTTP authenticator for realm
'mesos-agent-readwrite'
I1013 00:34:28.528858 18706 slave.cpp:585] Agent resources: [{"name":"cpus","scalar":{"value":2.0},"type":"SCALAR"},{"name":"mem","scalar":{"value":1024.0},"type":"SCALAR"},{"name":"disk","scalar":{"value":1024.0},"type":"SCALAR"},{"name":"ports","ranges":{"range":[{"begin":31000,"end":32000}]},"type":"RANGES"}]
I1013 00:34:28.529084 18706 slave.cpp:593] Agent attributes: [  ]
I1013 00:34:28.529098 18706 slave.cpp:602] Agent hostname: 4184b8220f05
I1013 00:34:28.529249 18707 status_update_manager.cpp:177] Pausing sending status updates
I1013 00:34:28.530588 18718 state.cpp:64] Recovering state from '/tmp/Endpoint_SlaveEndpointTest_NoAuthorizer_0_Xwa8zg/meta'
I1013 00:34:28.530905 18721 status_update_manager.cpp:203] Recovering status update manager
I1013 00:34:28.531136 18708 containerizer.cpp:648] Recovering containerizer
I1013 00:34:28.532534 18703 provisioner.cpp:416] Provisioner recovery complete
I1013 00:34:28.532866 18707 slave.cpp:6310] Finished recovery
I1013 00:34:28.533315 18707 slave.cpp:6492] Querying resource estimator for oversubscribable
resources
I1013 00:34:28.533550 18711 slave.cpp:6506] Received oversubscribable resources {} from the
resource estimator
I1013 00:34:28.535718 18722 process.cpp:3929] Handling HTTP event for process 'slave(831)'
with path: '/slave(831)/monitor/statistics'
I1013 00:34:28.537569 18703 http.cpp:1185] HTTP GET for /slave(831)/monitor/statistics from
172.17.0.2:59754
I1013 00:34:28.537642 18703 http.cpp:976] Authorizing principal 'test-principal' to GET the
'/monitor/statistics' endpoint
I1013 00:34:28.540652 18718 slave.cpp:869] Agent terminating
[       OK ] Endpoint/SlaveEndpointTest.NoAuthorizer/0 (34 ms)
[ RUN      ] Endpoint/SlaveEndpointTest.NoAuthorizer/1
I1013 00:34:28.551861  8533 containerizer.cpp:292] Using isolation { environment_secret, posix/cpu,
posix/mem, filesystem/posix, network/cni }
W1013 00:34:28.552351  8533 backend.cpp:76] Failed to create 'aufs' backend: AufsBackend requires
root privileges
W1013 00:34:28.552462  8533 backend.cpp:76] Failed to create 'bind' backend: BindBackend requires
root privileges
I1013 00:34:28.552494  8533 provisioner.cpp:255] Using default backend 'copy'
I1013 00:34:28.554129  8533 cluster.cpp:448] Creating default 'local' authorizer
I1013 00:34:28.556026 18720 slave.cpp:254] Mesos agent started on (832)@172.17.0.2:46387
I1013 00:34:28.556053 18720 slave.cpp:255] Flags at startup: --acls="" --appc_simple_discovery_uri_prefix="http://"
--appc_store_dir="/tmp/Endpoint_SlaveEndpointTest_NoAuthorizer_1_xVV5xA/store/appc" --authenticate_http_executors="true"
--authenticate_http_readonly="true" --authenticate_http_readwrite="true" --authenticatee="crammd5"
--authentication_backoff_factor="1secs" --authorizer="local" --cgroups_cpu_enable_pids_and_tids_count="false"
--cgroups_enable_cfs="false" --cgroups_hierarchy="/sys/fs/cgroup" --cgroups_limit_swap="false"
--cgroups_root="mesos" --container_disk_watch_interval="15secs" --containerizers="mesos" --credential="/tmp/Endpoint_SlaveEndpointTest_NoAuthorizer_1_xVV5xA/credential"
--default_role="*" --disallow_sharing_agent_pid_namespace="false" --disk_watch_interval="1mins"
--docker="docker" --docker_kill_orphans="true" --docker_registry="https://registry-1.docker.io"
--docker_remove_delay="6hrs" --docker_socket="/var/run/docker.sock" --docker_stop_timeout="0ns"
--docker_store_dir="/tmp/Endpoint_SlaveEndpointTest_NoAuthorizer_1_xVV5xA/store/docker" --docker_volume_checkpoint_dir="/var/run/mesos/isolators/docker/volume"
--enforce_container_disk_quota="false" --executor_registration_timeout="1mins" --executor_reregistration_timeout="2secs"
--executor_secret_key="/tmp/Endpoint_SlaveEndpointTest_NoAuthorizer_1_xVV5xA/executor_secret_key"
--executor_shutdown_grace_period="5secs" --fetcher_cache_dir="/tmp/Endpoint_SlaveEndpointTest_NoAuthorizer_1_xVV5xA/fetch"
--fetcher_cache_size="2GB" --frameworks_home="" --gc_delay="1weeks" --gc_disk_headroom="0.1"
--hadoop_home="" --help="false" --hostname_lookup="true" --http_command_executor="false" --http_credentials="/tmp/Endpoint_SlaveEndpointTest_NoAuthorizer_1_xVV5xA/http_credentials"
--http_heartbeat_interval="30secs" --initialize_driver_logging="true" --isolation="posix/cpu,posix/mem"
--launcher="posix" --launcher_dir="/mesos/mesos-1.5.0/_build/src" --logbufsecs="0" --logging_level="INFO"
--max_completed_executors_per_framework="150" --oversubscribed_resources_interval="15secs"
--perf_duration="10secs" --perf_interval="1mins" --port="5051" --qos_correction_interval_min="0ns"
--quiet="false" --recover="reconnect" --recovery_timeout="15mins" --registration_backoff_factor="10ms"
--resources="cpus:2;gpus:0;mem:1024;disk:1024;ports:[31000-32000]" --revocable_cpu_low_priority="true"
--runtime_dir="/tmp/Endpoint_SlaveEndpointTest_NoAuthorizer_1_xVV5xA" --sandbox_directory="/mnt/mesos/sandbox"
--strict="true" --switch_user="true" --systemd_enable_support="true" --systemd_runtime_directory="/run/systemd/system"
--version="false" --work_dir="/tmp/Endpoint_SlaveEndpointTest_NoAuthorizer_1_ygrzkV" --zk_session_timeout="10secs"
I1013 00:34:28.556438 18720 credentials.hpp:86] Loading credential for authentication from
'/tmp/Endpoint_SlaveEndpointTest_NoAuthorizer_1_xVV5xA/credential'
I1013 00:34:28.556582 18720 slave.cpp:287] Agent using credential for: test-principal
I1013 00:34:28.556605 18720 credentials.hpp:37] Loading credentials for authentication from
'/tmp/Endpoint_SlaveEndpointTest_NoAuthorizer_1_xVV5xA/http_credentials'
I1013 00:34:28.556866 18720 http.cpp:1045] Creating default 'basic' HTTP authenticator for
realm 'mesos-agent-executor'
I1013 00:34:28.556988 18720 http.cpp:1066] Creating default 'jwt' HTTP authenticator for realm
'mesos-agent-executor'
I1013 00:34:28.557196 18720 http.cpp:1045] Creating default 'basic' HTTP authenticator for
realm 'mesos-agent-readonly'
I1013 00:34:28.557299 18720 http.cpp:1066] Creating default 'jwt' HTTP authenticator for realm
'mesos-agent-readonly'
I1013 00:34:28.557492 18720 http.cpp:1045] Creating default 'basic' HTTP authenticator for
realm 'mesos-agent-readwrite'
I1013 00:34:28.557593 18720 http.cpp:1066] Creating default 'jwt' HTTP authenticator for realm
'mesos-agent-readwrite'
I1013 00:34:28.558979 18720 slave.cpp:585] Agent resources: [{"name":"cpus","scalar":{"value":2.0},"type":"SCALAR"},{"name":"mem","scalar":{"value":1024.0},"type":"SCALAR"},{"name":"disk","scalar":{"value":1024.0},"type":"SCALAR"},{"name":"ports","ranges":{"range":[{"begin":31000,"end":32000}]},"type":"RANGES"}]
I1013 00:34:28.559203 18720 slave.cpp:593] Agent attributes: [  ]
I1013 00:34:28.559216 18720 slave.cpp:602] Agent hostname: 4184b8220f05
I1013 00:34:28.559337 18714 status_update_manager.cpp:177] Pausing sending status updates
I1013 00:34:28.560655 18707 state.cpp:64] Recovering state from '/tmp/Endpoint_SlaveEndpointTest_NoAuthorizer_1_ygrzkV/meta'
I1013 00:34:28.560902 18711 status_update_manager.cpp:203] Recovering status update manager
I1013 00:34:28.561056 18708 containerizer.cpp:648] Recovering containerizer
I1013 00:34:28.562291 18709 provisioner.cpp:416] Provisioner recovery complete
I1013 00:34:28.562595 18714 slave.cpp:6310] Finished recovery
I1013 00:34:28.562994 18714 slave.cpp:6492] Querying resource estimator for oversubscribable
resources
I1013 00:34:28.563220 18718 slave.cpp:6506] Received oversubscribable resources {} from the
resource estimator
I1013 00:34:28.564962 18710 process.cpp:3929] Handling HTTP event for process 'slave(832)'
with path: '/slave(832)/monitor/statistics.json'
I1013 00:34:28.566606 18709 http.cpp:1185] HTTP GET for /slave(832)/monitor/statistics.json
from 172.17.0.2:59756
I1013 00:34:28.566676 18709 http.cpp:976] Authorizing principal 'test-principal' to GET the
'/monitor/statistics.json' endpoint
I1013 00:34:28.569258 18722 slave.cpp:869] Agent terminating
[       OK ] Endpoint/SlaveEndpointTest.NoAuthorizer/1 (29 ms)
[ RUN      ] Endpoint/SlaveEndpointTest.NoAuthorizer/2
I1013 00:34:28.580771  8533 containerizer.cpp:292] Using isolation { environment_secret, posix/cpu,
posix/mem, filesystem/posix, network/cni }
W1013 00:34:28.581284  8533 backend.cpp:76] Failed to create 'aufs' backend: AufsBackend requires
root privileges
W1013 00:34:28.581393  8533 backend.cpp:76] Failed to create 'bind' backend: BindBackend requires
root privileges
I1013 00:34:28.581423  8533 provisioner.cpp:255] Using default backend 'copy'
I1013 00:34:28.583014  8533 cluster.cpp:448] Creating default 'local' authorizer
I1013 00:34:28.584854 18700 slave.cpp:254] Mesos agent started on (833)@172.17.0.2:46387
I1013 00:34:28.584879 18700 slave.cpp:255] Flags at startup: --acls="" --appc_simple_discovery_uri_prefix="http://"
--appc_store_dir="/tmp/Endpoint_SlaveEndpointTest_NoAuthorizer_2_9gpVEf/store/appc" --authenticate_http_executors="true"
--authenticate_http_readonly="true" --authenticate_http_readwrite="true" --authenticatee="crammd5"
--authentication_backoff_factor="1secs" --authorizer="local" --cgroups_cpu_enable_pids_and_tids_count="false"
--cgroups_enable_cfs="false" --cgroups_hierarchy="/sys/fs/cgroup" --cgroups_limit_swap="false"
--cgroups_root="mesos" --container_disk_watch_interval="15secs" --containerizers="mesos" --credential="/tmp/Endpoint_SlaveEndpointTest_NoAuthorizer_2_9gpVEf/credential"
--default_role="*" --disallow_sharing_agent_pid_namespace="false" --disk_watch_interval="1mins"
--docker="docker" --docker_kill_orphans="true" --docker_registry="https://registry-1.docker.io"
--docker_remove_delay="6hrs" --docker_socket="/var/run/docker.sock" --docker_stop_timeout="0ns"
--docker_store_dir="/tmp/Endpoint_SlaveEndpointTest_NoAuthorizer_2_9gpVEf/store/docker" --docker_volume_checkpoint_dir="/var/run/mesos/isolators/docker/volume"
--enforce_container_disk_quota="false" --executor_registration_timeout="1mins" --executor_reregistration_timeout="2secs"
--executor_secret_key="/tmp/Endpoint_SlaveEndpointTest_NoAuthorizer_2_9gpVEf/executor_secret_key"
--executor_shutdown_grace_period="5secs" --fetcher_cache_dir="/tmp/Endpoint_SlaveEndpointTest_NoAuthorizer_2_9gpVEf/fetch"
--fetcher_cache_size="2GB" --frameworks_home="" --gc_delay="1weeks" --gc_disk_headroom="0.1"
--hadoop_home="" --help="false" --hostname_lookup="true" --http_command_executor="false" --http_credentials="/tmp/Endpoint_SlaveEndpointTest_NoAuthorizer_2_9gpVEf/http_credentials"
--http_heartbeat_interval="30secs" --initialize_driver_logging="true" --isolation="posix/cpu,posix/mem"
--launcher="posix" --launcher_dir="/mesos/mesos-1.5.0/_build/src" --logbufsecs="0" --logging_level="INFO"
--max_completed_executors_per_framework="150" --oversubscribed_resources_interval="15secs"
--perf_duration="10secs" --perf_interval="1mins" --port="5051" --qos_correction_interval_min="0ns"
--quiet="false" --recover="reconnect" --recovery_timeout="15mins" --registration_backoff_factor="10ms"
--resources="cpus:2;gpus:0;mem:1024;disk:1024;ports:[31000-32000]" --revocable_cpu_low_priority="true"
--runtime_dir="/tmp/Endpoint_SlaveEndpointTest_NoAuthorizer_2_9gpVEf" --sandbox_directory="/mnt/mesos/sandbox"
--strict="true" --switch_user="true" --systemd_enable_support="true" --systemd_runtime_directory="/run/systemd/system"
--version="false" --work_dir="/tmp/Endpoint_SlaveEndpointTest_NoAuthorizer_2_Ced5mA" --zk_session_timeout="10secs"
I1013 00:34:28.585270 18700 credentials.hpp:86] Loading credential for authentication from
'/tmp/Endpoint_SlaveEndpointTest_NoAuthorizer_2_9gpVEf/credential'
I1013 00:34:28.585419 18700 slave.cpp:287] Agent using credential for: test-principal
I1013 00:34:28.585441 18700 credentials.hpp:37] Loading credentials for authentication from
'/tmp/Endpoint_SlaveEndpointTest_NoAuthorizer_2_9gpVEf/http_credentials'
I1013 00:34:28.585702 18700 http.cpp:1045] Creating default 'basic' HTTP authenticator for
realm 'mesos-agent-executor'
I1013 00:34:28.585821 18700 http.cpp:1066] Creating default 'jwt' HTTP authenticator for realm
'mesos-agent-executor'
I1013 00:34:28.586015 18700 http.cpp:1045] Creating default 'basic' HTTP authenticator for
realm 'mesos-agent-readonly'
I1013 00:34:28.586115 18700 http.cpp:1066] Creating default 'jwt' HTTP authenticator for realm
'mesos-agent-readonly'
I1013 00:34:28.586294 18700 http.cpp:1045] Creating default 'basic' HTTP authenticator for
realm 'mesos-agent-readwrite'
I1013 00:34:28.586392 18700 http.cpp:1066] Creating default 'jwt' HTTP authenticator for realm
'mesos-agent-readwrite'
I1013 00:34:28.587756 18700 slave.cpp:585] Agent resources: [{"name":"cpus","scalar":{"value":2.0},"type":"SCALAR"},{"name":"mem","scalar":{"value":1024.0},"type":"SCALAR"},{"name":"disk","scalar":{"value":1024.0},"type":"SCALAR"},{"name":"ports","ranges":{"range":[{"begin":31000,"end":32000}]},"type":"RANGES"}]
I1013 00:34:28.587978 18700 slave.cpp:593] Agent attributes: [  ]
I1013 00:34:28.587992 18700 slave.cpp:602] Agent hostname: 4184b8220f05
I1013 00:34:28.588104 18699 status_update_manager.cpp:177] Pausing sending status updates
I1013 00:34:28.589450 18713 state.cpp:64] Recovering state from '/tmp/Endpoint_SlaveEndpointTest_NoAuthorizer_2_Ced5mA/meta'
I1013 00:34:28.589687 18713 status_update_manager.cpp:203] Recovering status update manager
I1013 00:34:28.589869 18720 containerizer.cpp:648] Recovering containerizer
I1013 00:34:28.591007 18708 provisioner.cpp:416] Provisioner recovery complete
I1013 00:34:28.591332 18701 slave.cpp:6310] Finished recovery
I1013 00:34:28.591738 18701 slave.cpp:6492] Querying resource estimator for oversubscribable
resources
I1013 00:34:28.591964 18717 slave.cpp:6506] Received oversubscribable resources {} from the
resource estimator
I1013 00:34:28.593647 18706 process.cpp:3929] Handling HTTP event for process 'slave(833)'
with path: '/slave(833)/containers'
I1013 00:34:28.595165 18708 http.cpp:1185] HTTP GET for /slave(833)/containers from 172.17.0.2:59758
I1013 00:34:28.595224 18708 http.cpp:976] Authorizing principal 'test-principal' to GET the
'/containers' endpoint
I1013 00:34:28.598634 18720 slave.cpp:869] Agent terminating
[       OK ] Endpoint/SlaveEndpointTest.NoAuthorizer/2 (28 ms)
[----------] 9 tests from Endpoint/SlaveEndpointTest (264 ms total)

[----------] 2 tests from ContainerizerType/DefaultContainerDNSFlagTest
[ RUN      ] ContainerizerType/DefaultContainerDNSFlagTest.ValidateFlag/0
[       OK ] ContainerizerType/DefaultContainerDNSFlagTest.ValidateFlag/0 (10 ms)
[ RUN      ] ContainerizerType/DefaultContainerDNSFlagTest.ValidateFlag/1
[       OK ] ContainerizerType/DefaultContainerDNSFlagTest.ValidateFlag/1 (10 ms)
[----------] 2 tests from ContainerizerType/DefaultContainerDNSFlagTest (20 ms total)

[----------] Global test environment tear-down
[==========] 1703 tests from 187 test cases ran. (606407 ms total)
[  PASSED  ] 1702 tests.
[  FAILED  ] 1 test, listed below:
[  FAILED  ] MasterTest.IgnoreOldAgentReregistration

 1 FAILED TEST
  YOU HAVE 21 DISABLED TESTS

I1013 00:34:28.688942 18723 process.cpp:1068] Failed to accept socket: future discarded
make[4]: *** [check-local] Error 1
make[4]: Leaving directory `/mesos/mesos-1.5.0/_build/src'
make[3]: *** [check-am] Error 2
make[3]: Leaving directory `/mesos/mesos-1.5.0/_build/src'
make[2]: *** [check] Error 2
make[2]: Leaving directory `/mesos/mesos-1.5.0/_build/src'
make[1]: *** [check-recursive] Error 1
make[1]: Leaving directory `/mesos/mesos-1.5.0/_build'
make: *** [distcheck] Error 1
+ docker rmi mesos-1507851201-9620
Untagged: mesos-1507851201-9620:latest
Deleted: sha256:9999fa9fc38e8cefeab7f5dd5d2b1062f8f49954006b88e9bc03a9c40c717942
Deleted: sha256:b5742d1d327152b1cc261a2e3fa0133a3a51aeba6fef26d98bb52eca4355e6a4
Deleted: sha256:9c945f19cd2f7494fd880ca3e67546d8cdfe0f86b334ce8131220828729af275
Deleted: sha256:cdf4bd95d2e1ed7feeb4b7fa063fa3a649614d5c71e2aa052f57032bd5a5cb66
Deleted: sha256:dc1b2c7f1563e0bd3eb2ae09a02635de3fe91c9ab43f22a16ea89af074f01cb6
Deleted: sha256:e6e5618510f32e41c35e62285c07fbac3bd9c9eda9a816cdd74f4a8586e60021
Deleted: sha256:49bbd42f8591bf9d436a3e54e38ab6a30f43093c2e5288af8ed285ad490327b3
Deleted: sha256:fb6de623b5f141f4fb40917f1fd3266ad5744a0d7e71a3ca8961eb46acfa7558
Deleted: sha256:5feba18f37c608b7c9a04f59e10f924941314d4c26f6eacabaf13b9ebc29eecf
Deleted: sha256:16d4978c6584d279bb1cdc46a00d5c0295611980fb400ca3a71e4406e6616d64
Deleted: sha256:28932a21ae851be544777edb15ca16b91824bdc43de518b8730343487f4940bb
Deleted: sha256:75004331c234a51e58671fff86240041749350ac6214c0efacb08b0b76bf295e
Deleted: sha256:11e8bd0b2853dabc11a868b3b98722120dc371f7b68f831b6f0783c85f1868b6
Deleted: sha256:93e254a71fd6ae8e1f1320546e3afc43dc42fc27f038bd32cccb542eb36afc24
Deleted: sha256:4051868fc13924f6bcf9c6148eefa00214b58bd81751bca12749c1880d236c31
Deleted: sha256:0b5ea3578cb557d3fabdf58186f9939adb885188b3a7fb84570758281aec1b98
Deleted: sha256:e593633990f3c97890ab196f1c8c9ab196671ffa656adc6d035fd86c8af382a0
Deleted: sha256:e66762dc2e40908856a28faf74a75459a916deab3156ce07a7ef82a272327617
Deleted: sha256:9d1cfe8754833664a58119a6ef17ed801b6f5ba510195d70dd5bf51da6a3b254
Deleted: sha256:ab3f3162a9c48b4352d6930f47376034289332cc451c2f401f444c08e750149e
Deleted: sha256:360343843e6c0ea8080ad1507cb73ae85b6215f00061f66ef3e76bf61b42a2fe
Deleted: sha256:3d202ba68686c847d74cb12ed9ce2f7ad066e2cfa0d3f364e913980ede4d7990
Deleted: sha256:aae167a76c6d0557d6337811a09d4868e02fe29e8650b878f2937e20d51d7fd1
Deleted: sha256:0cb921537e76f0cd84360cd3f283bf5903e7e4e9cc8c7396d110f2c31fb8012a
Deleted: sha256:b18ed05c21decb93dd004f5e8e24ab48cf97f6c52fcdd717ed50838f9ba1cb98
Deleted: sha256:9c997a27e7659c0dd333bcc01fb5da968f02933045de3a612c748ce0724a72ab
Deleted: sha256:6b9a5e9f2d2777727bfb98e0d9bc38a7a0935910cfeff85d872854d2ac2c5bdc
Deleted: sha256:0cf00668de51159234a9b9157a29ef1efebbf25767666a3640067015b77e1df4
Build step 'Execute shell' marked build as failure
Not sending mail to unregistered user xujyan@apple.com
Not sending mail to unregistered user yujie.jay@gmail.com
Not sending mail to unregistered user songzihao1990@gmail.com


Mime
View raw message