mesos-builds mailing list archives

Site index · List index
Message view « Date » · « Thread »
Top « Date » · « Thread »
From Apache Jenkins Server <jenk...@builds.apache.org>
Subject Build failed in Jenkins: Mesos-Buildbot » autotools,gcc,--verbose --disable-libtool-wrappers,GLOG_v=1 MESOS_VERBOSE=1,ubuntu:14.04,(ubuntu)&&(!ubuntu-us1)&&(!ubuntu-eu2)&&(!qnode3)&&(!H23) #4330
Date Tue, 17 Oct 2017 02:44:43 GMT
See <https://builds.apache.org/job/Mesos-Buildbot/BUILDTOOL=autotools,COMPILER=gcc,CONFIGURATION=--verbose%20--disable-libtool-wrappers,ENVIRONMENT=GLOG_v=1%20MESOS_VERBOSE=1,OS=ubuntu%3A14.04,label_exp=(ubuntu)&&(!ubuntu-us1)&&(!ubuntu-eu2)&&(!qnode3)&&(!H23)/4330/display/redirect?page=changes>

Changes:

[alexr] Logged when allocator cannot apply offer operation.

[alexr] Augmented AwaitAssertResponseStatusEq with response body.

[alexr] Removed no longer necessary response body output in tests.

[alexr] Libprocess: Fixed formatting of `AWAIT_EXPECT_RESPONSE_STATUS_EQ`.

[alexr] Fixed formatting of `AWAIT_EXPECT_RESPONSE_STATUS_EQ`.

[alexr] Replaced unnecessary future chaining in api_tests.cpp.

[alexr] Avoided periodic allocations in reservation endpoint tests.

[alexr] Cleaned up reservation endpoint tests.

[alexr] Avoided periodic allocations in persistent volume endpoint tests.

[alexr] Fixed a race when the first agent retries to register.

[alexr] Avoided periodic allocations in api tests.

[alexr] Avoided periodic allocations in EventAuthorizationFiltering test.

[alexr] Avoided periodic allocations in reservation refinement tests.

[alexr] Cleaned up test ordering in "master_tests.cpp".

[alexr] Fixed flakiness in 'ResourceProviderRegistrarTest.AgentRegistrar'.

------------------------------------------
[...truncated 32.02 MB...]
I1017 02:44:33.491442  5514 credentials.hpp:37] Loading credentials for authentication from
'/tmp/Endpoint_SlaveEndpointTest_AuthorizedRequest_2_nwTSKu/http_credentials'
I1017 02:44:33.491729  5514 http.cpp:1045] Creating default 'basic' HTTP authenticator for
realm 'mesos-agent-readonly'
I1017 02:44:33.491911  5514 http.cpp:1045] Creating default 'basic' HTTP authenticator for
realm 'mesos-agent-readwrite'
I1017 02:44:33.493636  5514 slave.cpp:585] Agent resources: [{"name":"cpus","scalar":{"value":2.0},"type":"SCALAR"},{"name":"mem","scalar":{"value":1024.0},"type":"SCALAR"},{"name":"disk","scalar":{"value":1024.0},"type":"SCALAR"},{"name":"ports","ranges":{"range":[{"begin":31000,"end":32000}]},"type":"RANGES"}]
I1017 02:44:33.493923  5514 slave.cpp:593] Agent attributes: [  ]
I1017 02:44:33.493940  5514 slave.cpp:602] Agent hostname: 80a49ca94a21
I1017 02:44:33.494122  5513 status_update_manager.cpp:177] Pausing sending status updates
I1017 02:44:33.495709  5504 state.cpp:64] Recovering state from '/tmp/Endpoint_SlaveEndpointTest_AuthorizedRequest_2_uH1bsY/meta'
I1017 02:44:33.496076  5504 status_update_manager.cpp:203] Recovering status update manager
I1017 02:44:33.496351  5504 containerizer.cpp:649] Recovering containerizer
I1017 02:44:33.497974  5510 provisioner.cpp:416] Provisioner recovery complete
I1017 02:44:33.498463  5511 slave.cpp:6310] Finished recovery
I1017 02:44:33.498996  5511 slave.cpp:6492] Querying resource estimator for oversubscribable
resources
I1017 02:44:33.499267  5512 slave.cpp:6506] Received oversubscribable resources {} from the
resource estimator
I1017 02:44:33.501785  5514 process.cpp:3929] Handling HTTP event for process 'slave(822)'
with path: '/slave(822)/containers'
I1017 02:44:33.503293  5517 http.cpp:1185] HTTP GET for /slave(822)/containers from 172.17.0.3:38461
I1017 02:44:33.503377  5517 http.cpp:976] Authorizing principal 'test-principal' to GET the
'/containers' endpoint
I1017 02:44:33.507969  5512 slave.cpp:869] Agent terminating
[       OK ] Endpoint/SlaveEndpointTest.AuthorizedRequest/2 (35 ms)
[ RUN      ] Endpoint/SlaveEndpointTest.UnauthorizedRequest/0
I1017 02:44:33.520779  5501 containerizer.cpp:292] Using isolation { environment_secret, posix/cpu,
posix/mem, filesystem/posix, network/cni }
W1017 02:44:33.521329  5501 backend.cpp:76] Failed to create 'aufs' backend: AufsBackend requires
root privileges
W1017 02:44:33.521442  5501 backend.cpp:76] Failed to create 'bind' backend: BindBackend requires
root privileges
I1017 02:44:33.521492  5501 provisioner.cpp:255] Using default backend 'copy'
I1017 02:44:33.525074  5505 slave.cpp:254] Mesos agent started on (823)@172.17.0.3:35744
I1017 02:44:33.525104  5505 slave.cpp:255] Flags at startup: --acls="" --appc_simple_discovery_uri_prefix="http://"
--appc_store_dir="/tmp/Endpoint_SlaveEndpointTest_UnauthorizedRequest_0_bOaAgA/store/appc"
--authenticate_http_readonly="true" --authenticate_http_readwrite="true" --authenticatee="crammd5"
--authentication_backoff_factor="1secs" --authorizer="local" --cgroups_cpu_enable_pids_and_tids_count="false"
--cgroups_enable_cfs="false" --cgroups_hierarchy="/sys/fs/cgroup" --cgroups_limit_swap="false"
--cgroups_root="mesos" --container_disk_watch_interval="15secs" --containerizers="mesos" --credential="/tmp/Endpoint_SlaveEndpointTest_UnauthorizedRequest_0_bOaAgA/credential"
--default_role="*" --disallow_sharing_agent_pid_namespace="false" --disk_watch_interval="1mins"
--docker="docker" --docker_kill_orphans="true" --docker_registry="https://registry-1.docker.io"
--docker_remove_delay="6hrs" --docker_socket="/var/run/docker.sock" --docker_stop_timeout="0ns"
--docker_store_dir="/tmp/Endpoint_SlaveEndpointTest_UnauthorizedRequest_0_bOaAgA/store/docker"
--docker_volume_checkpoint_dir="/var/run/mesos/isolators/docker/volume" --enforce_container_disk_quota="false"
--executor_registration_timeout="1mins" --executor_reregistration_timeout="2secs" --executor_shutdown_grace_period="5secs"
--fetcher_cache_dir="/tmp/Endpoint_SlaveEndpointTest_UnauthorizedRequest_0_bOaAgA/fetch" --fetcher_cache_size="2GB"
--frameworks_home="" --gc_delay="1weeks" --gc_disk_headroom="0.1" --hadoop_home="" --help="false"
--hostname_lookup="true" --http_command_executor="false" --http_credentials="/tmp/Endpoint_SlaveEndpointTest_UnauthorizedRequest_0_bOaAgA/http_credentials"
--http_heartbeat_interval="30secs" --initialize_driver_logging="true" --isolation="posix/cpu,posix/mem"
--launcher="posix" --launcher_dir="/mesos/mesos-1.5.0/_build/src" --logbufsecs="0" --logging_level="INFO"
--max_completed_executors_per_framework="150" --oversubscribed_resources_interval="15secs"
--perf_duration="10secs" --perf_interval="1mins" --port="5051" --qos_correction_interval_min="0ns"
--quiet="false" --recover="reconnect" --recovery_timeout="15mins" --registration_backoff_factor="10ms"
--resources="cpus:2;gpus:0;mem:1024;disk:1024;ports:[31000-32000]" --revocable_cpu_low_priority="true"
--runtime_dir="/tmp/Endpoint_SlaveEndpointTest_UnauthorizedRequest_0_bOaAgA" --sandbox_directory="/mnt/mesos/sandbox"
--strict="true" --switch_user="true" --systemd_enable_support="true" --systemd_runtime_directory="/run/systemd/system"
--version="false" --work_dir="/tmp/Endpoint_SlaveEndpointTest_UnauthorizedRequest_0_o8FhS3"
--zk_session_timeout="10secs"
I1017 02:44:33.525594  5505 credentials.hpp:86] Loading credential for authentication from
'/tmp/Endpoint_SlaveEndpointTest_UnauthorizedRequest_0_bOaAgA/credential'
I1017 02:44:33.525759  5505 slave.cpp:287] Agent using credential for: test-principal
I1017 02:44:33.525784  5505 credentials.hpp:37] Loading credentials for authentication from
'/tmp/Endpoint_SlaveEndpointTest_UnauthorizedRequest_0_bOaAgA/http_credentials'
I1017 02:44:33.526060  5505 http.cpp:1045] Creating default 'basic' HTTP authenticator for
realm 'mesos-agent-readonly'
I1017 02:44:33.526280  5505 http.cpp:1045] Creating default 'basic' HTTP authenticator for
realm 'mesos-agent-readwrite'
I1017 02:44:33.527953  5505 slave.cpp:585] Agent resources: [{"name":"cpus","scalar":{"value":2.0},"type":"SCALAR"},{"name":"mem","scalar":{"value":1024.0},"type":"SCALAR"},{"name":"disk","scalar":{"value":1024.0},"type":"SCALAR"},{"name":"ports","ranges":{"range":[{"begin":31000,"end":32000}]},"type":"RANGES"}]
I1017 02:44:33.528234  5505 slave.cpp:593] Agent attributes: [  ]
I1017 02:44:33.528251  5505 slave.cpp:602] Agent hostname: 80a49ca94a21
I1017 02:44:33.528450  5507 status_update_manager.cpp:177] Pausing sending status updates
I1017 02:44:33.529814  5504 state.cpp:64] Recovering state from '/tmp/Endpoint_SlaveEndpointTest_UnauthorizedRequest_0_o8FhS3/meta'
I1017 02:44:33.530159  5517 status_update_manager.cpp:203] Recovering status update manager
I1017 02:44:33.530427  5506 containerizer.cpp:649] Recovering containerizer
I1017 02:44:33.532115  5504 provisioner.cpp:416] Provisioner recovery complete
I1017 02:44:33.532538  5502 slave.cpp:6310] Finished recovery
I1017 02:44:33.533036  5502 slave.cpp:6492] Querying resource estimator for oversubscribable
resources
I1017 02:44:33.533313  5514 slave.cpp:6506] Received oversubscribable resources {} from the
resource estimator
I1017 02:44:33.536161  5505 process.cpp:3929] Handling HTTP event for process 'slave(823)'
with path: '/slave(823)/monitor/statistics'
I1017 02:44:33.537617  5511 http.cpp:1185] HTTP GET for /slave(823)/monitor/statistics from
172.17.0.3:38462
I1017 02:44:33.537714  5511 http.cpp:976] Authorizing principal 'test-principal' to GET the
'/monitor/statistics' endpoint
I1017 02:44:33.540663  5501 slave.cpp:869] Agent terminating
[       OK ] Endpoint/SlaveEndpointTest.UnauthorizedRequest/0 (32 ms)
[ RUN      ] Endpoint/SlaveEndpointTest.UnauthorizedRequest/1
I1017 02:44:33.554455  5501 containerizer.cpp:292] Using isolation { environment_secret, posix/cpu,
posix/mem, filesystem/posix, network/cni }
W1017 02:44:33.555089  5501 backend.cpp:76] Failed to create 'aufs' backend: AufsBackend requires
root privileges
W1017 02:44:33.555224  5501 backend.cpp:76] Failed to create 'bind' backend: BindBackend requires
root privileges
I1017 02:44:33.555272  5501 provisioner.cpp:255] Using default backend 'copy'
I1017 02:44:33.560104  5509 slave.cpp:254] Mesos agent started on (824)@172.17.0.3:35744
I1017 02:44:33.560135  5509 slave.cpp:255] Flags at startup: --acls="" --appc_simple_discovery_uri_prefix="http://"
--appc_store_dir="/tmp/Endpoint_SlaveEndpointTest_UnauthorizedRequest_1_vtsL7F/store/appc"
--authenticate_http_readonly="true" --authenticate_http_readwrite="true" --authenticatee="crammd5"
--authentication_backoff_factor="1secs" --authorizer="local" --cgroups_cpu_enable_pids_and_tids_count="false"
--cgroups_enable_cfs="false" --cgroups_hierarchy="/sys/fs/cgroup" --cgroups_limit_swap="false"
--cgroups_root="mesos" --container_disk_watch_interval="15secs" --containerizers="mesos" --credential="/tmp/Endpoint_SlaveEndpointTest_UnauthorizedRequest_1_vtsL7F/credential"
--default_role="*" --disallow_sharing_agent_pid_namespace="false" --disk_watch_interval="1mins"
--docker="docker" --docker_kill_orphans="true" --docker_registry="https://registry-1.docker.io"
--docker_remove_delay="6hrs" --docker_socket="/var/run/docker.sock" --docker_stop_timeout="0ns"
--docker_store_dir="/tmp/Endpoint_SlaveEndpointTest_UnauthorizedRequest_1_vtsL7F/store/docker"
--docker_volume_checkpoint_dir="/var/run/mesos/isolators/docker/volume" --enforce_container_disk_quota="false"
--executor_registration_timeout="1mins" --executor_reregistration_timeout="2secs" --executor_shutdown_grace_period="5secs"
--fetcher_cache_dir="/tmp/Endpoint_SlaveEndpointTest_UnauthorizedRequest_1_vtsL7F/fetch" --fetcher_cache_size="2GB"
--frameworks_home="" --gc_delay="1weeks" --gc_disk_headroom="0.1" --hadoop_home="" --help="false"
--hostname_lookup="true" --http_command_executor="false" --http_credentials="/tmp/Endpoint_SlaveEndpointTest_UnauthorizedRequest_1_vtsL7F/http_credentials"
--http_heartbeat_interval="30secs" --initialize_driver_logging="true" --isolation="posix/cpu,posix/mem"
--launcher="posix" --launcher_dir="/mesos/mesos-1.5.0/_build/src" --logbufsecs="0" --logging_level="INFO"
--max_completed_executors_per_framework="150" --oversubscribed_resources_interval="15secs"
--perf_duration="10secs" --perf_interval="1mins" --port="5051" --qos_correction_interval_min="0ns"
--quiet="false" --recover="reconnect" --recovery_timeout="15mins" --registration_backoff_factor="10ms"
--resources="cpus:2;gpus:0;mem:1024;disk:1024;ports:[31000-32000]" --revocable_cpu_low_priority="true"
--runtime_dir="/tmp/Endpoint_SlaveEndpointTest_UnauthorizedRequest_1_vtsL7F" --sandbox_directory="/mnt/mesos/sandbox"
--strict="true" --switch_user="true" --systemd_enable_support="true" --systemd_runtime_directory="/run/systemd/system"
--version="false" --work_dir="/tmp/Endpoint_SlaveEndpointTest_UnauthorizedRequest_1_W2S7D9"
--zk_session_timeout="10secs"
I1017 02:44:33.560719  5509 credentials.hpp:86] Loading credential for authentication from
'/tmp/Endpoint_SlaveEndpointTest_UnauthorizedRequest_1_vtsL7F/credential'
I1017 02:44:33.560909  5509 slave.cpp:287] Agent using credential for: test-principal
I1017 02:44:33.560943  5509 credentials.hpp:37] Loading credentials for authentication from
'/tmp/Endpoint_SlaveEndpointTest_UnauthorizedRequest_1_vtsL7F/http_credentials'
I1017 02:44:33.561307  5509 http.cpp:1045] Creating default 'basic' HTTP authenticator for
realm 'mesos-agent-readonly'
I1017 02:44:33.561513  5509 http.cpp:1045] Creating default 'basic' HTTP authenticator for
realm 'mesos-agent-readwrite'
I1017 02:44:33.563679  5509 slave.cpp:585] Agent resources: [{"name":"cpus","scalar":{"value":2.0},"type":"SCALAR"},{"name":"mem","scalar":{"value":1024.0},"type":"SCALAR"},{"name":"disk","scalar":{"value":1024.0},"type":"SCALAR"},{"name":"ports","ranges":{"range":[{"begin":31000,"end":32000}]},"type":"RANGES"}]
I1017 02:44:33.563980  5509 slave.cpp:593] Agent attributes: [  ]
I1017 02:44:33.563999  5509 slave.cpp:602] Agent hostname: 80a49ca94a21
I1017 02:44:33.564247  5505 status_update_manager.cpp:177] Pausing sending status updates
I1017 02:44:33.565841  5506 state.cpp:64] Recovering state from '/tmp/Endpoint_SlaveEndpointTest_UnauthorizedRequest_1_W2S7D9/meta'
I1017 02:44:33.566249  5504 status_update_manager.cpp:203] Recovering status update manager
I1017 02:44:33.566494  5502 containerizer.cpp:649] Recovering containerizer
I1017 02:44:33.568364  5506 provisioner.cpp:416] Provisioner recovery complete
I1017 02:44:33.568812  5504 slave.cpp:6310] Finished recovery
I1017 02:44:33.569375  5504 slave.cpp:6492] Querying resource estimator for oversubscribable
resources
I1017 02:44:33.569684  5511 slave.cpp:6506] Received oversubscribable resources {} from the
resource estimator
I1017 02:44:33.572369  5510 process.cpp:3929] Handling HTTP event for process 'slave(824)'
with path: '/slave(824)/monitor/statistics.json'
I1017 02:44:33.573878  5512 http.cpp:1185] HTTP GET for /slave(824)/monitor/statistics.json
from 172.17.0.3:38463
I1017 02:44:33.573956  5512 http.cpp:976] Authorizing principal 'test-principal' to GET the
'/monitor/statistics.json' endpoint
I1017 02:44:33.577038  5501 slave.cpp:869] Agent terminating
[       OK ] Endpoint/SlaveEndpointTest.UnauthorizedRequest/1 (36 ms)
[ RUN      ] Endpoint/SlaveEndpointTest.UnauthorizedRequest/2
I1017 02:44:33.590905  5501 containerizer.cpp:292] Using isolation { environment_secret, posix/cpu,
posix/mem, filesystem/posix, network/cni }
W1017 02:44:33.591356  5501 backend.cpp:76] Failed to create 'aufs' backend: AufsBackend requires
root privileges
W1017 02:44:33.591475  5501 backend.cpp:76] Failed to create 'bind' backend: BindBackend requires
root privileges
I1017 02:44:33.591506  5501 provisioner.cpp:255] Using default backend 'copy'
I1017 02:44:33.595224  5511 slave.cpp:254] Mesos agent started on (825)@172.17.0.3:35744
I1017 02:44:33.595255  5511 slave.cpp:255] Flags at startup: --acls="" --appc_simple_discovery_uri_prefix="http://"
--appc_store_dir="/tmp/Endpoint_SlaveEndpointTest_UnauthorizedRequest_2_5rqJmM/store/appc"
--authenticate_http_readonly="true" --authenticate_http_readwrite="true" --authenticatee="crammd5"
--authentication_backoff_factor="1secs" --authorizer="local" --cgroups_cpu_enable_pids_and_tids_count="false"
--cgroups_enable_cfs="false" --cgroups_hierarchy="/sys/fs/cgroup" --cgroups_limit_swap="false"
--cgroups_root="mesos" --container_disk_watch_interval="15secs" --containerizers="mesos" --credential="/tmp/Endpoint_SlaveEndpointTest_UnauthorizedRequest_2_5rqJmM/credential"
--default_role="*" --disallow_sharing_agent_pid_namespace="false" --disk_watch_interval="1mins"
--docker="docker" --docker_kill_orphans="true" --docker_registry="https://registry-1.docker.io"
--docker_remove_delay="6hrs" --docker_socket="/var/run/docker.sock" --docker_stop_timeout="0ns"
--docker_store_dir="/tmp/Endpoint_SlaveEndpointTest_UnauthorizedRequest_2_5rqJmM/store/docker"
--docker_volume_checkpoint_dir="/var/run/mesos/isolators/docker/volume" --enforce_container_disk_quota="false"
--executor_registration_timeout="1mins" --executor_reregistration_timeout="2secs" --executor_shutdown_grace_period="5secs"
--fetcher_cache_dir="/tmp/Endpoint_SlaveEndpointTest_UnauthorizedRequest_2_5rqJmM/fetch" --fetcher_cache_size="2GB"
--frameworks_home="" --gc_delay="1weeks" --gc_disk_headroom="0.1" --hadoop_home="" --help="false"
--hostname_lookup="true" --http_command_executor="false" --http_credentials="/tmp/Endpoint_SlaveEndpointTest_UnauthorizedRequest_2_5rqJmM/http_credentials"
--http_heartbeat_interval="30secs" --initialize_driver_logging="true" --isolation="posix/cpu,posix/mem"
--launcher="posix" --launcher_dir="/mesos/mesos-1.5.0/_build/src" --logbufsecs="0" --logging_level="INFO"
--max_completed_executors_per_framework="150" --oversubscribed_resources_interval="15secs"
--perf_duration="10secs" --perf_interval="1mins" --port="5051" --qos_correction_interval_min="0ns"
--quiet="false" --recover="reconnect" --recovery_timeout="15mins" --registration_backoff_factor="10ms"
--resources="cpus:2;gpus:0;mem:1024;disk:1024;ports:[31000-32000]" --revocable_cpu_low_priority="true"
--runtime_dir="/tmp/Endpoint_SlaveEndpointTest_UnauthorizedRequest_2_5rqJmM" --sandbox_directory="/mnt/mesos/sandbox"
--strict="true" --switch_user="true" --systemd_enable_support="true" --systemd_runtime_directory="/run/systemd/system"
--version="false" --work_dir="/tmp/Endpoint_SlaveEndpointTest_UnauthorizedRequest_2_qa27Mf"
--zk_session_timeout="10secs"
I1017 02:44:33.595824  5511 credentials.hpp:86] Loading credential for authentication from
'/tmp/Endpoint_SlaveEndpointTest_UnauthorizedRequest_2_5rqJmM/credential'
I1017 02:44:33.596025  5511 slave.cpp:287] Agent using credential for: test-principal
I1017 02:44:33.596060  5511 credentials.hpp:37] Loading credentials for authentication from
'/tmp/Endpoint_SlaveEndpointTest_UnauthorizedRequest_2_5rqJmM/http_credentials'
I1017 02:44:33.596410  5511 http.cpp:1045] Creating default 'basic' HTTP authenticator for
realm 'mesos-agent-readonly'
I1017 02:44:33.596609  5511 http.cpp:1045] Creating default 'basic' HTTP authenticator for
realm 'mesos-agent-readwrite'
I1017 02:44:33.598412  5511 slave.cpp:585] Agent resources: [{"name":"cpus","scalar":{"value":2.0},"type":"SCALAR"},{"name":"mem","scalar":{"value":1024.0},"type":"SCALAR"},{"name":"disk","scalar":{"value":1024.0},"type":"SCALAR"},{"name":"ports","ranges":{"range":[{"begin":31000,"end":32000}]},"type":"RANGES"}]
I1017 02:44:33.598706  5511 slave.cpp:593] Agent attributes: [  ]
I1017 02:44:33.598721  5511 slave.cpp:602] Agent hostname: 80a49ca94a21
I1017 02:44:33.598906  5509 status_update_manager.cpp:177] Pausing sending status updates
I1017 02:44:33.600320  5508 state.cpp:64] Recovering state from '/tmp/Endpoint_SlaveEndpointTest_UnauthorizedRequest_2_qa27Mf/meta'
I1017 02:44:33.600690  5508 status_update_manager.cpp:203] Recovering status update manager
I1017 02:44:33.600944  5504 containerizer.cpp:649] Recovering containerizer
I1017 02:44:33.602504  5507 provisioner.cpp:416] Provisioner recovery complete
I1017 02:44:33.602943  5516 slave.cpp:6310] Finished recovery
I1017 02:44:33.603435  5516 slave.cpp:6492] Querying resource estimator for oversubscribable
resources
I1017 02:44:33.603754  5506 slave.cpp:6506] Received oversubscribable resources {} from the
resource estimator
I1017 02:44:33.606530  5511 process.cpp:3929] Handling HTTP event for process 'slave(825)'
with path: '/slave(825)/containers'
I1017 02:44:33.607954  5513 http.cpp:1185] HTTP GET for /slave(825)/containers from 172.17.0.3:38464
I1017 02:44:33.608063  5513 http.cpp:976] Authorizing principal 'test-principal' to GET the
'/containers' endpoint
I1017 02:44:33.611371  5501 slave.cpp:869] Agent terminating
[       OK ] Endpoint/SlaveEndpointTest.UnauthorizedRequest/2 (34 ms)
[ RUN      ] Endpoint/SlaveEndpointTest.NoAuthorizer/0
I1017 02:44:33.625892  5501 containerizer.cpp:292] Using isolation { environment_secret, posix/cpu,
posix/mem, filesystem/posix, network/cni }
W1017 02:44:33.626469  5501 backend.cpp:76] Failed to create 'aufs' backend: AufsBackend requires
root privileges
W1017 02:44:33.626569  5501 backend.cpp:76] Failed to create 'bind' backend: BindBackend requires
root privileges
I1017 02:44:33.626600  5501 provisioner.cpp:255] Using default backend 'copy'
I1017 02:44:33.628072  5501 cluster.cpp:448] Creating default 'local' authorizer
I1017 02:44:33.629894  5517 slave.cpp:254] Mesos agent started on (826)@172.17.0.3:35744
I1017 02:44:33.629920  5517 slave.cpp:255] Flags at startup: --acls="" --appc_simple_discovery_uri_prefix="http://"
--appc_store_dir="/tmp/Endpoint_SlaveEndpointTest_NoAuthorizer_0_rrG4XS/store/appc" --authenticate_http_readonly="true"
--authenticate_http_readwrite="true" --authenticatee="crammd5" --authentication_backoff_factor="1secs"
--authorizer="local" --cgroups_cpu_enable_pids_and_tids_count="false" --cgroups_enable_cfs="false"
--cgroups_hierarchy="/sys/fs/cgroup" --cgroups_limit_swap="false" --cgroups_root="mesos" --container_disk_watch_interval="15secs"
--containerizers="mesos" --credential="/tmp/Endpoint_SlaveEndpointTest_NoAuthorizer_0_rrG4XS/credential"
--default_role="*" --disallow_sharing_agent_pid_namespace="false" --disk_watch_interval="1mins"
--docker="docker" --docker_kill_orphans="true" --docker_registry="https://registry-1.docker.io"
--docker_remove_delay="6hrs" --docker_socket="/var/run/docker.sock" --docker_stop_timeout="0ns"
--docker_store_dir="/tmp/Endpoint_SlaveEndpointTest_NoAuthorizer_0_rrG4XS/store/docker" --docker_volume_checkpoint_dir="/var/run/mesos/isolators/docker/volume"
--enforce_container_disk_quota="false" --executor_registration_timeout="1mins" --executor_reregistration_timeout="2secs"
--executor_shutdown_grace_period="5secs" --fetcher_cache_dir="/tmp/Endpoint_SlaveEndpointTest_NoAuthorizer_0_rrG4XS/fetch"
--fetcher_cache_size="2GB" --frameworks_home="" --gc_delay="1weeks" --gc_disk_headroom="0.1"
--hadoop_home="" --help="false" --hostname_lookup="true" --http_command_executor="false" --http_credentials="/tmp/Endpoint_SlaveEndpointTest_NoAuthorizer_0_rrG4XS/http_credentials"
--http_heartbeat_interval="30secs" --initialize_driver_logging="true" --isolation="posix/cpu,posix/mem"
--launcher="posix" --launcher_dir="/mesos/mesos-1.5.0/_build/src" --logbufsecs="0" --logging_level="INFO"
--max_completed_executors_per_framework="150" --oversubscribed_resources_interval="15secs"
--perf_duration="10secs" --perf_interval="1mins" --port="5051" --qos_correction_interval_min="0ns"
--quiet="false" --recover="reconnect" --recovery_timeout="15mins" --registration_backoff_factor="10ms"
--resources="cpus:2;gpus:0;mem:1024;disk:1024;ports:[31000-32000]" --revocable_cpu_low_priority="true"
--runtime_dir="/tmp/Endpoint_SlaveEndpointTest_NoAuthorizer_0_rrG4XS" --sandbox_directory="/mnt/mesos/sandbox"
--strict="true" --switch_user="true" --systemd_enable_support="true" --systemd_runtime_directory="/run/systemd/system"
--version="false" --work_dir="/tmp/Endpoint_SlaveEndpointTest_NoAuthorizer_0_yDyRim" --zk_session_timeout="10secs"
I1017 02:44:33.630558  5517 credentials.hpp:86] Loading credential for authentication from
'/tmp/Endpoint_SlaveEndpointTest_NoAuthorizer_0_rrG4XS/credential'
I1017 02:44:33.630796  5517 slave.cpp:287] Agent using credential for: test-principal
I1017 02:44:33.630827  5517 credentials.hpp:37] Loading credentials for authentication from
'/tmp/Endpoint_SlaveEndpointTest_NoAuthorizer_0_rrG4XS/http_credentials'
I1017 02:44:33.631242  5517 http.cpp:1045] Creating default 'basic' HTTP authenticator for
realm 'mesos-agent-readonly'
I1017 02:44:33.631464  5517 http.cpp:1045] Creating default 'basic' HTTP authenticator for
realm 'mesos-agent-readwrite'
I1017 02:44:33.633309  5517 slave.cpp:585] Agent resources: [{"name":"cpus","scalar":{"value":2.0},"type":"SCALAR"},{"name":"mem","scalar":{"value":1024.0},"type":"SCALAR"},{"name":"disk","scalar":{"value":1024.0},"type":"SCALAR"},{"name":"ports","ranges":{"range":[{"begin":31000,"end":32000}]},"type":"RANGES"}]
I1017 02:44:33.633606  5517 slave.cpp:593] Agent attributes: [  ]
I1017 02:44:33.633625  5517 slave.cpp:602] Agent hostname: 80a49ca94a21
I1017 02:44:33.633833  5503 status_update_manager.cpp:177] Pausing sending status updates
I1017 02:44:33.635493  5513 state.cpp:64] Recovering state from '/tmp/Endpoint_SlaveEndpointTest_NoAuthorizer_0_yDyRim/meta'
I1017 02:44:33.635872  5510 status_update_manager.cpp:203] Recovering status update manager
I1017 02:44:33.636133  5515 containerizer.cpp:649] Recovering containerizer
I1017 02:44:33.637632  5513 provisioner.cpp:416] Provisioner recovery complete
I1017 02:44:33.638103  5516 slave.cpp:6310] Finished recovery
I1017 02:44:33.638577  5516 slave.cpp:6492] Querying resource estimator for oversubscribable
resources
I1017 02:44:33.638880  5515 slave.cpp:6506] Received oversubscribable resources {} from the
resource estimator
I1017 02:44:33.641422  5513 process.cpp:3929] Handling HTTP event for process 'slave(826)'
with path: '/slave(826)/monitor/statistics'
I1017 02:44:33.643086  5502 http.cpp:1185] HTTP GET for /slave(826)/monitor/statistics from
172.17.0.3:38465
I1017 02:44:33.643173  5502 http.cpp:976] Authorizing principal 'test-principal' to GET the
'/monitor/statistics' endpoint
I1017 02:44:33.647135  5510 slave.cpp:869] Agent terminating
[       OK ] Endpoint/SlaveEndpointTest.NoAuthorizer/0 (36 ms)
[ RUN      ] Endpoint/SlaveEndpointTest.NoAuthorizer/1
I1017 02:44:33.663081  5501 containerizer.cpp:292] Using isolation { environment_secret, posix/cpu,
posix/mem, filesystem/posix, network/cni }
W1017 02:44:33.663513  5501 backend.cpp:76] Failed to create 'aufs' backend: AufsBackend requires
root privileges
W1017 02:44:33.663650  5501 backend.cpp:76] Failed to create 'bind' backend: BindBackend requires
root privileges
I1017 02:44:33.663683  5501 provisioner.cpp:255] Using default backend 'copy'
I1017 02:44:33.665215  5501 cluster.cpp:448] Creating default 'local' authorizer
I1017 02:44:33.667073  5504 slave.cpp:254] Mesos agent started on (827)@172.17.0.3:35744
I1017 02:44:33.667100  5504 slave.cpp:255] Flags at startup: --acls="" --appc_simple_discovery_uri_prefix="http://"
--appc_store_dir="/tmp/Endpoint_SlaveEndpointTest_NoAuthorizer_1_LvS3WZ/store/appc" --authenticate_http_readonly="true"
--authenticate_http_readwrite="true" --authenticatee="crammd5" --authentication_backoff_factor="1secs"
--authorizer="local" --cgroups_cpu_enable_pids_and_tids_count="false" --cgroups_enable_cfs="false"
--cgroups_hierarchy="/sys/fs/cgroup" --cgroups_limit_swap="false" --cgroups_root="mesos" --container_disk_watch_interval="15secs"
--containerizers="mesos" --credential="/tmp/Endpoint_SlaveEndpointTest_NoAuthorizer_1_LvS3WZ/credential"
--default_role="*" --disallow_sharing_agent_pid_namespace="false" --disk_watch_interval="1mins"
--docker="docker" --docker_kill_orphans="true" --docker_registry="https://registry-1.docker.io"
--docker_remove_delay="6hrs" --docker_socket="/var/run/docker.sock" --docker_stop_timeout="0ns"
--docker_store_dir="/tmp/Endpoint_SlaveEndpointTest_NoAuthorizer_1_LvS3WZ/store/docker" --docker_volume_checkpoint_dir="/var/run/mesos/isolators/docker/volume"
--enforce_container_disk_quota="false" --executor_registration_timeout="1mins" --executor_reregistration_timeout="2secs"
--executor_shutdown_grace_period="5secs" --fetcher_cache_dir="/tmp/Endpoint_SlaveEndpointTest_NoAuthorizer_1_LvS3WZ/fetch"
--fetcher_cache_size="2GB" --frameworks_home="" --gc_delay="1weeks" --gc_disk_headroom="0.1"
--hadoop_home="" --help="false" --hostname_lookup="true" --http_command_executor="false" --http_credentials="/tmp/Endpoint_SlaveEndpointTest_NoAuthorizer_1_LvS3WZ/http_credentials"
--http_heartbeat_interval="30secs" --initialize_driver_logging="true" --isolation="posix/cpu,posix/mem"
--launcher="posix" --launcher_dir="/mesos/mesos-1.5.0/_build/src" --logbufsecs="0" --logging_level="INFO"
--max_completed_executors_per_framework="150" --oversubscribed_resources_interval="15secs"
--perf_duration="10secs" --perf_interval="1mins" --port="5051" --qos_correction_interval_min="0ns"
--quiet="false" --recover="reconnect" --recovery_timeout="15mins" --registration_backoff_factor="10ms"
--resources="cpus:2;gpus:0;mem:1024;disk:1024;ports:[31000-32000]" --revocable_cpu_low_priority="true"
--runtime_dir="/tmp/Endpoint_SlaveEndpointTest_NoAuthorizer_1_LvS3WZ" --sandbox_directory="/mnt/mesos/sandbox"
--strict="true" --switch_user="true" --systemd_enable_support="true" --systemd_runtime_directory="/run/systemd/system"
--version="false" --work_dir="/tmp/Endpoint_SlaveEndpointTest_NoAuthorizer_1_QNjPbt" --zk_session_timeout="10secs"
I1017 02:44:33.667778  5504 credentials.hpp:86] Loading credential for authentication from
'/tmp/Endpoint_SlaveEndpointTest_NoAuthorizer_1_LvS3WZ/credential'
I1017 02:44:33.668012  5504 slave.cpp:287] Agent using credential for: test-principal
I1017 02:44:33.668047  5504 credentials.hpp:37] Loading credentials for authentication from
'/tmp/Endpoint_SlaveEndpointTest_NoAuthorizer_1_LvS3WZ/http_credentials'
I1017 02:44:33.668483  5504 http.cpp:1045] Creating default 'basic' HTTP authenticator for
realm 'mesos-agent-readonly'
I1017 02:44:33.668710  5504 http.cpp:1045] Creating default 'basic' HTTP authenticator for
realm 'mesos-agent-readwrite'
I1017 02:44:33.670246  5504 slave.cpp:585] Agent resources: [{"name":"cpus","scalar":{"value":2.0},"type":"SCALAR"},{"name":"mem","scalar":{"value":1024.0},"type":"SCALAR"},{"name":"disk","scalar":{"value":1024.0},"type":"SCALAR"},{"name":"ports","ranges":{"range":[{"begin":31000,"end":32000}]},"type":"RANGES"}]
I1017 02:44:33.670472  5504 slave.cpp:593] Agent attributes: [  ]
I1017 02:44:33.670485  5504 slave.cpp:602] Agent hostname: 80a49ca94a21
I1017 02:44:33.670604  5505 status_update_manager.cpp:177] Pausing sending status updates
I1017 02:44:33.672422  5516 state.cpp:64] Recovering state from '/tmp/Endpoint_SlaveEndpointTest_NoAuthorizer_1_QNjPbt/meta'
I1017 02:44:33.672821  5517 status_update_manager.cpp:203] Recovering status update manager
I1017 02:44:33.673127  5513 containerizer.cpp:649] Recovering containerizer
I1017 02:44:33.674806  5516 provisioner.cpp:416] Provisioner recovery complete
I1017 02:44:33.675248  5507 slave.cpp:6310] Finished recovery
I1017 02:44:33.675789  5507 slave.cpp:6492] Querying resource estimator for oversubscribable
resources
I1017 02:44:33.676134  5511 slave.cpp:6506] Received oversubscribable resources {} from the
resource estimator
I1017 02:44:33.679016  5504 process.cpp:3929] Handling HTTP event for process 'slave(827)'
with path: '/slave(827)/monitor/statistics.json'
I1017 02:44:33.680580  5504 http.cpp:1185] HTTP GET for /slave(827)/monitor/statistics.json
from 172.17.0.3:38466
I1017 02:44:33.680663  5504 http.cpp:976] Authorizing principal 'test-principal' to GET the
'/monitor/statistics.json' endpoint
I1017 02:44:33.684590  5505 slave.cpp:869] Agent terminating
[       OK ] Endpoint/SlaveEndpointTest.NoAuthorizer/1 (36 ms)
[ RUN      ] Endpoint/SlaveEndpointTest.NoAuthorizer/2
I1017 02:44:33.698815  5501 containerizer.cpp:292] Using isolation { environment_secret, posix/cpu,
posix/mem, filesystem/posix, network/cni }
W1017 02:44:33.699281  5501 backend.cpp:76] Failed to create 'aufs' backend: AufsBackend requires
root privileges
W1017 02:44:33.699396  5501 backend.cpp:76] Failed to create 'bind' backend: BindBackend requires
root privileges
I1017 02:44:33.699432  5501 provisioner.cpp:255] Using default backend 'copy'
I1017 02:44:33.701001  5501 cluster.cpp:448] Creating default 'local' authorizer
I1017 02:44:33.702986  5512 slave.cpp:254] Mesos agent started on (828)@172.17.0.3:35744
I1017 02:44:33.703014  5512 slave.cpp:255] Flags at startup: --acls="" --appc_simple_discovery_uri_prefix="http://"
--appc_store_dir="/tmp/Endpoint_SlaveEndpointTest_NoAuthorizer_2_fipIj7/store/appc" --authenticate_http_readonly="true"
--authenticate_http_readwrite="true" --authenticatee="crammd5" --authentication_backoff_factor="1secs"
--authorizer="local" --cgroups_cpu_enable_pids_and_tids_count="false" --cgroups_enable_cfs="false"
--cgroups_hierarchy="/sys/fs/cgroup" --cgroups_limit_swap="false" --cgroups_root="mesos" --container_disk_watch_interval="15secs"
--containerizers="mesos" --credential="/tmp/Endpoint_SlaveEndpointTest_NoAuthorizer_2_fipIj7/credential"
--default_role="*" --disallow_sharing_agent_pid_namespace="false" --disk_watch_interval="1mins"
--docker="docker" --docker_kill_orphans="true" --docker_registry="https://registry-1.docker.io"
--docker_remove_delay="6hrs" --docker_socket="/var/run/docker.sock" --docker_stop_timeout="0ns"
--docker_store_dir="/tmp/Endpoint_SlaveEndpointTest_NoAuthorizer_2_fipIj7/store/docker" --docker_volume_checkpoint_dir="/var/run/mesos/isolators/docker/volume"
--enforce_container_disk_quota="false" --executor_registration_timeout="1mins" --executor_reregistration_timeout="2secs"
--executor_shutdown_grace_period="5secs" --fetcher_cache_dir="/tmp/Endpoint_SlaveEndpointTest_NoAuthorizer_2_fipIj7/fetch"
--fetcher_cache_size="2GB" --frameworks_home="" --gc_delay="1weeks" --gc_disk_headroom="0.1"
--hadoop_home="" --help="false" --hostname_lookup="true" --http_command_executor="false" --http_credentials="/tmp/Endpoint_SlaveEndpointTest_NoAuthorizer_2_fipIj7/http_credentials"
--http_heartbeat_interval="30secs" --initialize_driver_logging="true" --isolation="posix/cpu,posix/mem"
--launcher="posix" --launcher_dir="/mesos/mesos-1.5.0/_build/src" --logbufsecs="0" --logging_level="INFO"
--max_completed_executors_per_framework="150" --oversubscribed_resources_interval="15secs"
--perf_duration="10secs" --perf_interval="1mins" --port="5051" --qos_correction_interval_min="0ns"
--quiet="false" --recover="reconnect" --recovery_timeout="15mins" --registration_backoff_factor="10ms"
--resources="cpus:2;gpus:0;mem:1024;disk:1024;ports:[31000-32000]" --revocable_cpu_low_priority="true"
--runtime_dir="/tmp/Endpoint_SlaveEndpointTest_NoAuthorizer_2_fipIj7" --sandbox_directory="/mnt/mesos/sandbox"
--strict="true" --switch_user="true" --systemd_enable_support="true" --systemd_runtime_directory="/run/systemd/system"
--version="false" --work_dir="/tmp/Endpoint_SlaveEndpointTest_NoAuthorizer_2_0p2DsA" --zk_session_timeout="10secs"
I1017 02:44:33.703600  5512 credentials.hpp:86] Loading credential for authentication from
'/tmp/Endpoint_SlaveEndpointTest_NoAuthorizer_2_fipIj7/credential'
I1017 02:44:33.703779  5512 slave.cpp:287] Agent using credential for: test-principal
I1017 02:44:33.703805  5512 credentials.hpp:37] Loading credentials for authentication from
'/tmp/Endpoint_SlaveEndpointTest_NoAuthorizer_2_fipIj7/http_credentials'
I1017 02:44:33.704090  5512 http.cpp:1045] Creating default 'basic' HTTP authenticator for
realm 'mesos-agent-readonly'
I1017 02:44:33.704267  5512 http.cpp:1045] Creating default 'basic' HTTP authenticator for
realm 'mesos-agent-readwrite'
I1017 02:44:33.705971  5512 slave.cpp:585] Agent resources: [{"name":"cpus","scalar":{"value":2.0},"type":"SCALAR"},{"name":"mem","scalar":{"value":1024.0},"type":"SCALAR"},{"name":"disk","scalar":{"value":1024.0},"type":"SCALAR"},{"name":"ports","ranges":{"range":[{"begin":31000,"end":32000}]},"type":"RANGES"}]
I1017 02:44:33.706291  5512 slave.cpp:593] Agent attributes: [  ]
I1017 02:44:33.706310  5512 slave.cpp:602] Agent hostname: 80a49ca94a21
I1017 02:44:33.706441  5505 status_update_manager.cpp:177] Pausing sending status updates
I1017 02:44:33.708055  5511 state.cpp:64] Recovering state from '/tmp/Endpoint_SlaveEndpointTest_NoAuthorizer_2_0p2DsA/meta'
I1017 02:44:33.708420  5514 status_update_manager.cpp:203] Recovering status update manager
I1017 02:44:33.708611  5513 containerizer.cpp:649] Recovering containerizer
I1017 02:44:33.710140  5511 provisioner.cpp:416] Provisioner recovery complete
I1017 02:44:33.710716  5506 slave.cpp:6310] Finished recovery
I1017 02:44:33.711230  5506 slave.cpp:6492] Querying resource estimator for oversubscribable
resources
I1017 02:44:33.711503  5517 slave.cpp:6506] Received oversubscribable resources {} from the
resource estimator
I1017 02:44:33.714119  5507 process.cpp:3929] Handling HTTP event for process 'slave(828)'
with path: '/slave(828)/containers'
I1017 02:44:33.715673  5506 http.cpp:1185] HTTP GET for /slave(828)/containers from 172.17.0.3:38467
I1017 02:44:33.715757  5506 http.cpp:976] Authorizing principal 'test-principal' to GET the
'/containers' endpoint
I1017 02:44:33.720608  5501 slave.cpp:869] Agent terminating
[       OK ] Endpoint/SlaveEndpointTest.NoAuthorizer/2 (35 ms)
[----------] 9 tests from Endpoint/SlaveEndpointTest (320 ms total)

[----------] 2 tests from ContainerizerType/DefaultContainerDNSFlagTest
[ RUN      ] ContainerizerType/DefaultContainerDNSFlagTest.ValidateFlag/0
[       OK ] ContainerizerType/DefaultContainerDNSFlagTest.ValidateFlag/0 (11 ms)
[ RUN      ] ContainerizerType/DefaultContainerDNSFlagTest.ValidateFlag/1
[       OK ] ContainerizerType/DefaultContainerDNSFlagTest.ValidateFlag/1 (9 ms)
[----------] 2 tests from ContainerizerType/DefaultContainerDNSFlagTest (20 ms total)

[----------] Global test environment tear-down
[==========] 1696 tests from 185 test cases ran. (448499 ms total)
[  PASSED  ] 1695 tests.
[  FAILED  ] 1 test, listed below:
[  FAILED  ] MasterTest.IgnoreOldAgentReregistration

 1 FAILED TEST
  YOU HAVE 21 DISABLED TESTS

I1017 02:44:33.803557  5518 process.cpp:1068] Failed to accept socket: future discarded
make[4]: *** [check-local] Error 1
make[4]: Leaving directory `/mesos/mesos-1.5.0/_build/src'
make[3]: *** [check-am] Error 2
make[3]: Leaving directory `/mesos/mesos-1.5.0/_build/src'
make[2]: *** [check] Error 2
make[2]: Leaving directory `/mesos/mesos-1.5.0/_build/src'
make[1]: *** [check-recursive] Error 1
make[1]: Leaving directory `/mesos/mesos-1.5.0/_build'
make: *** [distcheck] Error 1
+ docker rmi mesos-1508204946-1053
Untagged: mesos-1508204946-1053:latest
Deleted: sha256:1b16625b0d381d4e5f9aa847114a69c40dda93d73ac88125f5c584aebb74508f
Deleted: sha256:501b9c185c8585d2f4cd1af3f07df247242b3bbc71b67f437182b083ee52bce3
Deleted: sha256:bc6a1c57bbde9951bf84d699d8ae382f5ab9aab16a7751506a340c45daa24eb8
Deleted: sha256:51c2837313fbcc8cbc56c06e5f1a47db37b052a616d4b2b0d2042d98fec21295
Deleted: sha256:fcd6034abef7fdf6af7e1842e2e46456b1bf3e9776d3b31b5bedc041a194a1fe
Deleted: sha256:28ecbc1bfbf6e4944fdb39849ac6ddf4e8123ca821bdd36186715033cbc57d57
Deleted: sha256:9ca1c72d43f9ed257670865a0d90f7115650576faf1836d23ccd5552a22635cb
Deleted: sha256:547ef7b908b504e9b3c205b5eae4fe00d301f725394710e82b00af78517a122d
Deleted: sha256:e614733e4f2954b610646858ff166890d8ede13c04c3d1369f1c5bb2bdcaa6d4
Deleted: sha256:b47fe5560ea8e2b470207d9d98e3c0fe65a0d2e62c4f168822095df322ddf53e
Deleted: sha256:3c74e7382166724ad8999a34fe376ed3183d5efa821db61e85984f7535b0f487
Deleted: sha256:dff6e12aa37fb5676d4a279f95434e0b52a9da24b316174dbe9d487bf4ac2e0f
Deleted: sha256:bd0c72f510cb1e8932c58005fbdfd8209e1ef8fb4c10d35ec8fef0a5df355180
Deleted: sha256:bd8dcac4a40486a99ec396f4b643cb028b1d02baf53c7a9b3e5c931d026f89f6
Deleted: sha256:cc1ef01bf8bbafac8027349b0ae6510c1f10040988d75d27a3c59b4500fa2645
Deleted: sha256:9a52d50c3b66385bd105f5157110bed5602bc4ecdabf77cf922a3adedcdcb4d5
Deleted: sha256:c338bcca5803897559aefa21831bbae87d31ad2045a9c9724cce91fb431358c1
Deleted: sha256:60c0f399af37c0e9f178dbe27f14601f9a09f46d46437aa65210f3227582098a
Deleted: sha256:6926af9fa826237a497e15f1db9616748945042e11759645c3a1d994d5d996ef
Deleted: sha256:e42ec9f18e9a98e2acc631943fbbf7ec5c310d48131370aa29b826d9c952ab05
Deleted: sha256:d6abe795388b7de9881e63fb91412c7da25994d6fbe8822b33f1aa9671fe5fd4
Deleted: sha256:d2c5d27f7eea9888903544bb03b617f8e7da145827d712c17e1668dcefbf43fe
Deleted: sha256:797d94765159b8be1508f6bbd1e5a525c60ec724778fa87c09f285265f9a62a2
Deleted: sha256:322bd880ab01fb31a5a1bea819ffffe1f43b3ff9b98785e8f878577e9bc1a102
Deleted: sha256:28ca60bc13af2477dd7ff8432d9474aecac6c0dc53815607cafdd944e1d400d1
Deleted: sha256:6fe6f68c92e66652f604b89f6ddd5358fa4c137d1198fbc6cdaed237bcd8590e
Deleted: sha256:683e6d90331a55aa847e21db0c17c3f95ea243f2d2e61e35f9cb8d7f976805e8
Deleted: sha256:8531485460bbae4a26b2a2fe5bda80ef4e5c8e48b519af236dad19f5c0fb85b4
Build step 'Execute shell' marked build as failure


Mime
View raw message