mesos-builds mailing list archives

Site index · List index
Message view « Date » · « Thread »
Top « Date » · « Thread »
From Apache Jenkins Server <jenk...@builds.apache.org>
Subject Build failed in Jenkins: Mesos-Buildbot » autotools,gcc,--verbose --disable-libtool-wrappers,GLOG_v=1 MESOS_VERBOSE=1,centos:7,(ubuntu)&&(!ubuntu-us1)&&(!ubuntu-eu2)&&(!qnode3)&&(!H23) #4319
Date Fri, 13 Oct 2017 12:03:03 GMT
See <https://builds.apache.org/job/Mesos-Buildbot/BUILDTOOL=autotools,COMPILER=gcc,CONFIGURATION=--verbose%20--disable-libtool-wrappers,ENVIRONMENT=GLOG_v=1%20MESOS_VERBOSE=1,OS=centos%3A7,label_exp=(ubuntu)&&(!ubuntu-us1)&&(!ubuntu-eu2)&&(!qnode3)&&(!H23)/4319/display/redirect?page=changes>

Changes:

[bbannier] Added documentation to CSI-related source proto fields.

------------------------------------------
[...truncated 31.79 MB...]
I1013 12:02:54.385978  6655 http.cpp:1045] Creating default 'basic' HTTP authenticator for
realm 'mesos-agent-readonly'
I1013 12:02:54.386113  6655 http.cpp:1045] Creating default 'basic' HTTP authenticator for
realm 'mesos-agent-readwrite'
I1013 12:02:54.387784  6655 slave.cpp:585] Agent resources: [{"name":"cpus","scalar":{"value":2.0},"type":"SCALAR"},{"name":"mem","scalar":{"value":1024.0},"type":"SCALAR"},{"name":"disk","scalar":{"value":1024.0},"type":"SCALAR"},{"name":"ports","ranges":{"range":[{"begin":31000,"end":32000}]},"type":"RANGES"}]
I1013 12:02:54.387982  6655 slave.cpp:593] Agent attributes: [  ]
I1013 12:02:54.387995  6655 slave.cpp:602] Agent hostname: 47e20b76d3c5
I1013 12:02:54.388090  6642 status_update_manager.cpp:177] Pausing sending status updates
I1013 12:02:54.389467  6653 state.cpp:64] Recovering state from '/tmp/Endpoint_SlaveEndpointTest_AuthorizedRequest_2_DNU13M/meta'
I1013 12:02:54.389665  6647 status_update_manager.cpp:203] Recovering status update manager
I1013 12:02:54.389824  6660 containerizer.cpp:648] Recovering containerizer
I1013 12:02:54.390799  6644 provisioner.cpp:416] Provisioner recovery complete
I1013 12:02:54.391034  6642 slave.cpp:6310] Finished recovery
I1013 12:02:54.391425  6642 slave.cpp:6492] Querying resource estimator for oversubscribable
resources
I1013 12:02:54.391610  6664 slave.cpp:6506] Received oversubscribable resources {} from the
resource estimator
I1013 12:02:54.393406  6661 process.cpp:3929] Handling HTTP event for process 'slave(818)'
with path: '/slave(818)/containers'
I1013 12:02:54.394315  6654 http.cpp:1185] HTTP GET for /slave(818)/containers from 172.17.0.3:33302
I1013 12:02:54.394371  6654 http.cpp:976] Authorizing principal 'test-principal' to GET the
'/containers' endpoint
I1013 12:02:54.396834  6654 slave.cpp:869] Agent terminating
[       OK ] Endpoint/SlaveEndpointTest.AuthorizedRequest/2 (24 ms)
[ RUN      ] Endpoint/SlaveEndpointTest.UnauthorizedRequest/0
I1013 12:02:54.405978  6640 containerizer.cpp:292] Using isolation { environment_secret, posix/cpu,
posix/mem, filesystem/posix, network/cni }
W1013 12:02:54.406419  6640 backend.cpp:76] Failed to create 'aufs' backend: AufsBackend requires
root privileges
W1013 12:02:54.406522  6640 backend.cpp:76] Failed to create 'bind' backend: BindBackend requires
root privileges
I1013 12:02:54.406556  6640 provisioner.cpp:255] Using default backend 'copy'
I1013 12:02:54.409559  6650 slave.cpp:254] Mesos agent started on (819)@172.17.0.3:35239
I1013 12:02:54.409586  6650 slave.cpp:255] Flags at startup: --acls="" --appc_simple_discovery_uri_prefix="http://"
--appc_store_dir="/tmp/Endpoint_SlaveEndpointTest_UnauthorizedRequest_0_5oUcLX/store/appc"
--authenticate_http_readonly="true" --authenticate_http_readwrite="true" --authenticatee="crammd5"
--authentication_backoff_factor="1secs" --authorizer="local" --cgroups_cpu_enable_pids_and_tids_count="false"
--cgroups_enable_cfs="false" --cgroups_hierarchy="/sys/fs/cgroup" --cgroups_limit_swap="false"
--cgroups_root="mesos" --container_disk_watch_interval="15secs" --containerizers="mesos" --credential="/tmp/Endpoint_SlaveEndpointTest_UnauthorizedRequest_0_5oUcLX/credential"
--default_role="*" --disallow_sharing_agent_pid_namespace="false" --disk_watch_interval="1mins"
--docker="docker" --docker_kill_orphans="true" --docker_registry="https://registry-1.docker.io"
--docker_remove_delay="6hrs" --docker_socket="/var/run/docker.sock" --docker_stop_timeout="0ns"
--docker_store_dir="/tmp/Endpoint_SlaveEndpointTest_UnauthorizedRequest_0_5oUcLX/store/docker"
--docker_volume_checkpoint_dir="/var/run/mesos/isolators/docker/volume" --enforce_container_disk_quota="false"
--executor_registration_timeout="1mins" --executor_reregistration_timeout="2secs" --executor_shutdown_grace_period="5secs"
--fetcher_cache_dir="/tmp/Endpoint_SlaveEndpointTest_UnauthorizedRequest_0_5oUcLX/fetch" --fetcher_cache_size="2GB"
--frameworks_home="" --gc_delay="1weeks" --gc_disk_headroom="0.1" --hadoop_home="" --help="false"
--hostname_lookup="true" --http_command_executor="false" --http_credentials="/tmp/Endpoint_SlaveEndpointTest_UnauthorizedRequest_0_5oUcLX/http_credentials"
--http_heartbeat_interval="30secs" --initialize_driver_logging="true" --isolation="posix/cpu,posix/mem"
--launcher="posix" --launcher_dir="/mesos/mesos-1.5.0/_build/src" --logbufsecs="0" --logging_level="INFO"
--max_completed_executors_per_framework="150" --oversubscribed_resources_interval="15secs"
--perf_duration="10secs" --perf_interval="1mins" --port="5051" --qos_correction_interval_min="0ns"
--quiet="false" --recover="reconnect" --recovery_timeout="15mins" --registration_backoff_factor="10ms"
--resources="cpus:2;gpus:0;mem:1024;disk:1024;ports:[31000-32000]" --revocable_cpu_low_priority="true"
--runtime_dir="/tmp/Endpoint_SlaveEndpointTest_UnauthorizedRequest_0_5oUcLX" --sandbox_directory="/mnt/mesos/sandbox"
--strict="true" --switch_user="true" --systemd_enable_support="true" --systemd_runtime_directory="/run/systemd/system"
--version="false" --work_dir="/tmp/Endpoint_SlaveEndpointTest_UnauthorizedRequest_0_zIFCcJ"
--zk_session_timeout="10secs"
I1013 12:02:54.410100  6650 credentials.hpp:86] Loading credential for authentication from
'/tmp/Endpoint_SlaveEndpointTest_UnauthorizedRequest_0_5oUcLX/credential'
I1013 12:02:54.410279  6650 slave.cpp:287] Agent using credential for: test-principal
I1013 12:02:54.410305  6650 credentials.hpp:37] Loading credentials for authentication from
'/tmp/Endpoint_SlaveEndpointTest_UnauthorizedRequest_0_5oUcLX/http_credentials'
I1013 12:02:54.410605  6650 http.cpp:1045] Creating default 'basic' HTTP authenticator for
realm 'mesos-agent-readonly'
I1013 12:02:54.410758  6650 http.cpp:1045] Creating default 'basic' HTTP authenticator for
realm 'mesos-agent-readwrite'
I1013 12:02:54.412140  6650 slave.cpp:585] Agent resources: [{"name":"cpus","scalar":{"value":2.0},"type":"SCALAR"},{"name":"mem","scalar":{"value":1024.0},"type":"SCALAR"},{"name":"disk","scalar":{"value":1024.0},"type":"SCALAR"},{"name":"ports","ranges":{"range":[{"begin":31000,"end":32000}]},"type":"RANGES"}]
I1013 12:02:54.412339  6650 slave.cpp:593] Agent attributes: [  ]
I1013 12:02:54.412353  6650 slave.cpp:602] Agent hostname: 47e20b76d3c5
I1013 12:02:54.412456  6641 status_update_manager.cpp:177] Pausing sending status updates
I1013 12:02:54.413689  6648 state.cpp:64] Recovering state from '/tmp/Endpoint_SlaveEndpointTest_UnauthorizedRequest_0_zIFCcJ/meta'
I1013 12:02:54.413904  6649 status_update_manager.cpp:203] Recovering status update manager
I1013 12:02:54.414047  6661 containerizer.cpp:648] Recovering containerizer
I1013 12:02:54.415046  6651 provisioner.cpp:416] Provisioner recovery complete
I1013 12:02:54.415361  6641 slave.cpp:6310] Finished recovery
I1013 12:02:54.415704  6641 slave.cpp:6492] Querying resource estimator for oversubscribable
resources
I1013 12:02:54.415904  6664 slave.cpp:6506] Received oversubscribable resources {} from the
resource estimator
I1013 12:02:54.417702  6652 process.cpp:3929] Handling HTTP event for process 'slave(819)'
with path: '/slave(819)/monitor/statistics'
I1013 12:02:54.418668  6655 http.cpp:1185] HTTP GET for /slave(819)/monitor/statistics from
172.17.0.3:33310
I1013 12:02:54.418725  6655 http.cpp:976] Authorizing principal 'test-principal' to GET the
'/monitor/statistics' endpoint
I1013 12:02:54.420099  6640 slave.cpp:869] Agent terminating
[       OK ] Endpoint/SlaveEndpointTest.UnauthorizedRequest/0 (23 ms)
[ RUN      ] Endpoint/SlaveEndpointTest.UnauthorizedRequest/1
I1013 12:02:54.429105  6640 containerizer.cpp:292] Using isolation { environment_secret, posix/cpu,
posix/mem, filesystem/posix, network/cni }
W1013 12:02:54.429531  6640 backend.cpp:76] Failed to create 'aufs' backend: AufsBackend requires
root privileges
W1013 12:02:54.429625  6640 backend.cpp:76] Failed to create 'bind' backend: BindBackend requires
root privileges
I1013 12:02:54.429653  6640 provisioner.cpp:255] Using default backend 'copy'
I1013 12:02:54.432616  6648 slave.cpp:254] Mesos agent started on (820)@172.17.0.3:35239
I1013 12:02:54.432642  6648 slave.cpp:255] Flags at startup: --acls="" --appc_simple_discovery_uri_prefix="http://"
--appc_store_dir="/tmp/Endpoint_SlaveEndpointTest_UnauthorizedRequest_1_DErmbU/store/appc"
--authenticate_http_readonly="true" --authenticate_http_readwrite="true" --authenticatee="crammd5"
--authentication_backoff_factor="1secs" --authorizer="local" --cgroups_cpu_enable_pids_and_tids_count="false"
--cgroups_enable_cfs="false" --cgroups_hierarchy="/sys/fs/cgroup" --cgroups_limit_swap="false"
--cgroups_root="mesos" --container_disk_watch_interval="15secs" --containerizers="mesos" --credential="/tmp/Endpoint_SlaveEndpointTest_UnauthorizedRequest_1_DErmbU/credential"
--default_role="*" --disallow_sharing_agent_pid_namespace="false" --disk_watch_interval="1mins"
--docker="docker" --docker_kill_orphans="true" --docker_registry="https://registry-1.docker.io"
--docker_remove_delay="6hrs" --docker_socket="/var/run/docker.sock" --docker_stop_timeout="0ns"
--docker_store_dir="/tmp/Endpoint_SlaveEndpointTest_UnauthorizedRequest_1_DErmbU/store/docker"
--docker_volume_checkpoint_dir="/var/run/mesos/isolators/docker/volume" --enforce_container_disk_quota="false"
--executor_registration_timeout="1mins" --executor_reregistration_timeout="2secs" --executor_shutdown_grace_period="5secs"
--fetcher_cache_dir="/tmp/Endpoint_SlaveEndpointTest_UnauthorizedRequest_1_DErmbU/fetch" --fetcher_cache_size="2GB"
--frameworks_home="" --gc_delay="1weeks" --gc_disk_headroom="0.1" --hadoop_home="" --help="false"
--hostname_lookup="true" --http_command_executor="false" --http_credentials="/tmp/Endpoint_SlaveEndpointTest_UnauthorizedRequest_1_DErmbU/http_credentials"
--http_heartbeat_interval="30secs" --initialize_driver_logging="true" --isolation="posix/cpu,posix/mem"
--launcher="posix" --launcher_dir="/mesos/mesos-1.5.0/_build/src" --logbufsecs="0" --logging_level="INFO"
--max_completed_executors_per_framework="150" --oversubscribed_resources_interval="15secs"
--perf_duration="10secs" --perf_interval="1mins" --port="5051" --qos_correction_interval_min="0ns"
--quiet="false" --recover="reconnect" --recovery_timeout="15mins" --registration_backoff_factor="10ms"
--resources="cpus:2;gpus:0;mem:1024;disk:1024;ports:[31000-32000]" --revocable_cpu_low_priority="true"
--runtime_dir="/tmp/Endpoint_SlaveEndpointTest_UnauthorizedRequest_1_DErmbU" --sandbox_directory="/mnt/mesos/sandbox"
--strict="true" --switch_user="true" --systemd_enable_support="true" --systemd_runtime_directory="/run/systemd/system"
--version="false" --work_dir="/tmp/Endpoint_SlaveEndpointTest_UnauthorizedRequest_1_NlSkzF"
--zk_session_timeout="10secs"
I1013 12:02:54.433154  6648 credentials.hpp:86] Loading credential for authentication from
'/tmp/Endpoint_SlaveEndpointTest_UnauthorizedRequest_1_DErmbU/credential'
I1013 12:02:54.433318  6648 slave.cpp:287] Agent using credential for: test-principal
I1013 12:02:54.433347  6648 credentials.hpp:37] Loading credentials for authentication from
'/tmp/Endpoint_SlaveEndpointTest_UnauthorizedRequest_1_DErmbU/http_credentials'
I1013 12:02:54.433643  6648 http.cpp:1045] Creating default 'basic' HTTP authenticator for
realm 'mesos-agent-readonly'
I1013 12:02:54.433801  6648 http.cpp:1045] Creating default 'basic' HTTP authenticator for
realm 'mesos-agent-readwrite'
I1013 12:02:54.435009  6648 slave.cpp:585] Agent resources: [{"name":"cpus","scalar":{"value":2.0},"type":"SCALAR"},{"name":"mem","scalar":{"value":1024.0},"type":"SCALAR"},{"name":"disk","scalar":{"value":1024.0},"type":"SCALAR"},{"name":"ports","ranges":{"range":[{"begin":31000,"end":32000}]},"type":"RANGES"}]
I1013 12:02:54.435299  6648 slave.cpp:593] Agent attributes: [  ]
I1013 12:02:54.435313  6648 slave.cpp:602] Agent hostname: 47e20b76d3c5
I1013 12:02:54.435420  6661 status_update_manager.cpp:177] Pausing sending status updates
I1013 12:02:54.436616  6642 state.cpp:64] Recovering state from '/tmp/Endpoint_SlaveEndpointTest_UnauthorizedRequest_1_NlSkzF/meta'
I1013 12:02:54.436839  6650 status_update_manager.cpp:203] Recovering status update manager
I1013 12:02:54.436995  6654 containerizer.cpp:648] Recovering containerizer
I1013 12:02:54.438000  6646 provisioner.cpp:416] Provisioner recovery complete
I1013 12:02:54.438272  6661 slave.cpp:6310] Finished recovery
I1013 12:02:54.438669  6661 slave.cpp:6492] Querying resource estimator for oversubscribable
resources
I1013 12:02:54.438891  6659 slave.cpp:6506] Received oversubscribable resources {} from the
resource estimator
I1013 12:02:54.440994  6664 process.cpp:3929] Handling HTTP event for process 'slave(820)'
with path: '/slave(820)/monitor/statistics.json'
I1013 12:02:54.442206  6649 http.cpp:1185] HTTP GET for /slave(820)/monitor/statistics.json
from 172.17.0.3:33312
I1013 12:02:54.442281  6649 http.cpp:976] Authorizing principal 'test-principal' to GET the
'/monitor/statistics.json' endpoint
I1013 12:02:54.443804  6640 slave.cpp:869] Agent terminating
[       OK ] Endpoint/SlaveEndpointTest.UnauthorizedRequest/1 (24 ms)
[ RUN      ] Endpoint/SlaveEndpointTest.UnauthorizedRequest/2
I1013 12:02:54.454279  6640 containerizer.cpp:292] Using isolation { environment_secret, posix/cpu,
posix/mem, filesystem/posix, network/cni }
W1013 12:02:54.454761  6640 backend.cpp:76] Failed to create 'aufs' backend: AufsBackend requires
root privileges
W1013 12:02:54.454869  6640 backend.cpp:76] Failed to create 'bind' backend: BindBackend requires
root privileges
I1013 12:02:54.454901  6640 provisioner.cpp:255] Using default backend 'copy'
I1013 12:02:54.458266  6648 slave.cpp:254] Mesos agent started on (821)@172.17.0.3:35239
I1013 12:02:54.458295  6648 slave.cpp:255] Flags at startup: --acls="" --appc_simple_discovery_uri_prefix="http://"
--appc_store_dir="/tmp/Endpoint_SlaveEndpointTest_UnauthorizedRequest_2_kffWPQ/store/appc"
--authenticate_http_readonly="true" --authenticate_http_readwrite="true" --authenticatee="crammd5"
--authentication_backoff_factor="1secs" --authorizer="local" --cgroups_cpu_enable_pids_and_tids_count="false"
--cgroups_enable_cfs="false" --cgroups_hierarchy="/sys/fs/cgroup" --cgroups_limit_swap="false"
--cgroups_root="mesos" --container_disk_watch_interval="15secs" --containerizers="mesos" --credential="/tmp/Endpoint_SlaveEndpointTest_UnauthorizedRequest_2_kffWPQ/credential"
--default_role="*" --disallow_sharing_agent_pid_namespace="false" --disk_watch_interval="1mins"
--docker="docker" --docker_kill_orphans="true" --docker_registry="https://registry-1.docker.io"
--docker_remove_delay="6hrs" --docker_socket="/var/run/docker.sock" --docker_stop_timeout="0ns"
--docker_store_dir="/tmp/Endpoint_SlaveEndpointTest_UnauthorizedRequest_2_kffWPQ/store/docker"
--docker_volume_checkpoint_dir="/var/run/mesos/isolators/docker/volume" --enforce_container_disk_quota="false"
--executor_registration_timeout="1mins" --executor_reregistration_timeout="2secs" --executor_shutdown_grace_period="5secs"
--fetcher_cache_dir="/tmp/Endpoint_SlaveEndpointTest_UnauthorizedRequest_2_kffWPQ/fetch" --fetcher_cache_size="2GB"
--frameworks_home="" --gc_delay="1weeks" --gc_disk_headroom="0.1" --hadoop_home="" --help="false"
--hostname_lookup="true" --http_command_executor="false" --http_credentials="/tmp/Endpoint_SlaveEndpointTest_UnauthorizedRequest_2_kffWPQ/http_credentials"
--http_heartbeat_interval="30secs" --initialize_driver_logging="true" --isolation="posix/cpu,posix/mem"
--launcher="posix" --launcher_dir="/mesos/mesos-1.5.0/_build/src" --logbufsecs="0" --logging_level="INFO"
--max_completed_executors_per_framework="150" --oversubscribed_resources_interval="15secs"
--perf_duration="10secs" --perf_interval="1mins" --port="5051" --qos_correction_interval_min="0ns"
--quiet="false" --recover="reconnect" --recovery_timeout="15mins" --registration_backoff_factor="10ms"
--resources="cpus:2;gpus:0;mem:1024;disk:1024;ports:[31000-32000]" --revocable_cpu_low_priority="true"
--runtime_dir="/tmp/Endpoint_SlaveEndpointTest_UnauthorizedRequest_2_kffWPQ" --sandbox_directory="/mnt/mesos/sandbox"
--strict="true" --switch_user="true" --systemd_enable_support="true" --systemd_runtime_directory="/run/systemd/system"
--version="false" --work_dir="/tmp/Endpoint_SlaveEndpointTest_UnauthorizedRequest_2_x7beaC"
--zk_session_timeout="10secs"
I1013 12:02:54.458724  6648 credentials.hpp:86] Loading credential for authentication from
'/tmp/Endpoint_SlaveEndpointTest_UnauthorizedRequest_2_kffWPQ/credential'
I1013 12:02:54.458886  6648 slave.cpp:287] Agent using credential for: test-principal
I1013 12:02:54.458906  6648 credentials.hpp:37] Loading credentials for authentication from
'/tmp/Endpoint_SlaveEndpointTest_UnauthorizedRequest_2_kffWPQ/http_credentials'
I1013 12:02:54.459131  6648 http.cpp:1045] Creating default 'basic' HTTP authenticator for
realm 'mesos-agent-readonly'
I1013 12:02:54.459316  6648 http.cpp:1045] Creating default 'basic' HTTP authenticator for
realm 'mesos-agent-readwrite'
I1013 12:02:54.460649  6648 slave.cpp:585] Agent resources: [{"name":"cpus","scalar":{"value":2.0},"type":"SCALAR"},{"name":"mem","scalar":{"value":1024.0},"type":"SCALAR"},{"name":"disk","scalar":{"value":1024.0},"type":"SCALAR"},{"name":"ports","ranges":{"range":[{"begin":31000,"end":32000}]},"type":"RANGES"}]
I1013 12:02:54.460865  6648 slave.cpp:593] Agent attributes: [  ]
I1013 12:02:54.460880  6648 slave.cpp:602] Agent hostname: 47e20b76d3c5
I1013 12:02:54.461006  6660 status_update_manager.cpp:177] Pausing sending status updates
I1013 12:02:54.462515  6649 state.cpp:64] Recovering state from '/tmp/Endpoint_SlaveEndpointTest_UnauthorizedRequest_2_x7beaC/meta'
I1013 12:02:54.462775  6646 status_update_manager.cpp:203] Recovering status update manager
I1013 12:02:54.462949  6663 containerizer.cpp:648] Recovering containerizer
I1013 12:02:54.464152  6653 provisioner.cpp:416] Provisioner recovery complete
I1013 12:02:54.464483  6652 slave.cpp:6310] Finished recovery
I1013 12:02:54.464977  6652 slave.cpp:6492] Querying resource estimator for oversubscribable
resources
I1013 12:02:54.465214  6654 slave.cpp:6506] Received oversubscribable resources {} from the
resource estimator
I1013 12:02:54.467947  6656 process.cpp:3929] Handling HTTP event for process 'slave(821)'
with path: '/slave(821)/containers'
I1013 12:02:54.469494  6653 http.cpp:1185] HTTP GET for /slave(821)/containers from 172.17.0.3:33320
I1013 12:02:54.469576  6653 http.cpp:976] Authorizing principal 'test-principal' to GET the
'/containers' endpoint
I1013 12:02:54.471192  6640 slave.cpp:869] Agent terminating
[       OK ] Endpoint/SlaveEndpointTest.UnauthorizedRequest/2 (27 ms)
[ RUN      ] Endpoint/SlaveEndpointTest.NoAuthorizer/0
I1013 12:02:54.481911  6640 containerizer.cpp:292] Using isolation { environment_secret, posix/cpu,
posix/mem, filesystem/posix, network/cni }
W1013 12:02:54.482386  6640 backend.cpp:76] Failed to create 'aufs' backend: AufsBackend requires
root privileges
W1013 12:02:54.482496  6640 backend.cpp:76] Failed to create 'bind' backend: BindBackend requires
root privileges
I1013 12:02:54.482528  6640 provisioner.cpp:255] Using default backend 'copy'
I1013 12:02:54.484074  6640 cluster.cpp:448] Creating default 'local' authorizer
I1013 12:02:54.485940  6655 slave.cpp:254] Mesos agent started on (822)@172.17.0.3:35239
I1013 12:02:54.485961  6655 slave.cpp:255] Flags at startup: --acls="" --appc_simple_discovery_uri_prefix="http://"
--appc_store_dir="/tmp/Endpoint_SlaveEndpointTest_NoAuthorizer_0_x1CJKN/store/appc" --authenticate_http_readonly="true"
--authenticate_http_readwrite="true" --authenticatee="crammd5" --authentication_backoff_factor="1secs"
--authorizer="local" --cgroups_cpu_enable_pids_and_tids_count="false" --cgroups_enable_cfs="false"
--cgroups_hierarchy="/sys/fs/cgroup" --cgroups_limit_swap="false" --cgroups_root="mesos" --container_disk_watch_interval="15secs"
--containerizers="mesos" --credential="/tmp/Endpoint_SlaveEndpointTest_NoAuthorizer_0_x1CJKN/credential"
--default_role="*" --disallow_sharing_agent_pid_namespace="false" --disk_watch_interval="1mins"
--docker="docker" --docker_kill_orphans="true" --docker_registry="https://registry-1.docker.io"
--docker_remove_delay="6hrs" --docker_socket="/var/run/docker.sock" --docker_stop_timeout="0ns"
--docker_store_dir="/tmp/Endpoint_SlaveEndpointTest_NoAuthorizer_0_x1CJKN/store/docker" --docker_volume_checkpoint_dir="/var/run/mesos/isolators/docker/volume"
--enforce_container_disk_quota="false" --executor_registration_timeout="1mins" --executor_reregistration_timeout="2secs"
--executor_shutdown_grace_period="5secs" --fetcher_cache_dir="/tmp/Endpoint_SlaveEndpointTest_NoAuthorizer_0_x1CJKN/fetch"
--fetcher_cache_size="2GB" --frameworks_home="" --gc_delay="1weeks" --gc_disk_headroom="0.1"
--hadoop_home="" --help="false" --hostname_lookup="true" --http_command_executor="false" --http_credentials="/tmp/Endpoint_SlaveEndpointTest_NoAuthorizer_0_x1CJKN/http_credentials"
--http_heartbeat_interval="30secs" --initialize_driver_logging="true" --isolation="posix/cpu,posix/mem"
--launcher="posix" --launcher_dir="/mesos/mesos-1.5.0/_build/src" --logbufsecs="0" --logging_level="INFO"
--max_completed_executors_per_framework="150" --oversubscribed_resources_interval="15secs"
--perf_duration="10secs" --perf_interval="1mins" --port="5051" --qos_correction_interval_min="0ns"
--quiet="false" --recover="reconnect" --recovery_timeout="15mins" --registration_backoff_factor="10ms"
--resources="cpus:2;gpus:0;mem:1024;disk:1024;ports:[31000-32000]" --revocable_cpu_low_priority="true"
--runtime_dir="/tmp/Endpoint_SlaveEndpointTest_NoAuthorizer_0_x1CJKN" --sandbox_directory="/mnt/mesos/sandbox"
--strict="true" --switch_user="true" --systemd_enable_support="true" --systemd_runtime_directory="/run/systemd/system"
--version="false" --work_dir="/tmp/Endpoint_SlaveEndpointTest_NoAuthorizer_0_28eV0y" --zk_session_timeout="10secs"
I1013 12:02:54.486344  6655 credentials.hpp:86] Loading credential for authentication from
'/tmp/Endpoint_SlaveEndpointTest_NoAuthorizer_0_x1CJKN/credential'
I1013 12:02:54.486618  6655 slave.cpp:287] Agent using credential for: test-principal
I1013 12:02:54.486639  6655 credentials.hpp:37] Loading credentials for authentication from
'/tmp/Endpoint_SlaveEndpointTest_NoAuthorizer_0_x1CJKN/http_credentials'
I1013 12:02:54.487057  6655 http.cpp:1045] Creating default 'basic' HTTP authenticator for
realm 'mesos-agent-readonly'
I1013 12:02:54.487289  6655 http.cpp:1045] Creating default 'basic' HTTP authenticator for
realm 'mesos-agent-readwrite'
I1013 12:02:54.488632  6655 slave.cpp:585] Agent resources: [{"name":"cpus","scalar":{"value":2.0},"type":"SCALAR"},{"name":"mem","scalar":{"value":1024.0},"type":"SCALAR"},{"name":"disk","scalar":{"value":1024.0},"type":"SCALAR"},{"name":"ports","ranges":{"range":[{"begin":31000,"end":32000}]},"type":"RANGES"}]
I1013 12:02:54.488844  6655 slave.cpp:593] Agent attributes: [  ]
I1013 12:02:54.488860  6655 slave.cpp:602] Agent hostname: 47e20b76d3c5
I1013 12:02:54.489017  6650 status_update_manager.cpp:177] Pausing sending status updates
I1013 12:02:54.490463  6642 state.cpp:64] Recovering state from '/tmp/Endpoint_SlaveEndpointTest_NoAuthorizer_0_28eV0y/meta'
I1013 12:02:54.490721  6648 status_update_manager.cpp:203] Recovering status update manager
I1013 12:02:54.490883  6662 containerizer.cpp:648] Recovering containerizer
I1013 12:02:54.492264  6663 provisioner.cpp:416] Provisioner recovery complete
I1013 12:02:54.492622  6656 slave.cpp:6310] Finished recovery
I1013 12:02:54.493057  6656 slave.cpp:6492] Querying resource estimator for oversubscribable
resources
I1013 12:02:54.493326  6645 slave.cpp:6506] Received oversubscribable resources {} from the
resource estimator
I1013 12:02:54.495798  6654 process.cpp:3929] Handling HTTP event for process 'slave(822)'
with path: '/slave(822)/monitor/statistics'
I1013 12:02:54.496887  6659 http.cpp:1185] HTTP GET for /slave(822)/monitor/statistics from
172.17.0.3:33322
I1013 12:02:54.496953  6659 http.cpp:976] Authorizing principal 'test-principal' to GET the
'/monitor/statistics' endpoint
I1013 12:02:54.499321  6646 slave.cpp:869] Agent terminating
[       OK ] Endpoint/SlaveEndpointTest.NoAuthorizer/0 (28 ms)
[ RUN      ] Endpoint/SlaveEndpointTest.NoAuthorizer/1
I1013 12:02:54.509176  6640 containerizer.cpp:292] Using isolation { environment_secret, posix/cpu,
posix/mem, filesystem/posix, network/cni }
W1013 12:02:54.509605  6640 backend.cpp:76] Failed to create 'aufs' backend: AufsBackend requires
root privileges
W1013 12:02:54.509699  6640 backend.cpp:76] Failed to create 'bind' backend: BindBackend requires
root privileges
I1013 12:02:54.509728  6640 provisioner.cpp:255] Using default backend 'copy'
I1013 12:02:54.511118  6640 cluster.cpp:448] Creating default 'local' authorizer
I1013 12:02:54.512773  6649 slave.cpp:254] Mesos agent started on (823)@172.17.0.3:35239
I1013 12:02:54.512799  6649 slave.cpp:255] Flags at startup: --acls="" --appc_simple_discovery_uri_prefix="http://"
--appc_store_dir="/tmp/Endpoint_SlaveEndpointTest_NoAuthorizer_1_CaKZVK/store/appc" --authenticate_http_readonly="true"
--authenticate_http_readwrite="true" --authenticatee="crammd5" --authentication_backoff_factor="1secs"
--authorizer="local" --cgroups_cpu_enable_pids_and_tids_count="false" --cgroups_enable_cfs="false"
--cgroups_hierarchy="/sys/fs/cgroup" --cgroups_limit_swap="false" --cgroups_root="mesos" --container_disk_watch_interval="15secs"
--containerizers="mesos" --credential="/tmp/Endpoint_SlaveEndpointTest_NoAuthorizer_1_CaKZVK/credential"
--default_role="*" --disallow_sharing_agent_pid_namespace="false" --disk_watch_interval="1mins"
--docker="docker" --docker_kill_orphans="true" --docker_registry="https://registry-1.docker.io"
--docker_remove_delay="6hrs" --docker_socket="/var/run/docker.sock" --docker_stop_timeout="0ns"
--docker_store_dir="/tmp/Endpoint_SlaveEndpointTest_NoAuthorizer_1_CaKZVK/store/docker" --docker_volume_checkpoint_dir="/var/run/mesos/isolators/docker/volume"
--enforce_container_disk_quota="false" --executor_registration_timeout="1mins" --executor_reregistration_timeout="2secs"
--executor_shutdown_grace_period="5secs" --fetcher_cache_dir="/tmp/Endpoint_SlaveEndpointTest_NoAuthorizer_1_CaKZVK/fetch"
--fetcher_cache_size="2GB" --frameworks_home="" --gc_delay="1weeks" --gc_disk_headroom="0.1"
--hadoop_home="" --help="false" --hostname_lookup="true" --http_command_executor="false" --http_credentials="/tmp/Endpoint_SlaveEndpointTest_NoAuthorizer_1_CaKZVK/http_credentials"
--http_heartbeat_interval="30secs" --initialize_driver_logging="true" --isolation="posix/cpu,posix/mem"
--launcher="posix" --launcher_dir="/mesos/mesos-1.5.0/_build/src" --logbufsecs="0" --logging_level="INFO"
--max_completed_executors_per_framework="150" --oversubscribed_resources_interval="15secs"
--perf_duration="10secs" --perf_interval="1mins" --port="5051" --qos_correction_interval_min="0ns"
--quiet="false" --recover="reconnect" --recovery_timeout="15mins" --registration_backoff_factor="10ms"
--resources="cpus:2;gpus:0;mem:1024;disk:1024;ports:[31000-32000]" --revocable_cpu_low_priority="true"
--runtime_dir="/tmp/Endpoint_SlaveEndpointTest_NoAuthorizer_1_CaKZVK" --sandbox_directory="/mnt/mesos/sandbox"
--strict="true" --switch_user="true" --systemd_enable_support="true" --systemd_runtime_directory="/run/systemd/system"
--version="false" --work_dir="/tmp/Endpoint_SlaveEndpointTest_NoAuthorizer_1_xSi67v" --zk_session_timeout="10secs"
I1013 12:02:54.513291  6649 credentials.hpp:86] Loading credential for authentication from
'/tmp/Endpoint_SlaveEndpointTest_NoAuthorizer_1_CaKZVK/credential'
I1013 12:02:54.513417  6649 slave.cpp:287] Agent using credential for: test-principal
I1013 12:02:54.513437  6649 credentials.hpp:37] Loading credentials for authentication from
'/tmp/Endpoint_SlaveEndpointTest_NoAuthorizer_1_CaKZVK/http_credentials'
I1013 12:02:54.513721  6649 http.cpp:1045] Creating default 'basic' HTTP authenticator for
realm 'mesos-agent-readonly'
I1013 12:02:54.513944  6649 http.cpp:1045] Creating default 'basic' HTTP authenticator for
realm 'mesos-agent-readwrite'
I1013 12:02:54.515718  6649 slave.cpp:585] Agent resources: [{"name":"cpus","scalar":{"value":2.0},"type":"SCALAR"},{"name":"mem","scalar":{"value":1024.0},"type":"SCALAR"},{"name":"disk","scalar":{"value":1024.0},"type":"SCALAR"},{"name":"ports","ranges":{"range":[{"begin":31000,"end":32000}]},"type":"RANGES"}]
I1013 12:02:54.515918  6649 slave.cpp:593] Agent attributes: [  ]
I1013 12:02:54.515931  6649 slave.cpp:602] Agent hostname: 47e20b76d3c5
I1013 12:02:54.516036  6659 status_update_manager.cpp:177] Pausing sending status updates
I1013 12:02:54.517247  6658 state.cpp:64] Recovering state from '/tmp/Endpoint_SlaveEndpointTest_NoAuthorizer_1_xSi67v/meta'
I1013 12:02:54.517455  6658 status_update_manager.cpp:203] Recovering status update manager
I1013 12:02:54.517616  6661 containerizer.cpp:648] Recovering containerizer
I1013 12:02:54.518676  6651 provisioner.cpp:416] Provisioner recovery complete
I1013 12:02:54.518929  6659 slave.cpp:6310] Finished recovery
I1013 12:02:54.519351  6659 slave.cpp:6492] Querying resource estimator for oversubscribable
resources
I1013 12:02:54.519577  6656 slave.cpp:6506] Received oversubscribable resources {} from the
resource estimator
I1013 12:02:54.521781  6664 process.cpp:3929] Handling HTTP event for process 'slave(823)'
with path: '/slave(823)/monitor/statistics.json'
I1013 12:02:54.522817  6644 http.cpp:1185] HTTP GET for /slave(823)/monitor/statistics.json
from 172.17.0.3:33330
I1013 12:02:54.522881  6644 http.cpp:976] Authorizing principal 'test-principal' to GET the
'/monitor/statistics.json' endpoint
I1013 12:02:54.525341  6648 slave.cpp:869] Agent terminating
[       OK ] Endpoint/SlaveEndpointTest.NoAuthorizer/1 (26 ms)
[ RUN      ] Endpoint/SlaveEndpointTest.NoAuthorizer/2
I1013 12:02:54.535344  6640 containerizer.cpp:292] Using isolation { environment_secret, posix/cpu,
posix/mem, filesystem/posix, network/cni }
W1013 12:02:54.535786  6640 backend.cpp:76] Failed to create 'aufs' backend: AufsBackend requires
root privileges
W1013 12:02:54.535884  6640 backend.cpp:76] Failed to create 'bind' backend: BindBackend requires
root privileges
I1013 12:02:54.535914  6640 provisioner.cpp:255] Using default backend 'copy'
I1013 12:02:54.537343  6640 cluster.cpp:448] Creating default 'local' authorizer
I1013 12:02:54.539031  6641 slave.cpp:254] Mesos agent started on (824)@172.17.0.3:35239
I1013 12:02:54.539050  6641 slave.cpp:255] Flags at startup: --acls="" --appc_simple_discovery_uri_prefix="http://"
--appc_store_dir="/tmp/Endpoint_SlaveEndpointTest_NoAuthorizer_2_cQkSmI/store/appc" --authenticate_http_readonly="true"
--authenticate_http_readwrite="true" --authenticatee="crammd5" --authentication_backoff_factor="1secs"
--authorizer="local" --cgroups_cpu_enable_pids_and_tids_count="false" --cgroups_enable_cfs="false"
--cgroups_hierarchy="/sys/fs/cgroup" --cgroups_limit_swap="false" --cgroups_root="mesos" --container_disk_watch_interval="15secs"
--containerizers="mesos" --credential="/tmp/Endpoint_SlaveEndpointTest_NoAuthorizer_2_cQkSmI/credential"
--default_role="*" --disallow_sharing_agent_pid_namespace="false" --disk_watch_interval="1mins"
--docker="docker" --docker_kill_orphans="true" --docker_registry="https://registry-1.docker.io"
--docker_remove_delay="6hrs" --docker_socket="/var/run/docker.sock" --docker_stop_timeout="0ns"
--docker_store_dir="/tmp/Endpoint_SlaveEndpointTest_NoAuthorizer_2_cQkSmI/store/docker" --docker_volume_checkpoint_dir="/var/run/mesos/isolators/docker/volume"
--enforce_container_disk_quota="false" --executor_registration_timeout="1mins" --executor_reregistration_timeout="2secs"
--executor_shutdown_grace_period="5secs" --fetcher_cache_dir="/tmp/Endpoint_SlaveEndpointTest_NoAuthorizer_2_cQkSmI/fetch"
--fetcher_cache_size="2GB" --frameworks_home="" --gc_delay="1weeks" --gc_disk_headroom="0.1"
--hadoop_home="" --help="false" --hostname_lookup="true" --http_command_executor="false" --http_credentials="/tmp/Endpoint_SlaveEndpointTest_NoAuthorizer_2_cQkSmI/http_credentials"
--http_heartbeat_interval="30secs" --initialize_driver_logging="true" --isolation="posix/cpu,posix/mem"
--launcher="posix" --launcher_dir="/mesos/mesos-1.5.0/_build/src" --logbufsecs="0" --logging_level="INFO"
--max_completed_executors_per_framework="150" --oversubscribed_resources_interval="15secs"
--perf_duration="10secs" --perf_interval="1mins" --port="5051" --qos_correction_interval_min="0ns"
--quiet="false" --recover="reconnect" --recovery_timeout="15mins" --registration_backoff_factor="10ms"
--resources="cpus:2;gpus:0;mem:1024;disk:1024;ports:[31000-32000]" --revocable_cpu_low_priority="true"
--runtime_dir="/tmp/Endpoint_SlaveEndpointTest_NoAuthorizer_2_cQkSmI" --sandbox_directory="/mnt/mesos/sandbox"
--strict="true" --switch_user="true" --systemd_enable_support="true" --systemd_runtime_directory="/run/systemd/system"
--version="false" --work_dir="/tmp/Endpoint_SlaveEndpointTest_NoAuthorizer_2_BYU4ut" --zk_session_timeout="10secs"
I1013 12:02:54.539397  6641 credentials.hpp:86] Loading credential for authentication from
'/tmp/Endpoint_SlaveEndpointTest_NoAuthorizer_2_cQkSmI/credential'
I1013 12:02:54.539533  6641 slave.cpp:287] Agent using credential for: test-principal
I1013 12:02:54.539553  6641 credentials.hpp:37] Loading credentials for authentication from
'/tmp/Endpoint_SlaveEndpointTest_NoAuthorizer_2_cQkSmI/http_credentials'
I1013 12:02:54.539764  6641 http.cpp:1045] Creating default 'basic' HTTP authenticator for
realm 'mesos-agent-readonly'
I1013 12:02:54.539901  6641 http.cpp:1045] Creating default 'basic' HTTP authenticator for
realm 'mesos-agent-readwrite'
I1013 12:02:54.541139  6641 slave.cpp:585] Agent resources: [{"name":"cpus","scalar":{"value":2.0},"type":"SCALAR"},{"name":"mem","scalar":{"value":1024.0},"type":"SCALAR"},{"name":"disk","scalar":{"value":1024.0},"type":"SCALAR"},{"name":"ports","ranges":{"range":[{"begin":31000,"end":32000}]},"type":"RANGES"}]
I1013 12:02:54.541342  6641 slave.cpp:593] Agent attributes: [  ]
I1013 12:02:54.541357  6641 slave.cpp:602] Agent hostname: 47e20b76d3c5
I1013 12:02:54.541455  6648 status_update_manager.cpp:177] Pausing sending status updates
I1013 12:02:54.542723  6663 state.cpp:64] Recovering state from '/tmp/Endpoint_SlaveEndpointTest_NoAuthorizer_2_BYU4ut/meta'
I1013 12:02:54.542964  6654 status_update_manager.cpp:203] Recovering status update manager
I1013 12:02:54.543187  6653 containerizer.cpp:648] Recovering containerizer
I1013 12:02:54.544230  6651 provisioner.cpp:416] Provisioner recovery complete
I1013 12:02:54.544481  6648 slave.cpp:6310] Finished recovery
I1013 12:02:54.544831  6648 slave.cpp:6492] Querying resource estimator for oversubscribable
resources
I1013 12:02:54.545040  6657 slave.cpp:6506] Received oversubscribable resources {} from the
resource estimator
I1013 12:02:54.546892  6662 process.cpp:3929] Handling HTTP event for process 'slave(824)'
with path: '/slave(824)/containers'
I1013 12:02:54.547849  6652 http.cpp:1185] HTTP GET for /slave(824)/containers from 172.17.0.3:33332
I1013 12:02:54.547909  6652 http.cpp:976] Authorizing principal 'test-principal' to GET the
'/containers' endpoint
I1013 12:02:54.550751  6640 slave.cpp:869] Agent terminating
[       OK ] Endpoint/SlaveEndpointTest.NoAuthorizer/2 (25 ms)
[----------] 9 tests from Endpoint/SlaveEndpointTest (231 ms total)

[----------] 2 tests from ContainerizerType/DefaultContainerDNSFlagTest
[ RUN      ] ContainerizerType/DefaultContainerDNSFlagTest.ValidateFlag/0
[       OK ] ContainerizerType/DefaultContainerDNSFlagTest.ValidateFlag/0 (9 ms)
[ RUN      ] ContainerizerType/DefaultContainerDNSFlagTest.ValidateFlag/1
[       OK ] ContainerizerType/DefaultContainerDNSFlagTest.ValidateFlag/1 (9 ms)
[----------] 2 tests from ContainerizerType/DefaultContainerDNSFlagTest (18 ms total)

[----------] Global test environment tear-down
[==========] 1692 tests from 185 test cases ran. (438946 ms total)
[  PASSED  ] 1691 tests.
[  FAILED  ] 1 test, listed below:
[  FAILED  ] ExamplesTest.PythonFramework

 1 FAILED TEST
  YOU HAVE 21 DISABLED TESTS

I1013 12:02:54.626003  6665 process.cpp:1068] Failed to accept socket: future discarded
make[4]: *** [check-local] Error 1
make[4]: Leaving directory `/mesos/mesos-1.5.0/_build/src'
make[3]: *** [check-am] Error 2
make[3]: Leaving directory `/mesos/mesos-1.5.0/_build/src'
make[2]: *** [check] Error 2
make[2]: Leaving directory `/mesos/mesos-1.5.0/_build/src'
make[1]: *** [check-recursive] Error 1
make[1]: Leaving directory `/mesos/mesos-1.5.0/_build'
make: *** [distcheck] Error 1
+ docker rmi mesos-1507893735-19561
Untagged: mesos-1507893735-19561:latest
Deleted: sha256:43c04bd12c2963602b0b7c0d41392b5f375c9a35eed7985630e2e10c9b9956f8
Deleted: sha256:2ac98c47fd9a5f16c545ef264bfa2989fca3c7c3f05c7e2156fb955344d89247
Deleted: sha256:0f0cfa24d7b03bf049ebc8d5b6d4e8cde2c8545cc047166adf5862a65c86b159
Deleted: sha256:57524dc3a1f627e36abdc09e8f5d026a4706fd6c41b97f8ed2b0a200cedfe657
Deleted: sha256:aaa379e00f5d8381f842e82da1be1c64b44ad681313ab5b0b08c990df670f0df
Deleted: sha256:1b3e5d14c325f10708946fa85b262caf0a97da04416f0b3ea8dc0f976f4a2a2e
Deleted: sha256:9f472f22b22c40c1d33226aa43e0aab988eeb1d9aff58ef01e8e521b8a0ac0e0
Deleted: sha256:dd7ef12841d81b0bfea3f76517919a81b1c236427711e12c2f23eae265ccae44
Deleted: sha256:b7aea2dc7f20ed01ea332d895bc3ed46eeb373547fec3cf9b244dd2c740e540e
Deleted: sha256:ae0003406746be2e135efc516c725c06499c48832353356ed020607f1530d842
Deleted: sha256:8419693d71594181e87f7e9af051c308e4ee4f59b2a43f0517922f825b25b324
Deleted: sha256:77842b7e14fb4a37b9a6a986b85c49ee07ecd739f9c6b8822dff84f787bf245d
Deleted: sha256:a10f3b0cf902fd26876108f7f4f966243ae0f7848ce0d491e3d860ed749ab8c5
Deleted: sha256:245cbbbf90d25066393d4bc76c058daff0cdbbe45ace64fbc33a46561201d3ec
Deleted: sha256:77dcacf656f4d0fd9c8638b13116bf2aaf859ef7d16600b0759f35c0f92b3584
Deleted: sha256:34fcf9c90d1be00fe4a6581c0ff564cfe4ab521dc8d6130b57bf24f9fc58d3e1
Deleted: sha256:f65004647d7d2f49ffd29f9c9b0305bf08fe7bc4447ce1a8fc42892233b5f9a5
Deleted: sha256:1937fa893911b68393e8a53461b0ca9613eb3222ccd3e30de9491cb9cfc83bb0
Deleted: sha256:0569f2092060ab7c3b4f412f0082ddf788c9921258bc7c9944ce8f5d838e3c26
Deleted: sha256:7b0aff960ccbf7b9be5d7a0231c4ac53c0e825c03722b93753dd2108fad8df2c
Deleted: sha256:5b4b316e8b3d55407dcedf45ff7362295546ed8bd675205f57f799fe30488748
Deleted: sha256:a5e15f9784e82a9ef8523d89234626749a47d5a9fa3d881e367c22feccaebbeb
Deleted: sha256:05aaff47f88376c2ec988bf33d66e775ce6e2e96373f6569e93b281588be8b16
Deleted: sha256:a511bac8a4cd09688a76698cdb47b5bf7661bd7ea614505df863881a6621db46
Deleted: sha256:9f3bb665ff92a78e5115b0e3572811dd9b686a4e185211dcaef4d3afea519e11
Deleted: sha256:15ea97db7e2d0c596e9c281ea0181f70ec5557f19f0b4e75d502c823955b000c
Deleted: sha256:50ff24f689ef51976d2943b2e139f63861641691afe1f987d5861d354bd34783
Deleted: sha256:3c954890c9bca52b441c924a9758428a67d7619106401c2c3be3369f358b00c1
Deleted: sha256:26411e63916f169c0cd5ed2edaf861b1ca25a8c0d11467a1f766944f01357b85
Build step 'Execute shell' marked build as failure


Mime
View raw message