mesos-builds mailing list archives

Site index · List index
Message view « Date » · « Thread »
Top « Date » · « Thread »
From Apache Jenkins Server <jenk...@builds.apache.org>
Subject Build failed in Jenkins: Mesos-Buildbot » autotools,gcc,--verbose --disable-libtool-wrappers --enable-libevent --enable-ssl,GLOG_v=1 MESOS_VERBOSE=1,centos:7,(ubuntu)&&(!ubuntu-us1)&&(!ubuntu-eu2)&&(!qnode3)&&(!H23) #4320
Date Fri, 13 Oct 2017 13:14:30 GMT
See <https://builds.apache.org/job/Mesos-Buildbot/BUILDTOOL=autotools,COMPILER=gcc,CONFIGURATION=--verbose%20--disable-libtool-wrappers%20--enable-libevent%20--enable-ssl,ENVIRONMENT=GLOG_v=1%20MESOS_VERBOSE=1,OS=centos%3A7,label_exp=(ubuntu)&&(!ubuntu-us1)&&(!ubuntu-eu2)&&(!qnode3)&&(!H23)/4320/display/redirect>

------------------------------------------
[...truncated 33.01 MB...]
I1013 13:14:16.402933 19220 credentials.hpp:37] Loading credentials for authentication from
'/tmp/Endpoint_SlaveEndpointTest_UnauthorizedRequest_0_b9j9JB/http_credentials'
I1013 13:14:16.403246 19220 http.cpp:1045] Creating default 'basic' HTTP authenticator for
realm 'mesos-agent-executor'
I1013 13:14:16.403381 19220 http.cpp:1066] Creating default 'jwt' HTTP authenticator for realm
'mesos-agent-executor'
I1013 13:14:16.403584 19220 http.cpp:1045] Creating default 'basic' HTTP authenticator for
realm 'mesos-agent-readonly'
I1013 13:14:16.403712 19220 http.cpp:1066] Creating default 'jwt' HTTP authenticator for realm
'mesos-agent-readonly'
I1013 13:14:16.403918 19220 http.cpp:1045] Creating default 'basic' HTTP authenticator for
realm 'mesos-agent-readwrite'
I1013 13:14:16.404036 19220 http.cpp:1066] Creating default 'jwt' HTTP authenticator for realm
'mesos-agent-readwrite'
I1013 13:14:16.405516 19220 slave.cpp:585] Agent resources: [{"name":"cpus","scalar":{"value":2.0},"type":"SCALAR"},{"name":"mem","scalar":{"value":1024.0},"type":"SCALAR"},{"name":"disk","scalar":{"value":1024.0},"type":"SCALAR"},{"name":"ports","ranges":{"range":[{"begin":31000,"end":32000}]},"type":"RANGES"}]
I1013 13:14:16.405745 19220 slave.cpp:593] Agent attributes: [  ]
I1013 13:14:16.405760 19220 slave.cpp:602] Agent hostname: 6c28fac2b09a
I1013 13:14:16.405918 19228 status_update_manager.cpp:177] Pausing sending status updates
I1013 13:14:16.407304 19214 state.cpp:64] Recovering state from '/tmp/Endpoint_SlaveEndpointTest_UnauthorizedRequest_0_sPpsKD/meta'
I1013 13:14:16.407532 19214 status_update_manager.cpp:203] Recovering status update manager
I1013 13:14:16.407701 19216 containerizer.cpp:648] Recovering containerizer
I1013 13:14:16.408941 19212 provisioner.cpp:416] Provisioner recovery complete
I1013 13:14:16.409277 19210 slave.cpp:6310] Finished recovery
I1013 13:14:16.409693 19210 slave.cpp:6492] Querying resource estimator for oversubscribable
resources
I1013 13:14:16.409890 19214 slave.cpp:6506] Received oversubscribable resources {} from the
resource estimator
I1013 13:14:16.411846 19215 process.cpp:3929] Handling HTTP event for process 'slave(825)'
with path: '/slave(825)/monitor/statistics'
I1013 13:14:16.413754 19218 http.cpp:1185] HTTP GET for /slave(825)/monitor/statistics from
172.17.0.3:58646
I1013 13:14:16.413821 19218 http.cpp:976] Authorizing principal 'test-principal' to GET the
'/monitor/statistics' endpoint
I1013 13:14:16.416143 19219 slave.cpp:869] Agent terminating
[       OK ] Endpoint/SlaveEndpointTest.UnauthorizedRequest/0 (28 ms)
[ RUN      ] Endpoint/SlaveEndpointTest.UnauthorizedRequest/1
I1013 13:14:16.426846  9515 containerizer.cpp:292] Using isolation { environment_secret, posix/cpu,
posix/mem, filesystem/posix, network/cni }
W1013 13:14:16.427314  9515 backend.cpp:76] Failed to create 'aufs' backend: AufsBackend requires
root privileges
W1013 13:14:16.427420  9515 backend.cpp:76] Failed to create 'bind' backend: BindBackend requires
root privileges
I1013 13:14:16.427453  9515 provisioner.cpp:255] Using default backend 'copy'
I1013 13:14:16.430810 19211 slave.cpp:254] Mesos agent started on (826)@172.17.0.3:33868
I1013 13:14:16.430835 19211 slave.cpp:255] Flags at startup: --acls="" --appc_simple_discovery_uri_prefix="http://"
--appc_store_dir="/tmp/Endpoint_SlaveEndpointTest_UnauthorizedRequest_1_pL1nXt/store/appc"
--authenticate_http_executors="true" --authenticate_http_readonly="true" --authenticate_http_readwrite="true"
--authenticatee="crammd5" --authentication_backoff_factor="1secs" --authorizer="local" --cgroups_cpu_enable_pids_and_tids_count="false"
--cgroups_enable_cfs="false" --cgroups_hierarchy="/sys/fs/cgroup" --cgroups_limit_swap="false"
--cgroups_root="mesos" --container_disk_watch_interval="15secs" --containerizers="mesos" --credential="/tmp/Endpoint_SlaveEndpointTest_UnauthorizedRequest_1_pL1nXt/credential"
--default_role="*" --disallow_sharing_agent_pid_namespace="false" --disk_watch_interval="1mins"
--docker="docker" --docker_kill_orphans="true" --docker_registry="https://registry-1.docker.io"
--docker_remove_delay="6hrs" --docker_socket="/var/run/docker.sock" --docker_stop_timeout="0ns"
--docker_store_dir="/tmp/Endpoint_SlaveEndpointTest_UnauthorizedRequest_1_pL1nXt/store/docker"
--docker_volume_checkpoint_dir="/var/run/mesos/isolators/docker/volume" --enforce_container_disk_quota="false"
--executor_registration_timeout="1mins" --executor_reregistration_timeout="2secs" --executor_secret_key="/tmp/Endpoint_SlaveEndpointTest_UnauthorizedRequest_1_pL1nXt/executor_secret_key"
--executor_shutdown_grace_period="5secs" --fetcher_cache_dir="/tmp/Endpoint_SlaveEndpointTest_UnauthorizedRequest_1_pL1nXt/fetch"
--fetcher_cache_size="2GB" --frameworks_home="" --gc_delay="1weeks" --gc_disk_headroom="0.1"
--hadoop_home="" --help="false" --hostname_lookup="true" --http_command_executor="false" --http_credentials="/tmp/Endpoint_SlaveEndpointTest_UnauthorizedRequest_1_pL1nXt/http_credentials"
--http_heartbeat_interval="30secs" --initialize_driver_logging="true" --isolation="posix/cpu,posix/mem"
--launcher="posix" --launcher_dir="/mesos/mesos-1.5.0/_build/src" --logbufsecs="0" --logging_level="INFO"
--max_completed_executors_per_framework="150" --oversubscribed_resources_interval="15secs"
--perf_duration="10secs" --perf_interval="1mins" --port="5051" --qos_correction_interval_min="0ns"
--quiet="false" --recover="reconnect" --recovery_timeout="15mins" --registration_backoff_factor="10ms"
--resources="cpus:2;gpus:0;mem:1024;disk:1024;ports:[31000-32000]" --revocable_cpu_low_priority="true"
--runtime_dir="/tmp/Endpoint_SlaveEndpointTest_UnauthorizedRequest_1_pL1nXt" --sandbox_directory="/mnt/mesos/sandbox"
--strict="true" --switch_user="true" --systemd_enable_support="true" --systemd_runtime_directory="/run/systemd/system"
--version="false" --work_dir="/tmp/Endpoint_SlaveEndpointTest_UnauthorizedRequest_1_QC9rTv"
--zk_session_timeout="10secs"
I1013 13:14:16.431213 19211 credentials.hpp:86] Loading credential for authentication from
'/tmp/Endpoint_SlaveEndpointTest_UnauthorizedRequest_1_pL1nXt/credential'
I1013 13:14:16.431370 19211 slave.cpp:287] Agent using credential for: test-principal
I1013 13:14:16.431391 19211 credentials.hpp:37] Loading credentials for authentication from
'/tmp/Endpoint_SlaveEndpointTest_UnauthorizedRequest_1_pL1nXt/http_credentials'
I1013 13:14:16.431666 19211 http.cpp:1045] Creating default 'basic' HTTP authenticator for
realm 'mesos-agent-executor'
I1013 13:14:16.431789 19211 http.cpp:1066] Creating default 'jwt' HTTP authenticator for realm
'mesos-agent-executor'
I1013 13:14:16.431993 19211 http.cpp:1045] Creating default 'basic' HTTP authenticator for
realm 'mesos-agent-readonly'
I1013 13:14:16.432093 19211 http.cpp:1066] Creating default 'jwt' HTTP authenticator for realm
'mesos-agent-readonly'
I1013 13:14:16.432278 19211 http.cpp:1045] Creating default 'basic' HTTP authenticator for
realm 'mesos-agent-readwrite'
I1013 13:14:16.432385 19211 http.cpp:1066] Creating default 'jwt' HTTP authenticator for realm
'mesos-agent-readwrite'
I1013 13:14:16.433815 19211 slave.cpp:585] Agent resources: [{"name":"cpus","scalar":{"value":2.0},"type":"SCALAR"},{"name":"mem","scalar":{"value":1024.0},"type":"SCALAR"},{"name":"disk","scalar":{"value":1024.0},"type":"SCALAR"},{"name":"ports","ranges":{"range":[{"begin":31000,"end":32000}]},"type":"RANGES"}]
I1013 13:14:16.434164 19211 slave.cpp:593] Agent attributes: [  ]
I1013 13:14:16.434190 19211 slave.cpp:602] Agent hostname: 6c28fac2b09a
I1013 13:14:16.434412 19221 status_update_manager.cpp:177] Pausing sending status updates
I1013 13:14:16.436184 19206 state.cpp:64] Recovering state from '/tmp/Endpoint_SlaveEndpointTest_UnauthorizedRequest_1_QC9rTv/meta'
I1013 13:14:16.436436 19218 status_update_manager.cpp:203] Recovering status update manager
I1013 13:14:16.436707 19223 containerizer.cpp:648] Recovering containerizer
I1013 13:14:16.437940 19210 provisioner.cpp:416] Provisioner recovery complete
I1013 13:14:16.438309 19225 slave.cpp:6310] Finished recovery
I1013 13:14:16.438745 19225 slave.cpp:6492] Querying resource estimator for oversubscribable
resources
I1013 13:14:16.438972 19214 slave.cpp:6506] Received oversubscribable resources {} from the
resource estimator
I1013 13:14:16.440902 19228 process.cpp:3929] Handling HTTP event for process 'slave(826)'
with path: '/slave(826)/monitor/statistics.json'
I1013 13:14:16.442529 19210 http.cpp:1185] HTTP GET for /slave(826)/monitor/statistics.json
from 172.17.0.3:58648
I1013 13:14:16.442593 19210 http.cpp:976] Authorizing principal 'test-principal' to GET the
'/monitor/statistics.json' endpoint
I1013 13:14:16.444555  9515 slave.cpp:869] Agent terminating
[       OK ] Endpoint/SlaveEndpointTest.UnauthorizedRequest/1 (27 ms)
[ RUN      ] Endpoint/SlaveEndpointTest.UnauthorizedRequest/2
I1013 13:14:16.455205  9515 containerizer.cpp:292] Using isolation { environment_secret, posix/cpu,
posix/mem, filesystem/posix, network/cni }
W1013 13:14:16.455714  9515 backend.cpp:76] Failed to create 'aufs' backend: AufsBackend requires
root privileges
W1013 13:14:16.455829  9515 backend.cpp:76] Failed to create 'bind' backend: BindBackend requires
root privileges
I1013 13:14:16.455862  9515 provisioner.cpp:255] Using default backend 'copy'
I1013 13:14:16.459237 19209 slave.cpp:254] Mesos agent started on (827)@172.17.0.3:33868
I1013 13:14:16.459259 19209 slave.cpp:255] Flags at startup: --acls="" --appc_simple_discovery_uri_prefix="http://"
--appc_store_dir="/tmp/Endpoint_SlaveEndpointTest_UnauthorizedRequest_2_de6Arm/store/appc"
--authenticate_http_executors="true" --authenticate_http_readonly="true" --authenticate_http_readwrite="true"
--authenticatee="crammd5" --authentication_backoff_factor="1secs" --authorizer="local" --cgroups_cpu_enable_pids_and_tids_count="false"
--cgroups_enable_cfs="false" --cgroups_hierarchy="/sys/fs/cgroup" --cgroups_limit_swap="false"
--cgroups_root="mesos" --container_disk_watch_interval="15secs" --containerizers="mesos" --credential="/tmp/Endpoint_SlaveEndpointTest_UnauthorizedRequest_2_de6Arm/credential"
--default_role="*" --disallow_sharing_agent_pid_namespace="false" --disk_watch_interval="1mins"
--docker="docker" --docker_kill_orphans="true" --docker_registry="https://registry-1.docker.io"
--docker_remove_delay="6hrs" --docker_socket="/var/run/docker.sock" --docker_stop_timeout="0ns"
--docker_store_dir="/tmp/Endpoint_SlaveEndpointTest_UnauthorizedRequest_2_de6Arm/store/docker"
--docker_volume_checkpoint_dir="/var/run/mesos/isolators/docker/volume" --enforce_container_disk_quota="false"
--executor_registration_timeout="1mins" --executor_reregistration_timeout="2secs" --executor_secret_key="/tmp/Endpoint_SlaveEndpointTest_UnauthorizedRequest_2_de6Arm/executor_secret_key"
--executor_shutdown_grace_period="5secs" --fetcher_cache_dir="/tmp/Endpoint_SlaveEndpointTest_UnauthorizedRequest_2_de6Arm/fetch"
--fetcher_cache_size="2GB" --frameworks_home="" --gc_delay="1weeks" --gc_disk_headroom="0.1"
--hadoop_home="" --help="false" --hostname_lookup="true" --http_command_executor="false" --http_credentials="/tmp/Endpoint_SlaveEndpointTest_UnauthorizedRequest_2_de6Arm/http_credentials"
--http_heartbeat_interval="30secs" --initialize_driver_logging="true" --isolation="posix/cpu,posix/mem"
--launcher="posix" --launcher_dir="/mesos/mesos-1.5.0/_build/src" --logbufsecs="0" --logging_level="INFO"
--max_completed_executors_per_framework="150" --oversubscribed_resources_interval="15secs"
--perf_duration="10secs" --perf_interval="1mins" --port="5051" --qos_correction_interval_min="0ns"
--quiet="false" --recover="reconnect" --recovery_timeout="15mins" --registration_backoff_factor="10ms"
--resources="cpus:2;gpus:0;mem:1024;disk:1024;ports:[31000-32000]" --revocable_cpu_low_priority="true"
--runtime_dir="/tmp/Endpoint_SlaveEndpointTest_UnauthorizedRequest_2_de6Arm" --sandbox_directory="/mnt/mesos/sandbox"
--strict="true" --switch_user="true" --systemd_enable_support="true" --systemd_runtime_directory="/run/systemd/system"
--version="false" --work_dir="/tmp/Endpoint_SlaveEndpointTest_UnauthorizedRequest_2_MyLrjo"
--zk_session_timeout="10secs"
I1013 13:14:16.459640 19209 credentials.hpp:86] Loading credential for authentication from
'/tmp/Endpoint_SlaveEndpointTest_UnauthorizedRequest_2_de6Arm/credential'
I1013 13:14:16.459794 19209 slave.cpp:287] Agent using credential for: test-principal
I1013 13:14:16.459815 19209 credentials.hpp:37] Loading credentials for authentication from
'/tmp/Endpoint_SlaveEndpointTest_UnauthorizedRequest_2_de6Arm/http_credentials'
I1013 13:14:16.460089 19209 http.cpp:1045] Creating default 'basic' HTTP authenticator for
realm 'mesos-agent-executor'
I1013 13:14:16.460203 19209 http.cpp:1066] Creating default 'jwt' HTTP authenticator for realm
'mesos-agent-executor'
I1013 13:14:16.460429 19209 http.cpp:1045] Creating default 'basic' HTTP authenticator for
realm 'mesos-agent-readonly'
I1013 13:14:16.460536 19209 http.cpp:1066] Creating default 'jwt' HTTP authenticator for realm
'mesos-agent-readonly'
I1013 13:14:16.460723 19209 http.cpp:1045] Creating default 'basic' HTTP authenticator for
realm 'mesos-agent-readwrite'
I1013 13:14:16.460819 19209 http.cpp:1066] Creating default 'jwt' HTTP authenticator for realm
'mesos-agent-readwrite'
I1013 13:14:16.462285 19209 slave.cpp:585] Agent resources: [{"name":"cpus","scalar":{"value":2.0},"type":"SCALAR"},{"name":"mem","scalar":{"value":1024.0},"type":"SCALAR"},{"name":"disk","scalar":{"value":1024.0},"type":"SCALAR"},{"name":"ports","ranges":{"range":[{"begin":31000,"end":32000}]},"type":"RANGES"}]
I1013 13:14:16.462512 19209 slave.cpp:593] Agent attributes: [  ]
I1013 13:14:16.462527 19209 slave.cpp:602] Agent hostname: 6c28fac2b09a
I1013 13:14:16.462674 19214 status_update_manager.cpp:177] Pausing sending status updates
I1013 13:14:16.464010 19210 state.cpp:64] Recovering state from '/tmp/Endpoint_SlaveEndpointTest_UnauthorizedRequest_2_MyLrjo/meta'
I1013 13:14:16.464275 19215 status_update_manager.cpp:203] Recovering status update manager
I1013 13:14:16.464468 19226 containerizer.cpp:648] Recovering containerizer
I1013 13:14:16.465775 19224 provisioner.cpp:416] Provisioner recovery complete
I1013 13:14:16.466202 19224 slave.cpp:6310] Finished recovery
I1013 13:14:16.466611 19224 slave.cpp:6492] Querying resource estimator for oversubscribable
resources
I1013 13:14:16.466853 19205 slave.cpp:6506] Received oversubscribable resources {} from the
resource estimator
I1013 13:14:16.468686 19222 process.cpp:3929] Handling HTTP event for process 'slave(827)'
with path: '/slave(827)/containers'
I1013 13:14:16.470274 19214 http.cpp:1185] HTTP GET for /slave(827)/containers from 172.17.0.3:58650
I1013 13:14:16.470338 19214 http.cpp:976] Authorizing principal 'test-principal' to GET the
'/containers' endpoint
I1013 13:14:16.472431 19208 slave.cpp:869] Agent terminating
[       OK ] Endpoint/SlaveEndpointTest.UnauthorizedRequest/2 (27 ms)
[ RUN      ] Endpoint/SlaveEndpointTest.NoAuthorizer/0
I1013 13:14:16.483094  9515 containerizer.cpp:292] Using isolation { environment_secret, posix/cpu,
posix/mem, filesystem/posix, network/cni }
W1013 13:14:16.483567  9515 backend.cpp:76] Failed to create 'aufs' backend: AufsBackend requires
root privileges
W1013 13:14:16.483674  9515 backend.cpp:76] Failed to create 'bind' backend: BindBackend requires
root privileges
I1013 13:14:16.483705  9515 provisioner.cpp:255] Using default backend 'copy'
I1013 13:14:16.485286  9515 cluster.cpp:448] Creating default 'local' authorizer
I1013 13:14:16.487215 19218 slave.cpp:254] Mesos agent started on (828)@172.17.0.3:33868
I1013 13:14:16.487237 19218 slave.cpp:255] Flags at startup: --acls="" --appc_simple_discovery_uri_prefix="http://"
--appc_store_dir="/tmp/Endpoint_SlaveEndpointTest_NoAuthorizer_0_Xh8icf/store/appc" --authenticate_http_executors="true"
--authenticate_http_readonly="true" --authenticate_http_readwrite="true" --authenticatee="crammd5"
--authentication_backoff_factor="1secs" --authorizer="local" --cgroups_cpu_enable_pids_and_tids_count="false"
--cgroups_enable_cfs="false" --cgroups_hierarchy="/sys/fs/cgroup" --cgroups_limit_swap="false"
--cgroups_root="mesos" --container_disk_watch_interval="15secs" --containerizers="mesos" --credential="/tmp/Endpoint_SlaveEndpointTest_NoAuthorizer_0_Xh8icf/credential"
--default_role="*" --disallow_sharing_agent_pid_namespace="false" --disk_watch_interval="1mins"
--docker="docker" --docker_kill_orphans="true" --docker_registry="https://registry-1.docker.io"
--docker_remove_delay="6hrs" --docker_socket="/var/run/docker.sock" --docker_stop_timeout="0ns"
--docker_store_dir="/tmp/Endpoint_SlaveEndpointTest_NoAuthorizer_0_Xh8icf/store/docker" --docker_volume_checkpoint_dir="/var/run/mesos/isolators/docker/volume"
--enforce_container_disk_quota="false" --executor_registration_timeout="1mins" --executor_reregistration_timeout="2secs"
--executor_secret_key="/tmp/Endpoint_SlaveEndpointTest_NoAuthorizer_0_Xh8icf/executor_secret_key"
--executor_shutdown_grace_period="5secs" --fetcher_cache_dir="/tmp/Endpoint_SlaveEndpointTest_NoAuthorizer_0_Xh8icf/fetch"
--fetcher_cache_size="2GB" --frameworks_home="" --gc_delay="1weeks" --gc_disk_headroom="0.1"
--hadoop_home="" --help="false" --hostname_lookup="true" --http_command_executor="false" --http_credentials="/tmp/Endpoint_SlaveEndpointTest_NoAuthorizer_0_Xh8icf/http_credentials"
--http_heartbeat_interval="30secs" --initialize_driver_logging="true" --isolation="posix/cpu,posix/mem"
--launcher="posix" --launcher_dir="/mesos/mesos-1.5.0/_build/src" --logbufsecs="0" --logging_level="INFO"
--max_completed_executors_per_framework="150" --oversubscribed_resources_interval="15secs"
--perf_duration="10secs" --perf_interval="1mins" --port="5051" --qos_correction_interval_min="0ns"
--quiet="false" --recover="reconnect" --recovery_timeout="15mins" --registration_backoff_factor="10ms"
--resources="cpus:2;gpus:0;mem:1024;disk:1024;ports:[31000-32000]" --revocable_cpu_low_priority="true"
--runtime_dir="/tmp/Endpoint_SlaveEndpointTest_NoAuthorizer_0_Xh8icf" --sandbox_directory="/mnt/mesos/sandbox"
--strict="true" --switch_user="true" --systemd_enable_support="true" --systemd_runtime_directory="/run/systemd/system"
--version="false" --work_dir="/tmp/Endpoint_SlaveEndpointTest_NoAuthorizer_0_6qP2Zg" --zk_session_timeout="10secs"
I1013 13:14:16.487615 19218 credentials.hpp:86] Loading credential for authentication from
'/tmp/Endpoint_SlaveEndpointTest_NoAuthorizer_0_Xh8icf/credential'
I1013 13:14:16.487779 19218 slave.cpp:287] Agent using credential for: test-principal
I1013 13:14:16.487802 19218 credentials.hpp:37] Loading credentials for authentication from
'/tmp/Endpoint_SlaveEndpointTest_NoAuthorizer_0_Xh8icf/http_credentials'
I1013 13:14:16.488113 19218 http.cpp:1045] Creating default 'basic' HTTP authenticator for
realm 'mesos-agent-executor'
I1013 13:14:16.488237 19218 http.cpp:1066] Creating default 'jwt' HTTP authenticator for realm
'mesos-agent-executor'
I1013 13:14:16.488445 19218 http.cpp:1045] Creating default 'basic' HTTP authenticator for
realm 'mesos-agent-readonly'
I1013 13:14:16.488561 19218 http.cpp:1066] Creating default 'jwt' HTTP authenticator for realm
'mesos-agent-readonly'
I1013 13:14:16.488800 19218 http.cpp:1045] Creating default 'basic' HTTP authenticator for
realm 'mesos-agent-readwrite'
I1013 13:14:16.488903 19218 http.cpp:1066] Creating default 'jwt' HTTP authenticator for realm
'mesos-agent-readwrite'
I1013 13:14:16.490420 19218 slave.cpp:585] Agent resources: [{"name":"cpus","scalar":{"value":2.0},"type":"SCALAR"},{"name":"mem","scalar":{"value":1024.0},"type":"SCALAR"},{"name":"disk","scalar":{"value":1024.0},"type":"SCALAR"},{"name":"ports","ranges":{"range":[{"begin":31000,"end":32000}]},"type":"RANGES"}]
I1013 13:14:16.490650 19218 slave.cpp:593] Agent attributes: [  ]
I1013 13:14:16.490666 19218 slave.cpp:602] Agent hostname: 6c28fac2b09a
I1013 13:14:16.490829 19220 status_update_manager.cpp:177] Pausing sending status updates
I1013 13:14:16.492216 19209 state.cpp:64] Recovering state from '/tmp/Endpoint_SlaveEndpointTest_NoAuthorizer_0_6qP2Zg/meta'
I1013 13:14:16.492480 19223 status_update_manager.cpp:203] Recovering status update manager
I1013 13:14:16.492641 19212 containerizer.cpp:648] Recovering containerizer
I1013 13:14:16.494101 19225 provisioner.cpp:416] Provisioner recovery complete
I1013 13:14:16.494433 19225 slave.cpp:6310] Finished recovery
I1013 13:14:16.494858 19225 slave.cpp:6492] Querying resource estimator for oversubscribable
resources
I1013 13:14:16.495067 19209 slave.cpp:6506] Received oversubscribable resources {} from the
resource estimator
I1013 13:14:16.496912 19211 process.cpp:3929] Handling HTTP event for process 'slave(828)'
with path: '/slave(828)/monitor/statistics'
I1013 13:14:16.498534 19206 http.cpp:1185] HTTP GET for /slave(828)/monitor/statistics from
172.17.0.3:58652
I1013 13:14:16.498600 19206 http.cpp:976] Authorizing principal 'test-principal' to GET the
'/monitor/statistics' endpoint
I1013 13:14:16.501538 19223 slave.cpp:869] Agent terminating
[       OK ] Endpoint/SlaveEndpointTest.NoAuthorizer/0 (28 ms)
[ RUN      ] Endpoint/SlaveEndpointTest.NoAuthorizer/1
I1013 13:14:16.512471  9515 containerizer.cpp:292] Using isolation { environment_secret, posix/cpu,
posix/mem, filesystem/posix, network/cni }
W1013 13:14:16.512946  9515 backend.cpp:76] Failed to create 'aufs' backend: AufsBackend requires
root privileges
W1013 13:14:16.513052  9515 backend.cpp:76] Failed to create 'bind' backend: BindBackend requires
root privileges
I1013 13:14:16.513084  9515 provisioner.cpp:255] Using default backend 'copy'
I1013 13:14:16.514688  9515 cluster.cpp:448] Creating default 'local' authorizer
I1013 13:14:16.516544 19207 slave.cpp:254] Mesos agent started on (829)@172.17.0.3:33868
I1013 13:14:16.516564 19207 slave.cpp:255] Flags at startup: --acls="" --appc_simple_discovery_uri_prefix="http://"
--appc_store_dir="/tmp/Endpoint_SlaveEndpointTest_NoAuthorizer_1_jQkle8/store/appc" --authenticate_http_executors="true"
--authenticate_http_readonly="true" --authenticate_http_readwrite="true" --authenticatee="crammd5"
--authentication_backoff_factor="1secs" --authorizer="local" --cgroups_cpu_enable_pids_and_tids_count="false"
--cgroups_enable_cfs="false" --cgroups_hierarchy="/sys/fs/cgroup" --cgroups_limit_swap="false"
--cgroups_root="mesos" --container_disk_watch_interval="15secs" --containerizers="mesos" --credential="/tmp/Endpoint_SlaveEndpointTest_NoAuthorizer_1_jQkle8/credential"
--default_role="*" --disallow_sharing_agent_pid_namespace="false" --disk_watch_interval="1mins"
--docker="docker" --docker_kill_orphans="true" --docker_registry="https://registry-1.docker.io"
--docker_remove_delay="6hrs" --docker_socket="/var/run/docker.sock" --docker_stop_timeout="0ns"
--docker_store_dir="/tmp/Endpoint_SlaveEndpointTest_NoAuthorizer_1_jQkle8/store/docker" --docker_volume_checkpoint_dir="/var/run/mesos/isolators/docker/volume"
--enforce_container_disk_quota="false" --executor_registration_timeout="1mins" --executor_reregistration_timeout="2secs"
--executor_secret_key="/tmp/Endpoint_SlaveEndpointTest_NoAuthorizer_1_jQkle8/executor_secret_key"
--executor_shutdown_grace_period="5secs" --fetcher_cache_dir="/tmp/Endpoint_SlaveEndpointTest_NoAuthorizer_1_jQkle8/fetch"
--fetcher_cache_size="2GB" --frameworks_home="" --gc_delay="1weeks" --gc_disk_headroom="0.1"
--hadoop_home="" --help="false" --hostname_lookup="true" --http_command_executor="false" --http_credentials="/tmp/Endpoint_SlaveEndpointTest_NoAuthorizer_1_jQkle8/http_credentials"
--http_heartbeat_interval="30secs" --initialize_driver_logging="true" --isolation="posix/cpu,posix/mem"
--launcher="posix" --launcher_dir="/mesos/mesos-1.5.0/_build/src" --logbufsecs="0" --logging_level="INFO"
--max_completed_executors_per_framework="150" --oversubscribed_resources_interval="15secs"
--perf_duration="10secs" --perf_interval="1mins" --port="5051" --qos_correction_interval_min="0ns"
--quiet="false" --recover="reconnect" --recovery_timeout="15mins" --registration_backoff_factor="10ms"
--resources="cpus:2;gpus:0;mem:1024;disk:1024;ports:[31000-32000]" --revocable_cpu_low_priority="true"
--runtime_dir="/tmp/Endpoint_SlaveEndpointTest_NoAuthorizer_1_jQkle8" --sandbox_directory="/mnt/mesos/sandbox"
--strict="true" --switch_user="true" --systemd_enable_support="true" --systemd_runtime_directory="/run/systemd/system"
--version="false" --work_dir="/tmp/Endpoint_SlaveEndpointTest_NoAuthorizer_1_urKHX9" --zk_session_timeout="10secs"
I1013 13:14:16.516949 19207 credentials.hpp:86] Loading credential for authentication from
'/tmp/Endpoint_SlaveEndpointTest_NoAuthorizer_1_jQkle8/credential'
I1013 13:14:16.517105 19207 slave.cpp:287] Agent using credential for: test-principal
I1013 13:14:16.517127 19207 credentials.hpp:37] Loading credentials for authentication from
'/tmp/Endpoint_SlaveEndpointTest_NoAuthorizer_1_jQkle8/http_credentials'
I1013 13:14:16.517426 19207 http.cpp:1045] Creating default 'basic' HTTP authenticator for
realm 'mesos-agent-executor'
I1013 13:14:16.517539 19207 http.cpp:1066] Creating default 'jwt' HTTP authenticator for realm
'mesos-agent-executor'
I1013 13:14:16.517745 19207 http.cpp:1045] Creating default 'basic' HTTP authenticator for
realm 'mesos-agent-readonly'
I1013 13:14:16.517850 19207 http.cpp:1066] Creating default 'jwt' HTTP authenticator for realm
'mesos-agent-readonly'
I1013 13:14:16.518069 19207 http.cpp:1045] Creating default 'basic' HTTP authenticator for
realm 'mesos-agent-readwrite'
I1013 13:14:16.518178 19207 http.cpp:1066] Creating default 'jwt' HTTP authenticator for realm
'mesos-agent-readwrite'
I1013 13:14:16.519583 19207 slave.cpp:585] Agent resources: [{"name":"cpus","scalar":{"value":2.0},"type":"SCALAR"},{"name":"mem","scalar":{"value":1024.0},"type":"SCALAR"},{"name":"disk","scalar":{"value":1024.0},"type":"SCALAR"},{"name":"ports","ranges":{"range":[{"begin":31000,"end":32000}]},"type":"RANGES"}]
I1013 13:14:16.519812 19207 slave.cpp:593] Agent attributes: [  ]
I1013 13:14:16.519825 19207 slave.cpp:602] Agent hostname: 6c28fac2b09a
I1013 13:14:16.519976 19215 status_update_manager.cpp:177] Pausing sending status updates
I1013 13:14:16.521306 19225 state.cpp:64] Recovering state from '/tmp/Endpoint_SlaveEndpointTest_NoAuthorizer_1_urKHX9/meta'
I1013 13:14:16.521579 19219 status_update_manager.cpp:203] Recovering status update manager
I1013 13:14:16.521790 19205 containerizer.cpp:648] Recovering containerizer
I1013 13:14:16.523097 19226 provisioner.cpp:416] Provisioner recovery complete
I1013 13:14:16.523491 19217 slave.cpp:6310] Finished recovery
I1013 13:14:16.523932 19217 slave.cpp:6492] Querying resource estimator for oversubscribable
resources
I1013 13:14:16.524173 19223 slave.cpp:6506] Received oversubscribable resources {} from the
resource estimator
I1013 13:14:16.525867 19224 process.cpp:3929] Handling HTTP event for process 'slave(829)'
with path: '/slave(829)/monitor/statistics.json'
I1013 13:14:16.527503 19216 http.cpp:1185] HTTP GET for /slave(829)/monitor/statistics.json
from 172.17.0.3:58654
I1013 13:14:16.527570 19216 http.cpp:976] Authorizing principal 'test-principal' to GET the
'/monitor/statistics.json' endpoint
I1013 13:14:16.530267 19210 slave.cpp:869] Agent terminating
[       OK ] Endpoint/SlaveEndpointTest.NoAuthorizer/1 (28 ms)
[ RUN      ] Endpoint/SlaveEndpointTest.NoAuthorizer/2
I1013 13:14:16.541272  9515 containerizer.cpp:292] Using isolation { environment_secret, posix/cpu,
posix/mem, filesystem/posix, network/cni }
W1013 13:14:16.541745  9515 backend.cpp:76] Failed to create 'aufs' backend: AufsBackend requires
root privileges
W1013 13:14:16.541854  9515 backend.cpp:76] Failed to create 'bind' backend: BindBackend requires
root privileges
I1013 13:14:16.541891  9515 provisioner.cpp:255] Using default backend 'copy'
I1013 13:14:16.543500  9515 cluster.cpp:448] Creating default 'local' authorizer
I1013 13:14:16.545348 19220 slave.cpp:254] Mesos agent started on (830)@172.17.0.3:33868
I1013 13:14:16.545370 19220 slave.cpp:255] Flags at startup: --acls="" --appc_simple_discovery_uri_prefix="http://"
--appc_store_dir="/tmp/Endpoint_SlaveEndpointTest_NoAuthorizer_2_D6Lyx1/store/appc" --authenticate_http_executors="true"
--authenticate_http_readonly="true" --authenticate_http_readwrite="true" --authenticatee="crammd5"
--authentication_backoff_factor="1secs" --authorizer="local" --cgroups_cpu_enable_pids_and_tids_count="false"
--cgroups_enable_cfs="false" --cgroups_hierarchy="/sys/fs/cgroup" --cgroups_limit_swap="false"
--cgroups_root="mesos" --container_disk_watch_interval="15secs" --containerizers="mesos" --credential="/tmp/Endpoint_SlaveEndpointTest_NoAuthorizer_2_D6Lyx1/credential"
--default_role="*" --disallow_sharing_agent_pid_namespace="false" --disk_watch_interval="1mins"
--docker="docker" --docker_kill_orphans="true" --docker_registry="https://registry-1.docker.io"
--docker_remove_delay="6hrs" --docker_socket="/var/run/docker.sock" --docker_stop_timeout="0ns"
--docker_store_dir="/tmp/Endpoint_SlaveEndpointTest_NoAuthorizer_2_D6Lyx1/store/docker" --docker_volume_checkpoint_dir="/var/run/mesos/isolators/docker/volume"
--enforce_container_disk_quota="false" --executor_registration_timeout="1mins" --executor_reregistration_timeout="2secs"
--executor_secret_key="/tmp/Endpoint_SlaveEndpointTest_NoAuthorizer_2_D6Lyx1/executor_secret_key"
--executor_shutdown_grace_period="5secs" --fetcher_cache_dir="/tmp/Endpoint_SlaveEndpointTest_NoAuthorizer_2_D6Lyx1/fetch"
--fetcher_cache_size="2GB" --frameworks_home="" --gc_delay="1weeks" --gc_disk_headroom="0.1"
--hadoop_home="" --help="false" --hostname_lookup="true" --http_command_executor="false" --http_credentials="/tmp/Endpoint_SlaveEndpointTest_NoAuthorizer_2_D6Lyx1/http_credentials"
--http_heartbeat_interval="30secs" --initialize_driver_logging="true" --isolation="posix/cpu,posix/mem"
--launcher="posix" --launcher_dir="/mesos/mesos-1.5.0/_build/src" --logbufsecs="0" --logging_level="INFO"
--max_completed_executors_per_framework="150" --oversubscribed_resources_interval="15secs"
--perf_duration="10secs" --perf_interval="1mins" --port="5051" --qos_correction_interval_min="0ns"
--quiet="false" --recover="reconnect" --recovery_timeout="15mins" --registration_backoff_factor="10ms"
--resources="cpus:2;gpus:0;mem:1024;disk:1024;ports:[31000-32000]" --revocable_cpu_low_priority="true"
--runtime_dir="/tmp/Endpoint_SlaveEndpointTest_NoAuthorizer_2_D6Lyx1" --sandbox_directory="/mnt/mesos/sandbox"
--strict="true" --switch_user="true" --systemd_enable_support="true" --systemd_runtime_directory="/run/systemd/system"
--version="false" --work_dir="/tmp/Endpoint_SlaveEndpointTest_NoAuthorizer_2_o2pDc3" --zk_session_timeout="10secs"
I1013 13:14:16.545737 19220 credentials.hpp:86] Loading credential for authentication from
'/tmp/Endpoint_SlaveEndpointTest_NoAuthorizer_2_D6Lyx1/credential'
I1013 13:14:16.545881 19220 slave.cpp:287] Agent using credential for: test-principal
I1013 13:14:16.545900 19220 credentials.hpp:37] Loading credentials for authentication from
'/tmp/Endpoint_SlaveEndpointTest_NoAuthorizer_2_D6Lyx1/http_credentials'
I1013 13:14:16.546192 19220 http.cpp:1045] Creating default 'basic' HTTP authenticator for
realm 'mesos-agent-executor'
I1013 13:14:16.546304 19220 http.cpp:1066] Creating default 'jwt' HTTP authenticator for realm
'mesos-agent-executor'
I1013 13:14:16.546492 19220 http.cpp:1045] Creating default 'basic' HTTP authenticator for
realm 'mesos-agent-readonly'
I1013 13:14:16.546591 19220 http.cpp:1066] Creating default 'jwt' HTTP authenticator for realm
'mesos-agent-readonly'
I1013 13:14:16.546767 19220 http.cpp:1045] Creating default 'basic' HTTP authenticator for
realm 'mesos-agent-readwrite'
I1013 13:14:16.546866 19220 http.cpp:1066] Creating default 'jwt' HTTP authenticator for realm
'mesos-agent-readwrite'
I1013 13:14:16.548238 19220 slave.cpp:585] Agent resources: [{"name":"cpus","scalar":{"value":2.0},"type":"SCALAR"},{"name":"mem","scalar":{"value":1024.0},"type":"SCALAR"},{"name":"disk","scalar":{"value":1024.0},"type":"SCALAR"},{"name":"ports","ranges":{"range":[{"begin":31000,"end":32000}]},"type":"RANGES"}]
I1013 13:14:16.548465 19220 slave.cpp:593] Agent attributes: [  ]
I1013 13:14:16.548477 19220 slave.cpp:602] Agent hostname: 6c28fac2b09a
I1013 13:14:16.548619 19211 status_update_manager.cpp:177] Pausing sending status updates
I1013 13:14:16.549888 19225 state.cpp:64] Recovering state from '/tmp/Endpoint_SlaveEndpointTest_NoAuthorizer_2_o2pDc3/meta'
I1013 13:14:16.550144 19214 status_update_manager.cpp:203] Recovering status update manager
I1013 13:14:16.550320 19219 containerizer.cpp:648] Recovering containerizer
I1013 13:14:16.551547 19227 provisioner.cpp:416] Provisioner recovery complete
I1013 13:14:16.551875 19213 slave.cpp:6310] Finished recovery
I1013 13:14:16.552291 19213 slave.cpp:6492] Querying resource estimator for oversubscribable
resources
I1013 13:14:16.552521 19223 slave.cpp:6506] Received oversubscribable resources {} from the
resource estimator
I1013 13:14:16.554337 19212 process.cpp:3929] Handling HTTP event for process 'slave(830)'
with path: '/slave(830)/containers'
I1013 13:14:16.555943 19211 http.cpp:1185] HTTP GET for /slave(830)/containers from 172.17.0.3:58656
I1013 13:14:16.556007 19211 http.cpp:976] Authorizing principal 'test-principal' to GET the
'/containers' endpoint
I1013 13:14:16.559301 19223 slave.cpp:869] Agent terminating
[       OK ] Endpoint/SlaveEndpointTest.NoAuthorizer/2 (28 ms)
[----------] 9 tests from Endpoint/SlaveEndpointTest (262 ms total)

[----------] 2 tests from ContainerizerType/DefaultContainerDNSFlagTest
[ RUN      ] ContainerizerType/DefaultContainerDNSFlagTest.ValidateFlag/0
[       OK ] ContainerizerType/DefaultContainerDNSFlagTest.ValidateFlag/0 (10 ms)
[ RUN      ] ContainerizerType/DefaultContainerDNSFlagTest.ValidateFlag/1
[       OK ] ContainerizerType/DefaultContainerDNSFlagTest.ValidateFlag/1 (10 ms)
[----------] 2 tests from ContainerizerType/DefaultContainerDNSFlagTest (20 ms total)

[----------] Global test environment tear-down
[==========] 1700 tests from 187 test cases ran. (579474 ms total)
[  PASSED  ] 1698 tests.
[  FAILED  ] 2 tests, listed below:
[  FAILED  ] ExamplesTest.NoExecutorFramework
[  FAILED  ] ExamplesTest.DynamicReservationFramework

 2 FAILED TESTS
  YOU HAVE 21 DISABLED TESTS

I1013 13:14:16.652878 19229 process.cpp:1068] Failed to accept socket: future discarded
make[4]: *** [check-local] Error 1
make[4]: Leaving directory `/mesos/mesos-1.5.0/_build/src'
make[3]: *** [check-am] Error 2
make[3]: Leaving directory `/mesos/mesos-1.5.0/_build/src'
make[2]: *** [check] Error 2
make[2]: Leaving directory `/mesos/mesos-1.5.0/_build/src'
make[1]: *** [check-recursive] Error 1
make[1]: Leaving directory `/mesos/mesos-1.5.0/_build'
make: *** [distcheck] Error 1
+ docker rmi mesos-1507897756-23575
Untagged: mesos-1507897756-23575:latest
Deleted: sha256:a21240f6534274b4d094c0a4dee1b78f9337df15fa452e85f583137439bf0ab5
Deleted: sha256:5849fc21ae452e942cd50bf7cb92575ab621e7d1d15e44a4f11f3a1041952fbc
Deleted: sha256:be0ae9cef03d0a3555d51b0ae97b5373c4c9ca6318209e1ec622f6fa3043bcf1
Deleted: sha256:70bf120fe26387eca20519481e40f9465540c6447421b942495bb044d21a08ca
Deleted: sha256:23c84e78594a1e8d7695a617897f0227e013f650ae00682e920769d57bc1e0e1
Deleted: sha256:3176f65e95f394c872838b0d5359057c604ec670afdf4955b188df33aff276f8
Deleted: sha256:21daf9d9fe8d7a282d11d2f7d2f689fbeedb0a76680693660373455979aaa72f
Deleted: sha256:a797d0fc78ac85bea8b4b8b3ba60474cb753b16bbc1e57f09a72ce70656ab068
Deleted: sha256:ed288119377d15ba1da49a649de35e5c3b70c1ece8d1d37f893259acfbd04b00
Deleted: sha256:49bfcecd6516b927c23efbb40b5d59d0869c1f274391d393e7ef0086cec9a6e8
Deleted: sha256:ef5003dba1203c09fe2cfd3368647557cd410e665a933b55e84198337a7d1403
Deleted: sha256:c3cf14adc0cf36b237985101887ef3d83b597a6b345863e7b9179fe3ac99652d
Deleted: sha256:8c0cc90d09644fdf18701b220f76b2d578bc0d897df6f16be3298bdfbb37f2e8
Deleted: sha256:dd8cca07e96f23f1c0330dc076d4ab970e1b66df857b4624144bc83d6ede03c1
Deleted: sha256:0dc972e6186ed4b42a1a457aa00d1e31048f3e065777bc8b41357e88c1ac4317
Deleted: sha256:746945f9d63730f6f3594e82235f85b357792478276fb4f481a815afa0400d97
Deleted: sha256:083892325357101e7cc28e7c09de187a43e2a8910c5c2d8cd58f82a01fc3a1d8
Deleted: sha256:392a446149cfa9874d7424e55712d131b990f12014655d8251869ed5f2f5ed96
Deleted: sha256:ce87d680c5da6de58102c185cd8de9f926747b798661267e591fd2dc643a8874
Deleted: sha256:a97374ec99e304b60f6735eee58f2c5fb6b13a3ccba10cbc931ae9b745c50b45
Deleted: sha256:11b0fe4be2d1ac1ecbf7daebc3ceae457f0d5ea0d6a765dba9fe3482e365488c
Deleted: sha256:12d2cd624ed0c7ad6aa6733db66d44776d2b73d89bd707045329dc654daeba81
Deleted: sha256:549e8632f45753577b5323df4db1af8d3456eee80fe70708827b94f3f5c56e0e
Deleted: sha256:3179c4d561b4342e197827361d45b9fb375cec8d2381366a7e3d416c4e04e498
Deleted: sha256:0667312caaec57bed03e6f8e3a0b126ba8f5abdb50a2529d0545d7f7288d4f3c
Deleted: sha256:e1213294c385e82f2daec316bdffd5a720427ca7d8f12e3f3eb410a752029587
Deleted: sha256:f59ea92f6f7541f4a8313836d479f9d5539e17194b45f6126a496272abd81a2c
Deleted: sha256:5767dd57093ae8129df4c782d5bd3df9418c609309946e585bbab3a7cd10b4d0
Deleted: sha256:62aadab5a63df800fa8b71e8caffaa4db68d2a216be5b1e3e9b540c968c5f10a
Deleted: sha256:196e0ce0c9fbb31da595b893dd39bc9fd4aa78a474bbdc21459a3ebe855b7768
Deleted: sha256:cf516324493c00941ac20020801553e87ed24c564fb3f269409ad138945948d4
Build step 'Execute shell' marked build as failure


Mime
View raw message