mesos-builds mailing list archives

Site index · List index
Message view « Date » · « Thread »
Top « Date » · « Thread »
From Apache Jenkins Server <jenk...@builds.apache.org>
Subject Build failed in Jenkins: Mesos-Buildbot » autotools,gcc,--verbose --disable-libtool-wrappers,GLOG_v=1 MESOS_VERBOSE=1,centos:7,(ubuntu)&&(!ubuntu-us1)&&(!ubuntu-eu2)&&(!qnode3)&&(!H23) #4344
Date Thu, 19 Oct 2017 21:45:03 GMT
See <https://builds.apache.org/job/Mesos-Buildbot/BUILDTOOL=autotools,COMPILER=gcc,CONFIGURATION=--verbose%20--disable-libtool-wrappers,ENVIRONMENT=GLOG_v=1%20MESOS_VERBOSE=1,OS=centos%3A7,label_exp=(ubuntu)&&(!ubuntu-us1)&&(!ubuntu-eu2)&&(!qnode3)&&(!H23)/4344/display/redirect?page=changes>

Changes:

[alexr] Replaced std::cerr by LOG(ERROR) in process.cpp.

------------------------------------------
[...truncated 31.81 MB...]
I1019 21:44:52.674633  6678 http.cpp:1185] HTTP GET for /slave(818)/monitor/statistics.json
from 172.17.0.3:47058
I1019 21:44:52.674692  6678 http.cpp:976] Authorizing principal 'test-principal' to GET the
'/monitor/statistics.json' endpoint
I1019 21:44:52.676753  6687 slave.cpp:869] Agent terminating
[       OK ] Endpoint/SlaveEndpointTest.AuthorizedRequest/1 (25 ms)
[ RUN      ] Endpoint/SlaveEndpointTest.AuthorizedRequest/2
I1019 21:44:52.686657  6673 containerizer.cpp:292] Using isolation { environment_secret, posix/cpu,
posix/mem, filesystem/posix, network/cni }
W1019 21:44:52.687077  6673 backend.cpp:76] Failed to create 'aufs' backend: AufsBackend requires
root privileges
W1019 21:44:52.687192  6673 backend.cpp:76] Failed to create 'bind' backend: BindBackend requires
root privileges
I1019 21:44:52.687223  6673 provisioner.cpp:255] Using default backend 'copy'
I1019 21:44:52.690254  6683 slave.cpp:254] Mesos agent started on (819)@172.17.0.3:42787
I1019 21:44:52.690274  6683 slave.cpp:255] Flags at startup: --acls="" --appc_simple_discovery_uri_prefix="http://"
--appc_store_dir="/tmp/Endpoint_SlaveEndpointTest_AuthorizedRequest_2_g2Zt8i/store/appc" --authenticate_http_readonly="true"
--authenticate_http_readwrite="true" --authenticatee="crammd5" --authentication_backoff_factor="1secs"
--authorizer="local" --cgroups_cpu_enable_pids_and_tids_count="false" --cgroups_enable_cfs="false"
--cgroups_hierarchy="/sys/fs/cgroup" --cgroups_limit_swap="false" --cgroups_root="mesos" --container_disk_watch_interval="15secs"
--containerizers="mesos" --credential="/tmp/Endpoint_SlaveEndpointTest_AuthorizedRequest_2_g2Zt8i/credential"
--default_role="*" --disallow_sharing_agent_pid_namespace="false" --disk_watch_interval="1mins"
--docker="docker" --docker_kill_orphans="true" --docker_registry="https://registry-1.docker.io"
--docker_remove_delay="6hrs" --docker_socket="/var/run/docker.sock" --docker_stop_timeout="0ns"
--docker_store_dir="/tmp/Endpoint_SlaveEndpointTest_AuthorizedRequest_2_g2Zt8i/store/docker"
--docker_volume_checkpoint_dir="/var/run/mesos/isolators/docker/volume" --enforce_container_disk_quota="false"
--executor_registration_timeout="1mins" --executor_reregistration_timeout="2secs" --executor_shutdown_grace_period="5secs"
--fetcher_cache_dir="/tmp/Endpoint_SlaveEndpointTest_AuthorizedRequest_2_g2Zt8i/fetch" --fetcher_cache_size="2GB"
--frameworks_home="" --gc_delay="1weeks" --gc_disk_headroom="0.1" --hadoop_home="" --help="false"
--hostname_lookup="true" --http_command_executor="false" --http_credentials="/tmp/Endpoint_SlaveEndpointTest_AuthorizedRequest_2_g2Zt8i/http_credentials"
--http_heartbeat_interval="30secs" --initialize_driver_logging="true" --isolation="posix/cpu,posix/mem"
--launcher="posix" --launcher_dir="/mesos/mesos-1.5.0/_build/src" --logbufsecs="0" --logging_level="INFO"
--max_completed_executors_per_framework="150" --oversubscribed_resources_interval="15secs"
--perf_duration="10secs" --perf_interval="1mins" --port="5051" --qos_correction_interval_min="0ns"
--quiet="false" --recover="reconnect" --recovery_timeout="15mins" --registration_backoff_factor="10ms"
--resources="cpus:2;gpus:0;mem:1024;disk:1024;ports:[31000-32000]" --revocable_cpu_low_priority="true"
--runtime_dir="/tmp/Endpoint_SlaveEndpointTest_AuthorizedRequest_2_g2Zt8i" --sandbox_directory="/mnt/mesos/sandbox"
--strict="true" --switch_user="true" --systemd_enable_support="true" --systemd_runtime_directory="/run/systemd/system"
--version="false" --work_dir="/tmp/Endpoint_SlaveEndpointTest_AuthorizedRequest_2_UiuEKJ"
--zk_session_timeout="10secs"
I1019 21:44:52.690605  6683 credentials.hpp:86] Loading credential for authentication from
'/tmp/Endpoint_SlaveEndpointTest_AuthorizedRequest_2_g2Zt8i/credential'
I1019 21:44:52.690750  6683 slave.cpp:287] Agent using credential for: test-principal
I1019 21:44:52.690770  6683 credentials.hpp:37] Loading credentials for authentication from
'/tmp/Endpoint_SlaveEndpointTest_AuthorizedRequest_2_g2Zt8i/http_credentials'
I1019 21:44:52.690989  6683 http.cpp:1045] Creating default 'basic' HTTP authenticator for
realm 'mesos-agent-readonly'
I1019 21:44:52.691130  6683 http.cpp:1045] Creating default 'basic' HTTP authenticator for
realm 'mesos-agent-readwrite'
I1019 21:44:52.692359  6683 slave.cpp:585] Agent resources: [{"name":"cpus","scalar":{"value":2.0},"type":"SCALAR"},{"name":"mem","scalar":{"value":1024.0},"type":"SCALAR"},{"name":"disk","scalar":{"value":1024.0},"type":"SCALAR"},{"name":"ports","ranges":{"range":[{"begin":31000,"end":32000}]},"type":"RANGES"}]
I1019 21:44:52.692565  6683 slave.cpp:593] Agent attributes: [  ]
I1019 21:44:52.692586  6683 slave.cpp:602] Agent hostname: ea801433af8a
I1019 21:44:52.692714  6678 status_update_manager.cpp:177] Pausing sending status updates
I1019 21:44:52.693940  6691 state.cpp:64] Recovering state from '/tmp/Endpoint_SlaveEndpointTest_AuthorizedRequest_2_UiuEKJ/meta'
I1019 21:44:52.694150  6688 status_update_manager.cpp:203] Recovering status update manager
I1019 21:44:52.694310  6690 containerizer.cpp:649] Recovering containerizer
I1019 21:44:52.695399  6685 provisioner.cpp:416] Provisioner recovery complete
I1019 21:44:52.695678  6674 slave.cpp:6310] Finished recovery
I1019 21:44:52.698165  6680 process.cpp:3927] Handling HTTP event for process 'slave(819)'
with path: '/slave(819)/containers'
I1019 21:44:52.699237  6681 http.cpp:1185] HTTP GET for /slave(819)/containers from 172.17.0.3:47060
I1019 21:44:52.699296  6681 http.cpp:976] Authorizing principal 'test-principal' to GET the
'/containers' endpoint
I1019 21:44:52.701948  6687 slave.cpp:869] Agent terminating
[       OK ] Endpoint/SlaveEndpointTest.AuthorizedRequest/2 (24 ms)
[ RUN      ] Endpoint/SlaveEndpointTest.UnauthorizedRequest/0
I1019 21:44:52.711448  6673 containerizer.cpp:292] Using isolation { environment_secret, posix/cpu,
posix/mem, filesystem/posix, network/cni }
W1019 21:44:52.711879  6673 backend.cpp:76] Failed to create 'aufs' backend: AufsBackend requires
root privileges
W1019 21:44:52.711975  6673 backend.cpp:76] Failed to create 'bind' backend: BindBackend requires
root privileges
I1019 21:44:52.712004  6673 provisioner.cpp:255] Using default backend 'copy'
I1019 21:44:52.715008  6693 slave.cpp:254] Mesos agent started on (820)@172.17.0.3:42787
I1019 21:44:52.715028  6693 slave.cpp:255] Flags at startup: --acls="" --appc_simple_discovery_uri_prefix="http://"
--appc_store_dir="/tmp/Endpoint_SlaveEndpointTest_UnauthorizedRequest_0_mEHkSA/store/appc"
--authenticate_http_readonly="true" --authenticate_http_readwrite="true" --authenticatee="crammd5"
--authentication_backoff_factor="1secs" --authorizer="local" --cgroups_cpu_enable_pids_and_tids_count="false"
--cgroups_enable_cfs="false" --cgroups_hierarchy="/sys/fs/cgroup" --cgroups_limit_swap="false"
--cgroups_root="mesos" --container_disk_watch_interval="15secs" --containerizers="mesos" --credential="/tmp/Endpoint_SlaveEndpointTest_UnauthorizedRequest_0_mEHkSA/credential"
--default_role="*" --disallow_sharing_agent_pid_namespace="false" --disk_watch_interval="1mins"
--docker="docker" --docker_kill_orphans="true" --docker_registry="https://registry-1.docker.io"
--docker_remove_delay="6hrs" --docker_socket="/var/run/docker.sock" --docker_stop_timeout="0ns"
--docker_store_dir="/tmp/Endpoint_SlaveEndpointTest_UnauthorizedRequest_0_mEHkSA/store/docker"
--docker_volume_checkpoint_dir="/var/run/mesos/isolators/docker/volume" --enforce_container_disk_quota="false"
--executor_registration_timeout="1mins" --executor_reregistration_timeout="2secs" --executor_shutdown_grace_period="5secs"
--fetcher_cache_dir="/tmp/Endpoint_SlaveEndpointTest_UnauthorizedRequest_0_mEHkSA/fetch" --fetcher_cache_size="2GB"
--frameworks_home="" --gc_delay="1weeks" --gc_disk_headroom="0.1" --hadoop_home="" --help="false"
--hostname_lookup="true" --http_command_executor="false" --http_credentials="/tmp/Endpoint_SlaveEndpointTest_UnauthorizedRequest_0_mEHkSA/http_credentials"
--http_heartbeat_interval="30secs" --initialize_driver_logging="true" --isolation="posix/cpu,posix/mem"
--launcher="posix" --launcher_dir="/mesos/mesos-1.5.0/_build/src" --logbufsecs="0" --logging_level="INFO"
--max_completed_executors_per_framework="150" --oversubscribed_resources_interval="15secs"
--perf_duration="10secs" --perf_interval="1mins" --port="5051" --qos_correction_interval_min="0ns"
--quiet="false" --recover="reconnect" --recovery_timeout="15mins" --registration_backoff_factor="10ms"
--resources="cpus:2;gpus:0;mem:1024;disk:1024;ports:[31000-32000]" --revocable_cpu_low_priority="true"
--runtime_dir="/tmp/Endpoint_SlaveEndpointTest_UnauthorizedRequest_0_mEHkSA" --sandbox_directory="/mnt/mesos/sandbox"
--strict="true" --switch_user="true" --systemd_enable_support="true" --systemd_runtime_directory="/run/systemd/system"
--version="false" --work_dir="/tmp/Endpoint_SlaveEndpointTest_UnauthorizedRequest_0_Cg3Nq1"
--zk_session_timeout="10secs"
I1019 21:44:52.715389  6693 credentials.hpp:86] Loading credential for authentication from
'/tmp/Endpoint_SlaveEndpointTest_UnauthorizedRequest_0_mEHkSA/credential'
I1019 21:44:52.715543  6693 slave.cpp:287] Agent using credential for: test-principal
I1019 21:44:52.715569  6693 credentials.hpp:37] Loading credentials for authentication from
'/tmp/Endpoint_SlaveEndpointTest_UnauthorizedRequest_0_mEHkSA/http_credentials'
I1019 21:44:52.715801  6693 http.cpp:1045] Creating default 'basic' HTTP authenticator for
realm 'mesos-agent-readonly'
I1019 21:44:52.715951  6693 http.cpp:1045] Creating default 'basic' HTTP authenticator for
realm 'mesos-agent-readwrite'
I1019 21:44:52.717185  6693 slave.cpp:585] Agent resources: [{"name":"cpus","scalar":{"value":2.0},"type":"SCALAR"},{"name":"mem","scalar":{"value":1024.0},"type":"SCALAR"},{"name":"disk","scalar":{"value":1024.0},"type":"SCALAR"},{"name":"ports","ranges":{"range":[{"begin":31000,"end":32000}]},"type":"RANGES"}]
I1019 21:44:52.717391  6693 slave.cpp:593] Agent attributes: [  ]
I1019 21:44:52.717406  6693 slave.cpp:602] Agent hostname: ea801433af8a
I1019 21:44:52.717553  6676 status_update_manager.cpp:177] Pausing sending status updates
I1019 21:44:52.718813  6674 state.cpp:64] Recovering state from '/tmp/Endpoint_SlaveEndpointTest_UnauthorizedRequest_0_Cg3Nq1/meta'
I1019 21:44:52.719038  6688 status_update_manager.cpp:203] Recovering status update manager
I1019 21:44:52.719219  6696 containerizer.cpp:649] Recovering containerizer
I1019 21:44:52.720320  6683 provisioner.cpp:416] Provisioner recovery complete
I1019 21:44:52.720592  6676 slave.cpp:6310] Finished recovery
I1019 21:44:52.723146  6677 process.cpp:3927] Handling HTTP event for process 'slave(820)'
with path: '/slave(820)/monitor/statistics'
I1019 21:44:52.724289  6679 http.cpp:1185] HTTP GET for /slave(820)/monitor/statistics from
172.17.0.3:47070
I1019 21:44:52.724349  6679 http.cpp:976] Authorizing principal 'test-principal' to GET the
'/monitor/statistics' endpoint
I1019 21:44:52.725967  6682 slave.cpp:869] Agent terminating
[       OK ] Endpoint/SlaveEndpointTest.UnauthorizedRequest/0 (23 ms)
[ RUN      ] Endpoint/SlaveEndpointTest.UnauthorizedRequest/1
I1019 21:44:52.734907  6673 containerizer.cpp:292] Using isolation { environment_secret, posix/cpu,
posix/mem, filesystem/posix, network/cni }
W1019 21:44:52.735333  6673 backend.cpp:76] Failed to create 'aufs' backend: AufsBackend requires
root privileges
W1019 21:44:52.735425  6673 backend.cpp:76] Failed to create 'bind' backend: BindBackend requires
root privileges
I1019 21:44:52.735455  6673 provisioner.cpp:255] Using default backend 'copy'
I1019 21:44:52.738412  6692 slave.cpp:254] Mesos agent started on (821)@172.17.0.3:42787
I1019 21:44:52.738430  6692 slave.cpp:255] Flags at startup: --acls="" --appc_simple_discovery_uri_prefix="http://"
--appc_store_dir="/tmp/Endpoint_SlaveEndpointTest_UnauthorizedRequest_1_6UKoQS/store/appc"
--authenticate_http_readonly="true" --authenticate_http_readwrite="true" --authenticatee="crammd5"
--authentication_backoff_factor="1secs" --authorizer="local" --cgroups_cpu_enable_pids_and_tids_count="false"
--cgroups_enable_cfs="false" --cgroups_hierarchy="/sys/fs/cgroup" --cgroups_limit_swap="false"
--cgroups_root="mesos" --container_disk_watch_interval="15secs" --containerizers="mesos" --credential="/tmp/Endpoint_SlaveEndpointTest_UnauthorizedRequest_1_6UKoQS/credential"
--default_role="*" --disallow_sharing_agent_pid_namespace="false" --disk_watch_interval="1mins"
--docker="docker" --docker_kill_orphans="true" --docker_registry="https://registry-1.docker.io"
--docker_remove_delay="6hrs" --docker_socket="/var/run/docker.sock" --docker_stop_timeout="0ns"
--docker_store_dir="/tmp/Endpoint_SlaveEndpointTest_UnauthorizedRequest_1_6UKoQS/store/docker"
--docker_volume_checkpoint_dir="/var/run/mesos/isolators/docker/volume" --enforce_container_disk_quota="false"
--executor_registration_timeout="1mins" --executor_reregistration_timeout="2secs" --executor_shutdown_grace_period="5secs"
--fetcher_cache_dir="/tmp/Endpoint_SlaveEndpointTest_UnauthorizedRequest_1_6UKoQS/fetch" --fetcher_cache_size="2GB"
--frameworks_home="" --gc_delay="1weeks" --gc_disk_headroom="0.1" --hadoop_home="" --help="false"
--hostname_lookup="true" --http_command_executor="false" --http_credentials="/tmp/Endpoint_SlaveEndpointTest_UnauthorizedRequest_1_6UKoQS/http_credentials"
--http_heartbeat_interval="30secs" --initialize_driver_logging="true" --isolation="posix/cpu,posix/mem"
--launcher="posix" --launcher_dir="/mesos/mesos-1.5.0/_build/src" --logbufsecs="0" --logging_level="INFO"
--max_completed_executors_per_framework="150" --oversubscribed_resources_interval="15secs"
--perf_duration="10secs" --perf_interval="1mins" --port="5051" --qos_correction_interval_min="0ns"
--quiet="false" --recover="reconnect" --recovery_timeout="15mins" --registration_backoff_factor="10ms"
--resources="cpus:2;gpus:0;mem:1024;disk:1024;ports:[31000-32000]" --revocable_cpu_low_priority="true"
--runtime_dir="/tmp/Endpoint_SlaveEndpointTest_UnauthorizedRequest_1_6UKoQS" --sandbox_directory="/mnt/mesos/sandbox"
--strict="true" --switch_user="true" --systemd_enable_support="true" --systemd_runtime_directory="/run/systemd/system"
--version="false" --work_dir="/tmp/Endpoint_SlaveEndpointTest_UnauthorizedRequest_1_rccnlj"
--zk_session_timeout="10secs"
I1019 21:44:52.738747  6692 credentials.hpp:86] Loading credential for authentication from
'/tmp/Endpoint_SlaveEndpointTest_UnauthorizedRequest_1_6UKoQS/credential'
I1019 21:44:52.738874  6692 slave.cpp:287] Agent using credential for: test-principal
I1019 21:44:52.738894  6692 credentials.hpp:37] Loading credentials for authentication from
'/tmp/Endpoint_SlaveEndpointTest_UnauthorizedRequest_1_6UKoQS/http_credentials'
I1019 21:44:52.739094  6692 http.cpp:1045] Creating default 'basic' HTTP authenticator for
realm 'mesos-agent-readonly'
I1019 21:44:52.739253  6692 http.cpp:1045] Creating default 'basic' HTTP authenticator for
realm 'mesos-agent-readwrite'
I1019 21:44:52.740430  6692 slave.cpp:585] Agent resources: [{"name":"cpus","scalar":{"value":2.0},"type":"SCALAR"},{"name":"mem","scalar":{"value":1024.0},"type":"SCALAR"},{"name":"disk","scalar":{"value":1024.0},"type":"SCALAR"},{"name":"ports","ranges":{"range":[{"begin":31000,"end":32000}]},"type":"RANGES"}]
I1019 21:44:52.740634  6692 slave.cpp:593] Agent attributes: [  ]
I1019 21:44:52.740648  6692 slave.cpp:602] Agent hostname: ea801433af8a
I1019 21:44:52.740743  6674 status_update_manager.cpp:177] Pausing sending status updates
I1019 21:44:52.741976  6695 state.cpp:64] Recovering state from '/tmp/Endpoint_SlaveEndpointTest_UnauthorizedRequest_1_rccnlj/meta'
I1019 21:44:52.742187  6691 status_update_manager.cpp:203] Recovering status update manager
I1019 21:44:52.742347  6676 containerizer.cpp:649] Recovering containerizer
I1019 21:44:52.743496  6677 provisioner.cpp:416] Provisioner recovery complete
I1019 21:44:52.743741  6674 slave.cpp:6310] Finished recovery
I1019 21:44:52.746011  6688 process.cpp:3927] Handling HTTP event for process 'slave(821)'
with path: '/slave(821)/monitor/statistics.json'
I1019 21:44:52.746959  6680 http.cpp:1185] HTTP GET for /slave(821)/monitor/statistics.json
from 172.17.0.3:47072
I1019 21:44:52.747067  6680 http.cpp:976] Authorizing principal 'test-principal' to GET the
'/monitor/statistics.json' endpoint
I1019 21:44:52.748497  6676 slave.cpp:869] Agent terminating
[       OK ] Endpoint/SlaveEndpointTest.UnauthorizedRequest/1 (22 ms)
[ RUN      ] Endpoint/SlaveEndpointTest.UnauthorizedRequest/2
I1019 21:44:52.757400  6673 containerizer.cpp:292] Using isolation { environment_secret, posix/cpu,
posix/mem, filesystem/posix, network/cni }
W1019 21:44:52.757802  6673 backend.cpp:76] Failed to create 'aufs' backend: AufsBackend requires
root privileges
W1019 21:44:52.757899  6673 backend.cpp:76] Failed to create 'bind' backend: BindBackend requires
root privileges
I1019 21:44:52.757927  6673 provisioner.cpp:255] Using default backend 'copy'
I1019 21:44:52.760913  6675 slave.cpp:254] Mesos agent started on (822)@172.17.0.3:42787
I1019 21:44:52.760939  6675 slave.cpp:255] Flags at startup: --acls="" --appc_simple_discovery_uri_prefix="http://"
--appc_store_dir="/tmp/Endpoint_SlaveEndpointTest_UnauthorizedRequest_2_7yjX1a/store/appc"
--authenticate_http_readonly="true" --authenticate_http_readwrite="true" --authenticatee="crammd5"
--authentication_backoff_factor="1secs" --authorizer="local" --cgroups_cpu_enable_pids_and_tids_count="false"
--cgroups_enable_cfs="false" --cgroups_hierarchy="/sys/fs/cgroup" --cgroups_limit_swap="false"
--cgroups_root="mesos" --container_disk_watch_interval="15secs" --containerizers="mesos" --credential="/tmp/Endpoint_SlaveEndpointTest_UnauthorizedRequest_2_7yjX1a/credential"
--default_role="*" --disallow_sharing_agent_pid_namespace="false" --disk_watch_interval="1mins"
--docker="docker" --docker_kill_orphans="true" --docker_registry="https://registry-1.docker.io"
--docker_remove_delay="6hrs" --docker_socket="/var/run/docker.sock" --docker_stop_timeout="0ns"
--docker_store_dir="/tmp/Endpoint_SlaveEndpointTest_UnauthorizedRequest_2_7yjX1a/store/docker"
--docker_volume_checkpoint_dir="/var/run/mesos/isolators/docker/volume" --enforce_container_disk_quota="false"
--executor_registration_timeout="1mins" --executor_reregistration_timeout="2secs" --executor_shutdown_grace_period="5secs"
--fetcher_cache_dir="/tmp/Endpoint_SlaveEndpointTest_UnauthorizedRequest_2_7yjX1a/fetch" --fetcher_cache_size="2GB"
--frameworks_home="" --gc_delay="1weeks" --gc_disk_headroom="0.1" --hadoop_home="" --help="false"
--hostname_lookup="true" --http_command_executor="false" --http_credentials="/tmp/Endpoint_SlaveEndpointTest_UnauthorizedRequest_2_7yjX1a/http_credentials"
--http_heartbeat_interval="30secs" --initialize_driver_logging="true" --isolation="posix/cpu,posix/mem"
--launcher="posix" --launcher_dir="/mesos/mesos-1.5.0/_build/src" --logbufsecs="0" --logging_level="INFO"
--max_completed_executors_per_framework="150" --oversubscribed_resources_interval="15secs"
--perf_duration="10secs" --perf_interval="1mins" --port="5051" --qos_correction_interval_min="0ns"
--quiet="false" --recover="reconnect" --recovery_timeout="15mins" --registration_backoff_factor="10ms"
--resources="cpus:2;gpus:0;mem:1024;disk:1024;ports:[31000-32000]" --revocable_cpu_low_priority="true"
--runtime_dir="/tmp/Endpoint_SlaveEndpointTest_UnauthorizedRequest_2_7yjX1a" --sandbox_directory="/mnt/mesos/sandbox"
--strict="true" --switch_user="true" --systemd_enable_support="true" --systemd_runtime_directory="/run/systemd/system"
--version="false" --work_dir="/tmp/Endpoint_SlaveEndpointTest_UnauthorizedRequest_2_yieAtB"
--zk_session_timeout="10secs"
I1019 21:44:52.761436  6675 credentials.hpp:86] Loading credential for authentication from
'/tmp/Endpoint_SlaveEndpointTest_UnauthorizedRequest_2_7yjX1a/credential'
I1019 21:44:52.761617  6675 slave.cpp:287] Agent using credential for: test-principal
I1019 21:44:52.761636  6675 credentials.hpp:37] Loading credentials for authentication from
'/tmp/Endpoint_SlaveEndpointTest_UnauthorizedRequest_2_7yjX1a/http_credentials'
I1019 21:44:52.761835  6675 http.cpp:1045] Creating default 'basic' HTTP authenticator for
realm 'mesos-agent-readonly'
I1019 21:44:52.762014  6675 http.cpp:1045] Creating default 'basic' HTTP authenticator for
realm 'mesos-agent-readwrite'
I1019 21:44:52.763308  6675 slave.cpp:585] Agent resources: [{"name":"cpus","scalar":{"value":2.0},"type":"SCALAR"},{"name":"mem","scalar":{"value":1024.0},"type":"SCALAR"},{"name":"disk","scalar":{"value":1024.0},"type":"SCALAR"},{"name":"ports","ranges":{"range":[{"begin":31000,"end":32000}]},"type":"RANGES"}]
I1019 21:44:52.763721  6675 slave.cpp:593] Agent attributes: [  ]
I1019 21:44:52.763751  6675 slave.cpp:602] Agent hostname: ea801433af8a
I1019 21:44:52.763857  6688 status_update_manager.cpp:177] Pausing sending status updates
I1019 21:44:52.765162  6695 state.cpp:64] Recovering state from '/tmp/Endpoint_SlaveEndpointTest_UnauthorizedRequest_2_yieAtB/meta'
I1019 21:44:52.765384  6677 status_update_manager.cpp:203] Recovering status update manager
I1019 21:44:52.765542  6692 containerizer.cpp:649] Recovering containerizer
I1019 21:44:52.766571  6690 provisioner.cpp:416] Provisioner recovery complete
I1019 21:44:52.766811  6688 slave.cpp:6310] Finished recovery
I1019 21:44:52.769500  6679 process.cpp:3927] Handling HTTP event for process 'slave(822)'
with path: '/slave(822)/containers'
I1019 21:44:52.770503  6693 http.cpp:1185] HTTP GET for /slave(822)/containers from 172.17.0.3:47078
I1019 21:44:52.770561  6693 http.cpp:976] Authorizing principal 'test-principal' to GET the
'/containers' endpoint
I1019 21:44:52.772011  6686 slave.cpp:869] Agent terminating
[       OK ] Endpoint/SlaveEndpointTest.UnauthorizedRequest/2 (24 ms)
[ RUN      ] Endpoint/SlaveEndpointTest.NoAuthorizer/0
I1019 21:44:52.782119  6673 containerizer.cpp:292] Using isolation { environment_secret, posix/cpu,
posix/mem, filesystem/posix, network/cni }
W1019 21:44:52.782539  6673 backend.cpp:76] Failed to create 'aufs' backend: AufsBackend requires
root privileges
W1019 21:44:52.782635  6673 backend.cpp:76] Failed to create 'bind' backend: BindBackend requires
root privileges
I1019 21:44:52.782663  6673 provisioner.cpp:255] Using default backend 'copy'
I1019 21:44:52.784099  6673 cluster.cpp:448] Creating default 'local' authorizer
I1019 21:44:52.785828  6684 slave.cpp:254] Mesos agent started on (823)@172.17.0.3:42787
I1019 21:44:52.785851  6684 slave.cpp:255] Flags at startup: --acls="" --appc_simple_discovery_uri_prefix="http://"
--appc_store_dir="/tmp/Endpoint_SlaveEndpointTest_NoAuthorizer_0_IxUQrt/store/appc" --authenticate_http_readonly="true"
--authenticate_http_readwrite="true" --authenticatee="crammd5" --authentication_backoff_factor="1secs"
--authorizer="local" --cgroups_cpu_enable_pids_and_tids_count="false" --cgroups_enable_cfs="false"
--cgroups_hierarchy="/sys/fs/cgroup" --cgroups_limit_swap="false" --cgroups_root="mesos" --container_disk_watch_interval="15secs"
--containerizers="mesos" --credential="/tmp/Endpoint_SlaveEndpointTest_NoAuthorizer_0_IxUQrt/credential"
--default_role="*" --disallow_sharing_agent_pid_namespace="false" --disk_watch_interval="1mins"
--docker="docker" --docker_kill_orphans="true" --docker_registry="https://registry-1.docker.io"
--docker_remove_delay="6hrs" --docker_socket="/var/run/docker.sock" --docker_stop_timeout="0ns"
--docker_store_dir="/tmp/Endpoint_SlaveEndpointTest_NoAuthorizer_0_IxUQrt/store/docker" --docker_volume_checkpoint_dir="/var/run/mesos/isolators/docker/volume"
--enforce_container_disk_quota="false" --executor_registration_timeout="1mins" --executor_reregistration_timeout="2secs"
--executor_shutdown_grace_period="5secs" --fetcher_cache_dir="/tmp/Endpoint_SlaveEndpointTest_NoAuthorizer_0_IxUQrt/fetch"
--fetcher_cache_size="2GB" --frameworks_home="" --gc_delay="1weeks" --gc_disk_headroom="0.1"
--hadoop_home="" --help="false" --hostname_lookup="true" --http_command_executor="false" --http_credentials="/tmp/Endpoint_SlaveEndpointTest_NoAuthorizer_0_IxUQrt/http_credentials"
--http_heartbeat_interval="30secs" --initialize_driver_logging="true" --isolation="posix/cpu,posix/mem"
--launcher="posix" --launcher_dir="/mesos/mesos-1.5.0/_build/src" --logbufsecs="0" --logging_level="INFO"
--max_completed_executors_per_framework="150" --oversubscribed_resources_interval="15secs"
--perf_duration="10secs" --perf_interval="1mins" --port="5051" --qos_correction_interval_min="0ns"
--quiet="false" --recover="reconnect" --recovery_timeout="15mins" --registration_backoff_factor="10ms"
--resources="cpus:2;gpus:0;mem:1024;disk:1024;ports:[31000-32000]" --revocable_cpu_low_priority="true"
--runtime_dir="/tmp/Endpoint_SlaveEndpointTest_NoAuthorizer_0_IxUQrt" --sandbox_directory="/mnt/mesos/sandbox"
--strict="true" --switch_user="true" --systemd_enable_support="true" --systemd_runtime_directory="/run/systemd/system"
--version="false" --work_dir="/tmp/Endpoint_SlaveEndpointTest_NoAuthorizer_0_XBnQPT" --zk_session_timeout="10secs"
I1019 21:44:52.786234  6684 credentials.hpp:86] Loading credential for authentication from
'/tmp/Endpoint_SlaveEndpointTest_NoAuthorizer_0_IxUQrt/credential'
I1019 21:44:52.786391  6684 slave.cpp:287] Agent using credential for: test-principal
I1019 21:44:52.786418  6684 credentials.hpp:37] Loading credentials for authentication from
'/tmp/Endpoint_SlaveEndpointTest_NoAuthorizer_0_IxUQrt/http_credentials'
I1019 21:44:52.786787  6684 http.cpp:1045] Creating default 'basic' HTTP authenticator for
realm 'mesos-agent-readonly'
I1019 21:44:52.786978  6684 http.cpp:1045] Creating default 'basic' HTTP authenticator for
realm 'mesos-agent-readwrite'
I1019 21:44:52.788269  6684 slave.cpp:585] Agent resources: [{"name":"cpus","scalar":{"value":2.0},"type":"SCALAR"},{"name":"mem","scalar":{"value":1024.0},"type":"SCALAR"},{"name":"disk","scalar":{"value":1024.0},"type":"SCALAR"},{"name":"ports","ranges":{"range":[{"begin":31000,"end":32000}]},"type":"RANGES"}]
I1019 21:44:52.788689  6684 slave.cpp:593] Agent attributes: [  ]
I1019 21:44:52.788719  6684 slave.cpp:602] Agent hostname: ea801433af8a
I1019 21:44:52.788838  6685 status_update_manager.cpp:177] Pausing sending status updates
I1019 21:44:52.790261  6693 state.cpp:64] Recovering state from '/tmp/Endpoint_SlaveEndpointTest_NoAuthorizer_0_XBnQPT/meta'
I1019 21:44:52.790483  6688 status_update_manager.cpp:203] Recovering status update manager
I1019 21:44:52.790657  6690 containerizer.cpp:649] Recovering containerizer
I1019 21:44:52.791685  6679 provisioner.cpp:416] Provisioner recovery complete
I1019 21:44:52.791950  6685 slave.cpp:6310] Finished recovery
I1019 21:44:52.794459  6676 process.cpp:3927] Handling HTTP event for process 'slave(823)'
with path: '/slave(823)/monitor/statistics'
I1019 21:44:52.795436  6694 http.cpp:1185] HTTP GET for /slave(823)/monitor/statistics from
172.17.0.3:47080
I1019 21:44:52.795493  6694 http.cpp:976] Authorizing principal 'test-principal' to GET the
'/monitor/statistics' endpoint
I1019 21:44:52.797732  6673 slave.cpp:869] Agent terminating
[       OK ] Endpoint/SlaveEndpointTest.NoAuthorizer/0 (25 ms)
[ RUN      ] Endpoint/SlaveEndpointTest.NoAuthorizer/1
I1019 21:44:52.807432  6673 containerizer.cpp:292] Using isolation { environment_secret, posix/cpu,
posix/mem, filesystem/posix, network/cni }
W1019 21:44:52.807868  6673 backend.cpp:76] Failed to create 'aufs' backend: AufsBackend requires
root privileges
W1019 21:44:52.807977  6673 backend.cpp:76] Failed to create 'bind' backend: BindBackend requires
root privileges
I1019 21:44:52.808013  6673 provisioner.cpp:255] Using default backend 'copy'
I1019 21:44:52.809461  6673 cluster.cpp:448] Creating default 'local' authorizer
I1019 21:44:52.811178  6680 slave.cpp:254] Mesos agent started on (824)@172.17.0.3:42787
I1019 21:44:52.811214  6680 slave.cpp:255] Flags at startup: --acls="" --appc_simple_discovery_uri_prefix="http://"
--appc_store_dir="/tmp/Endpoint_SlaveEndpointTest_NoAuthorizer_1_9L4L6L/store/appc" --authenticate_http_readonly="true"
--authenticate_http_readwrite="true" --authenticatee="crammd5" --authentication_backoff_factor="1secs"
--authorizer="local" --cgroups_cpu_enable_pids_and_tids_count="false" --cgroups_enable_cfs="false"
--cgroups_hierarchy="/sys/fs/cgroup" --cgroups_limit_swap="false" --cgroups_root="mesos" --container_disk_watch_interval="15secs"
--containerizers="mesos" --credential="/tmp/Endpoint_SlaveEndpointTest_NoAuthorizer_1_9L4L6L/credential"
--default_role="*" --disallow_sharing_agent_pid_namespace="false" --disk_watch_interval="1mins"
--docker="docker" --docker_kill_orphans="true" --docker_registry="https://registry-1.docker.io"
--docker_remove_delay="6hrs" --docker_socket="/var/run/docker.sock" --docker_stop_timeout="0ns"
--docker_store_dir="/tmp/Endpoint_SlaveEndpointTest_NoAuthorizer_1_9L4L6L/store/docker" --docker_volume_checkpoint_dir="/var/run/mesos/isolators/docker/volume"
--enforce_container_disk_quota="false" --executor_registration_timeout="1mins" --executor_reregistration_timeout="2secs"
--executor_shutdown_grace_period="5secs" --fetcher_cache_dir="/tmp/Endpoint_SlaveEndpointTest_NoAuthorizer_1_9L4L6L/fetch"
--fetcher_cache_size="2GB" --frameworks_home="" --gc_delay="1weeks" --gc_disk_headroom="0.1"
--hadoop_home="" --help="false" --hostname_lookup="true" --http_command_executor="false" --http_credentials="/tmp/Endpoint_SlaveEndpointTest_NoAuthorizer_1_9L4L6L/http_credentials"
--http_heartbeat_interval="30secs" --initialize_driver_logging="true" --isolation="posix/cpu,posix/mem"
--launcher="posix" --launcher_dir="/mesos/mesos-1.5.0/_build/src" --logbufsecs="0" --logging_level="INFO"
--max_completed_executors_per_framework="150" --oversubscribed_resources_interval="15secs"
--perf_duration="10secs" --perf_interval="1mins" --port="5051" --qos_correction_interval_min="0ns"
--quiet="false" --recover="reconnect" --recovery_timeout="15mins" --registration_backoff_factor="10ms"
--resources="cpus:2;gpus:0;mem:1024;disk:1024;ports:[31000-32000]" --revocable_cpu_low_priority="true"
--runtime_dir="/tmp/Endpoint_SlaveEndpointTest_NoAuthorizer_1_9L4L6L" --sandbox_directory="/mnt/mesos/sandbox"
--strict="true" --switch_user="true" --systemd_enable_support="true" --systemd_runtime_directory="/run/systemd/system"
--version="false" --work_dir="/tmp/Endpoint_SlaveEndpointTest_NoAuthorizer_1_zP4Zqc" --zk_session_timeout="10secs"
I1019 21:44:52.811748  6680 credentials.hpp:86] Loading credential for authentication from
'/tmp/Endpoint_SlaveEndpointTest_NoAuthorizer_1_9L4L6L/credential'
I1019 21:44:52.811928  6680 slave.cpp:287] Agent using credential for: test-principal
I1019 21:44:52.811955  6680 credentials.hpp:37] Loading credentials for authentication from
'/tmp/Endpoint_SlaveEndpointTest_NoAuthorizer_1_9L4L6L/http_credentials'
I1019 21:44:52.812261  6680 http.cpp:1045] Creating default 'basic' HTTP authenticator for
realm 'mesos-agent-readonly'
I1019 21:44:52.812432  6680 http.cpp:1045] Creating default 'basic' HTTP authenticator for
realm 'mesos-agent-readwrite'
I1019 21:44:52.813771  6680 slave.cpp:585] Agent resources: [{"name":"cpus","scalar":{"value":2.0},"type":"SCALAR"},{"name":"mem","scalar":{"value":1024.0},"type":"SCALAR"},{"name":"disk","scalar":{"value":1024.0},"type":"SCALAR"},{"name":"ports","ranges":{"range":[{"begin":31000,"end":32000}]},"type":"RANGES"}]
I1019 21:44:52.814141  6680 slave.cpp:593] Agent attributes: [  ]
I1019 21:44:52.814172  6680 slave.cpp:602] Agent hostname: ea801433af8a
I1019 21:44:52.814292  6683 status_update_manager.cpp:177] Pausing sending status updates
I1019 21:44:52.815572  6679 state.cpp:64] Recovering state from '/tmp/Endpoint_SlaveEndpointTest_NoAuthorizer_1_zP4Zqc/meta'
I1019 21:44:52.815821  6687 status_update_manager.cpp:203] Recovering status update manager
I1019 21:44:52.815989  6693 containerizer.cpp:649] Recovering containerizer
I1019 21:44:52.816969  6689 provisioner.cpp:416] Provisioner recovery complete
I1019 21:44:52.817217  6683 slave.cpp:6310] Finished recovery
I1019 21:44:52.819619  6677 process.cpp:3927] Handling HTTP event for process 'slave(824)'
with path: '/slave(824)/monitor/statistics.json'
I1019 21:44:52.820580  6691 http.cpp:1185] HTTP GET for /slave(824)/monitor/statistics.json
from 172.17.0.3:47090
I1019 21:44:52.820638  6691 http.cpp:976] Authorizing principal 'test-principal' to GET the
'/monitor/statistics.json' endpoint
I1019 21:44:52.822815  6695 slave.cpp:869] Agent terminating
[       OK ] Endpoint/SlaveEndpointTest.NoAuthorizer/1 (25 ms)
[ RUN      ] Endpoint/SlaveEndpointTest.NoAuthorizer/2
I1019 21:44:52.832108  6673 containerizer.cpp:292] Using isolation { environment_secret, posix/cpu,
posix/mem, filesystem/posix, network/cni }
W1019 21:44:52.832535  6673 backend.cpp:76] Failed to create 'aufs' backend: AufsBackend requires
root privileges
W1019 21:44:52.832641  6673 backend.cpp:76] Failed to create 'bind' backend: BindBackend requires
root privileges
I1019 21:44:52.832671  6673 provisioner.cpp:255] Using default backend 'copy'
I1019 21:44:52.834094  6673 cluster.cpp:448] Creating default 'local' authorizer
I1019 21:44:52.835763  6697 slave.cpp:254] Mesos agent started on (825)@172.17.0.3:42787
I1019 21:44:52.835781  6697 slave.cpp:255] Flags at startup: --acls="" --appc_simple_discovery_uri_prefix="http://"
--appc_store_dir="/tmp/Endpoint_SlaveEndpointTest_NoAuthorizer_2_3hFw04/store/appc" --authenticate_http_readonly="true"
--authenticate_http_readwrite="true" --authenticatee="crammd5" --authentication_backoff_factor="1secs"
--authorizer="local" --cgroups_cpu_enable_pids_and_tids_count="false" --cgroups_enable_cfs="false"
--cgroups_hierarchy="/sys/fs/cgroup" --cgroups_limit_swap="false" --cgroups_root="mesos" --container_disk_watch_interval="15secs"
--containerizers="mesos" --credential="/tmp/Endpoint_SlaveEndpointTest_NoAuthorizer_2_3hFw04/credential"
--default_role="*" --disallow_sharing_agent_pid_namespace="false" --disk_watch_interval="1mins"
--docker="docker" --docker_kill_orphans="true" --docker_registry="https://registry-1.docker.io"
--docker_remove_delay="6hrs" --docker_socket="/var/run/docker.sock" --docker_stop_timeout="0ns"
--docker_store_dir="/tmp/Endpoint_SlaveEndpointTest_NoAuthorizer_2_3hFw04/store/docker" --docker_volume_checkpoint_dir="/var/run/mesos/isolators/docker/volume"
--enforce_container_disk_quota="false" --executor_registration_timeout="1mins" --executor_reregistration_timeout="2secs"
--executor_shutdown_grace_period="5secs" --fetcher_cache_dir="/tmp/Endpoint_SlaveEndpointTest_NoAuthorizer_2_3hFw04/fetch"
--fetcher_cache_size="2GB" --frameworks_home="" --gc_delay="1weeks" --gc_disk_headroom="0.1"
--hadoop_home="" --help="false" --hostname_lookup="true" --http_command_executor="false" --http_credentials="/tmp/Endpoint_SlaveEndpointTest_NoAuthorizer_2_3hFw04/http_credentials"
--http_heartbeat_interval="30secs" --initialize_driver_logging="true" --isolation="posix/cpu,posix/mem"
--launcher="posix" --launcher_dir="/mesos/mesos-1.5.0/_build/src" --logbufsecs="0" --logging_level="INFO"
--max_completed_executors_per_framework="150" --oversubscribed_resources_interval="15secs"
--perf_duration="10secs" --perf_interval="1mins" --port="5051" --qos_correction_interval_min="0ns"
--quiet="false" --recover="reconnect" --recovery_timeout="15mins" --registration_backoff_factor="10ms"
--resources="cpus:2;gpus:0;mem:1024;disk:1024;ports:[31000-32000]" --revocable_cpu_low_priority="true"
--runtime_dir="/tmp/Endpoint_SlaveEndpointTest_NoAuthorizer_2_3hFw04" --sandbox_directory="/mnt/mesos/sandbox"
--strict="true" --switch_user="true" --systemd_enable_support="true" --systemd_runtime_directory="/run/systemd/system"
--version="false" --work_dir="/tmp/Endpoint_SlaveEndpointTest_NoAuthorizer_2_qwm4gv" --zk_session_timeout="10secs"
I1019 21:44:52.836102  6697 credentials.hpp:86] Loading credential for authentication from
'/tmp/Endpoint_SlaveEndpointTest_NoAuthorizer_2_3hFw04/credential'
I1019 21:44:52.836230  6697 slave.cpp:287] Agent using credential for: test-principal
I1019 21:44:52.836249  6697 credentials.hpp:37] Loading credentials for authentication from
'/tmp/Endpoint_SlaveEndpointTest_NoAuthorizer_2_3hFw04/http_credentials'
I1019 21:44:52.836444  6697 http.cpp:1045] Creating default 'basic' HTTP authenticator for
realm 'mesos-agent-readonly'
I1019 21:44:52.836575  6697 http.cpp:1045] Creating default 'basic' HTTP authenticator for
realm 'mesos-agent-readwrite'
I1019 21:44:52.837738  6697 slave.cpp:585] Agent resources: [{"name":"cpus","scalar":{"value":2.0},"type":"SCALAR"},{"name":"mem","scalar":{"value":1024.0},"type":"SCALAR"},{"name":"disk","scalar":{"value":1024.0},"type":"SCALAR"},{"name":"ports","ranges":{"range":[{"begin":31000,"end":32000}]},"type":"RANGES"}]
I1019 21:44:52.837939  6697 slave.cpp:593] Agent attributes: [  ]
I1019 21:44:52.837952  6697 slave.cpp:602] Agent hostname: ea801433af8a
I1019 21:44:52.838054  6691 status_update_manager.cpp:177] Pausing sending status updates
I1019 21:44:52.839252  6680 state.cpp:64] Recovering state from '/tmp/Endpoint_SlaveEndpointTest_NoAuthorizer_2_qwm4gv/meta'
I1019 21:44:52.839534  6682 status_update_manager.cpp:203] Recovering status update manager
I1019 21:44:52.839684  6687 containerizer.cpp:649] Recovering containerizer
I1019 21:44:52.840647  6684 provisioner.cpp:416] Provisioner recovery complete
I1019 21:44:52.840901  6691 slave.cpp:6310] Finished recovery
I1019 21:44:52.843152  6692 process.cpp:3927] Handling HTTP event for process 'slave(825)'
with path: '/slave(825)/containers'
I1019 21:44:52.844089  6693 http.cpp:1185] HTTP GET for /slave(825)/containers from 172.17.0.3:47092
I1019 21:44:52.844156  6693 http.cpp:976] Authorizing principal 'test-principal' to GET the
'/containers' endpoint
I1019 21:44:52.846493  6689 slave.cpp:869] Agent terminating
[       OK ] Endpoint/SlaveEndpointTest.NoAuthorizer/2 (24 ms)
[----------] 9 tests from Endpoint/SlaveEndpointTest (223 ms total)

[----------] 2 tests from ContainerizerType/DefaultContainerDNSFlagTest
[ RUN      ] ContainerizerType/DefaultContainerDNSFlagTest.ValidateFlag/0
[       OK ] ContainerizerType/DefaultContainerDNSFlagTest.ValidateFlag/0 (9 ms)
[ RUN      ] ContainerizerType/DefaultContainerDNSFlagTest.ValidateFlag/1
[       OK ] ContainerizerType/DefaultContainerDNSFlagTest.ValidateFlag/1 (8 ms)
[----------] 2 tests from ContainerizerType/DefaultContainerDNSFlagTest (17 ms total)

[----------] Global test environment tear-down
[==========] 1693 tests from 185 test cases ran. (504770 ms total)
[  PASSED  ] 1692 tests.
[  FAILED  ] 1 test, listed below:
[  FAILED  ] MasterTest.IgnoreOldAgentReregistration

 1 FAILED TEST
  YOU HAVE 21 DISABLED TESTS

I1019 21:44:52.923527  6698 process.cpp:1067] Failed to accept socket: future discarded
make[4]: *** [check-local] Error 1
make[4]: Leaving directory `/mesos/mesos-1.5.0/_build/src'
make[3]: *** [check-am] Error 2
make[3]: Leaving directory `/mesos/mesos-1.5.0/_build/src'
make[2]: *** [check] Error 2
make[2]: Leaving directory `/mesos/mesos-1.5.0/_build/src'
make[1]: *** [check-recursive] Error 1
make[1]: Leaving directory `/mesos/mesos-1.5.0/_build'
make: *** [distcheck] Error 1
+ docker rmi mesos-1508446758-25921
Untagged: mesos-1508446758-25921:latest
Deleted: sha256:17da07b74bafa2aa2b1f7aceb6434e832adaf543709a6a7adc8c530d654b27cb
Deleted: sha256:42acd84ade86d5cb550207f65f8461f4de36d437eca15d3ec9e2b21c1eb36d19
Deleted: sha256:ff06f9fd41b17f7c6a1dc5e05ab88522747abff9d3be6a53e71bc65fb512bb59
Deleted: sha256:06905560bfb3d911afdc5dfda7d0d7d19e610b2f6484ce9003405e0de0c74631
Deleted: sha256:d210578cd97a4fb8c115d870f40aff64ea1d7d497b05af0a3d2f9abd94dc8c6d
Deleted: sha256:9e8ce6717fa6eea8117157cf35c7b5beb45b226b50ea108e6db3e5f32c4098e0
Deleted: sha256:c5bce27621b3e185d63352d419b63259dad51b412fdd2f6bba65a89038711551
Deleted: sha256:230e40d56a27afd67e8eaeb5ea55cfd89e88e10cb582e9c3ee20d431e2305bae
Deleted: sha256:5f69373850cc52c00e319017a07af4804d1ec9e942c7efea3ff849c1e9cdfdcb
Deleted: sha256:dc2987610dd13d257f859304b443087b5badb21c32a2e508d90035c31d6b22f6
Deleted: sha256:fdd772655304dbfdf4ca2933e31fa3b5d8d0ae3dbd5b9a77e3719ac78202f269
Deleted: sha256:f83b0e2258ad87b60faf870c655e39a14079f67ef6bac918dc310631c10d256b
Deleted: sha256:22e5419fa88727d3bb48c75af2002e2a9f3ce70bf1b9fd3826dd5e70ac2581b6
Deleted: sha256:fbce8cb71a9e17ab1c422d9657f6e645b2b46755a481c8e9a5750e3a66aa059c
Deleted: sha256:2a9b62074e3653771fe64abe1b5b70d96c05ee112f25473a71c08b092b29a8c7
Deleted: sha256:92f1abad026f7ee76dbdc5742502c556d25bdda5f9419f0e7e869e9ee5cf17bf
Deleted: sha256:35434c5d193aad8669a717f05a66c79891604d2431c5e7f2e31fbaed7e609c9a
Deleted: sha256:e297cb8c809e55c7e232d378914b7485358a4a2a735e3ff3eab8ee8bde974fb5
Deleted: sha256:2e3d4f62fbabc031dce1084f81f0d18482077f208775ffb293378be48cf410c5
Deleted: sha256:82a7a6e67bbc41aa219f490800a64b6320f27724ffe9e49d0040f3af2a4363c3
Deleted: sha256:0d7daabe68fc10d2fffc72b8bf8f821b862dc80c452e1f102b435b2f033c1cff
Deleted: sha256:fd8b5a8b0dd671aa9f442452b3d52d11055dd843fe739060ff153020beeb59a9
Deleted: sha256:e5f260c4accd79a3bab8cba3bd9890a55eacd48c0371f30ceaa9c07bf81b7999
Deleted: sha256:de3a89602273172bdb7e9bf6ceb0ea5ee47c81d07dc6a3b4d9378e55220f6b13
Deleted: sha256:93488129d12a3b8ec5fb208ff3cc8024c423ed017c32a99057e14a52700fc36b
Deleted: sha256:a2711ca022f7ec69668aeecb7838623c6e6a739e73723cb71cdb1a26d530a698
Deleted: sha256:1849f8087dc806ac080d59bb4a6ae5e5247ed862b09cd608ae32af438936a335
Deleted: sha256:445a694aad2968f96fec8feadc306a03e4b69b0e944d4f98a0340c71070668a0
Deleted: sha256:5b68bb9900ec395bf96c16754222bb381b897e15eb04ac40670b7bb9f1219f78
Build step 'Execute shell' marked build as failure


Mime
View raw message