mesos-builds mailing list archives

Site index · List index
Message view « Date » · « Thread »
Top « Date » · « Thread »
From Apache Jenkins Server <jenk...@builds.apache.org>
Subject Build failed in Jenkins: Mesos-Reviewbot #19711
Date Sun, 08 Oct 2017 03:26:15 GMT
See <https://builds.apache.org/job/Mesos-Reviewbot/19711/display/redirect>

------------------------------------------
[...truncated 32.29 MB...]
I1008 03:26:10.143745  5591 credentials.hpp:37] Loading credentials for authentication from
'/tmp/Endpoint_SlaveEndpointTest_AuthorizedRequest_2_6tXUuM/http_credentials'
I1008 03:26:10.143996  5591 http.cpp:1045] Creating default 'basic' HTTP authenticator for
realm 'mesos-agent-readonly'
I1008 03:26:10.144141  5591 http.cpp:1045] Creating default 'basic' HTTP authenticator for
realm 'mesos-agent-readwrite'
I1008 03:26:10.145468  5591 slave.cpp:585] Agent resources: [{"name":"cpus","scalar":{"value":2.0},"type":"SCALAR"},{"name":"mem","scalar":{"value":1024.0},"type":"SCALAR"},{"name":"disk","scalar":{"value":1024.0},"type":"SCALAR"},{"name":"ports","ranges":{"range":[{"begin":31000,"end":32000}]},"type":"RANGES"}]
I1008 03:26:10.145692  5591 slave.cpp:593] Agent attributes: [  ]
I1008 03:26:10.145707  5591 slave.cpp:602] Agent hostname: f3a559fc27ab
I1008 03:26:10.145853  5590 status_update_manager.cpp:177] Pausing sending status updates
I1008 03:26:10.147254  5589 state.cpp:64] Recovering state from '/tmp/Endpoint_SlaveEndpointTest_AuthorizedRequest_2_D4GbhB/meta'
I1008 03:26:10.147539  5576 status_update_manager.cpp:203] Recovering status update manager
I1008 03:26:10.147719  5592 containerizer.cpp:648] Recovering containerizer
I1008 03:26:10.148860  5581 provisioner.cpp:416] Provisioner recovery complete
I1008 03:26:10.149178  5574 slave.cpp:6326] Finished recovery
I1008 03:26:10.149619  5574 slave.cpp:6512] Querying resource estimator for oversubscribable
resources
I1008 03:26:10.149857  5572 slave.cpp:6526] Received oversubscribable resources {} from the
resource estimator
I1008 03:26:10.151998  5577 process.cpp:3929] Handling HTTP event for process 'slave(822)'
with path: '/slave(822)/containers'
I1008 03:26:10.153177  5580 http.cpp:1185] HTTP GET for /slave(822)/containers from 172.17.0.4:50978
I1008 03:26:10.153242  5580 http.cpp:976] Authorizing principal 'test-principal' to GET the
'/containers' endpoint
I1008 03:26:10.156319  5583 slave.cpp:869] Agent terminating
[       OK ] Endpoint/SlaveEndpointTest.AuthorizedRequest/2 (30 ms)
[ RUN      ] Endpoint/SlaveEndpointTest.UnauthorizedRequest/0
I1008 03:26:10.169776  5571 containerizer.cpp:292] Using isolation { environment_secret, posix/cpu,
posix/mem, filesystem/posix, network/cni }
W1008 03:26:10.170282  5571 backend.cpp:76] Failed to create 'aufs' backend: AufsBackend requires
root privileges
W1008 03:26:10.170425  5571 backend.cpp:76] Failed to create 'bind' backend: BindBackend requires
root privileges
I1008 03:26:10.170460  5571 provisioner.cpp:255] Using default backend 'copy'
I1008 03:26:10.173931  5578 slave.cpp:254] Mesos agent started on (823)@172.17.0.4:44646
I1008 03:26:10.173957  5578 slave.cpp:255] Flags at startup: --acls="" --appc_simple_discovery_uri_prefix="http://"
--appc_store_dir="/tmp/Endpoint_SlaveEndpointTest_UnauthorizedRequest_0_mRv0Cv/store/appc"
--authenticate_http_readonly="true" --authenticate_http_readwrite="true" --authenticatee="crammd5"
--authentication_backoff_factor="1secs" --authorizer="local" --cgroups_cpu_enable_pids_and_tids_count="false"
--cgroups_enable_cfs="false" --cgroups_hierarchy="/sys/fs/cgroup" --cgroups_limit_swap="false"
--cgroups_root="mesos" --container_disk_watch_interval="15secs" --containerizers="mesos" --credential="/tmp/Endpoint_SlaveEndpointTest_UnauthorizedRequest_0_mRv0Cv/credential"
--default_role="*" --disallow_sharing_agent_pid_namespace="false" --disk_watch_interval="1mins"
--docker="docker" --docker_kill_orphans="true" --docker_registry="https://registry-1.docker.io"
--docker_remove_delay="6hrs" --docker_socket="/var/run/docker.sock" --docker_stop_timeout="0ns"
--docker_store_dir="/tmp/Endpoint_SlaveEndpointTest_UnauthorizedRequest_0_mRv0Cv/store/docker"
--docker_volume_checkpoint_dir="/var/run/mesos/isolators/docker/volume" --enforce_container_disk_quota="false"
--executor_registration_timeout="1mins" --executor_reregistration_timeout="2secs" --executor_shutdown_grace_period="5secs"
--fetcher_cache_dir="/tmp/Endpoint_SlaveEndpointTest_UnauthorizedRequest_0_mRv0Cv/fetch" --fetcher_cache_size="2GB"
--frameworks_home="" --gc_delay="1weeks" --gc_disk_headroom="0.1" --hadoop_home="" --help="false"
--hostname_lookup="true" --http_command_executor="false" --http_credentials="/tmp/Endpoint_SlaveEndpointTest_UnauthorizedRequest_0_mRv0Cv/http_credentials"
--http_heartbeat_interval="30secs" --initialize_driver_logging="true" --isolation="posix/cpu,posix/mem"
--launcher="posix" --launcher_dir="/mesos/mesos-1.5.0/_build/src" --logbufsecs="0" --logging_level="INFO"
--max_completed_executors_per_framework="150" --oversubscribed_resources_interval="15secs"
--perf_duration="10secs" --perf_interval="1mins" --port="5051" --qos_correction_interval_min="0ns"
--quiet="false" --recover="reconnect" --recovery_timeout="15mins" --registration_backoff_factor="10ms"
--resources="cpus:2;gpus:0;mem:1024;disk:1024;ports:[31000-32000]" --revocable_cpu_low_priority="true"
--runtime_dir="/tmp/Endpoint_SlaveEndpointTest_UnauthorizedRequest_0_mRv0Cv" --sandbox_directory="/mnt/mesos/sandbox"
--strict="true" --switch_user="true" --systemd_enable_support="true" --systemd_runtime_directory="/run/systemd/system"
--version="false" --work_dir="/tmp/Endpoint_SlaveEndpointTest_UnauthorizedRequest_0_vSrKkk"
--zk_session_timeout="10secs"
I1008 03:26:10.174381  5578 credentials.hpp:86] Loading credential for authentication from
'/tmp/Endpoint_SlaveEndpointTest_UnauthorizedRequest_0_mRv0Cv/credential'
I1008 03:26:10.174558  5578 slave.cpp:287] Agent using credential for: test-principal
I1008 03:26:10.174582  5578 credentials.hpp:37] Loading credentials for authentication from
'/tmp/Endpoint_SlaveEndpointTest_UnauthorizedRequest_0_mRv0Cv/http_credentials'
I1008 03:26:10.174854  5578 http.cpp:1045] Creating default 'basic' HTTP authenticator for
realm 'mesos-agent-readonly'
I1008 03:26:10.175014  5578 http.cpp:1045] Creating default 'basic' HTTP authenticator for
realm 'mesos-agent-readwrite'
I1008 03:26:10.176364  5578 slave.cpp:585] Agent resources: [{"name":"cpus","scalar":{"value":2.0},"type":"SCALAR"},{"name":"mem","scalar":{"value":1024.0},"type":"SCALAR"},{"name":"disk","scalar":{"value":1024.0},"type":"SCALAR"},{"name":"ports","ranges":{"range":[{"begin":31000,"end":32000}]},"type":"RANGES"}]
I1008 03:26:10.176594  5578 slave.cpp:593] Agent attributes: [  ]
I1008 03:26:10.176609  5578 slave.cpp:602] Agent hostname: f3a559fc27ab
I1008 03:26:10.176745  5590 status_update_manager.cpp:177] Pausing sending status updates
I1008 03:26:10.178158  5573 state.cpp:64] Recovering state from '/tmp/Endpoint_SlaveEndpointTest_UnauthorizedRequest_0_vSrKkk/meta'
I1008 03:26:10.178464  5572 status_update_manager.cpp:203] Recovering status update manager
I1008 03:26:10.178697  5575 containerizer.cpp:648] Recovering containerizer
I1008 03:26:10.180618  5593 provisioner.cpp:416] Provisioner recovery complete
I1008 03:26:10.181406  5593 slave.cpp:6326] Finished recovery
I1008 03:26:10.182046  5593 slave.cpp:6512] Querying resource estimator for oversubscribable
resources
I1008 03:26:10.182334  5576 slave.cpp:6526] Received oversubscribable resources {} from the
resource estimator
I1008 03:26:10.185180  5589 process.cpp:3929] Handling HTTP event for process 'slave(823)'
with path: '/slave(823)/monitor/statistics'
I1008 03:26:10.186774  5581 http.cpp:1185] HTTP GET for /slave(823)/monitor/statistics from
172.17.0.4:50980
I1008 03:26:10.186905  5581 http.cpp:976] Authorizing principal 'test-principal' to GET the
'/monitor/statistics' endpoint
I1008 03:26:10.190541  5571 slave.cpp:869] Agent terminating
[       OK ] Endpoint/SlaveEndpointTest.UnauthorizedRequest/0 (36 ms)
[ RUN      ] Endpoint/SlaveEndpointTest.UnauthorizedRequest/1
I1008 03:26:10.209805  5571 containerizer.cpp:292] Using isolation { environment_secret, posix/cpu,
posix/mem, filesystem/posix, network/cni }
W1008 03:26:10.210650  5571 backend.cpp:76] Failed to create 'aufs' backend: AufsBackend requires
root privileges
W1008 03:26:10.210831  5571 backend.cpp:76] Failed to create 'bind' backend: BindBackend requires
root privileges
I1008 03:26:10.210892  5571 provisioner.cpp:255] Using default backend 'copy'
I1008 03:26:10.216559  5588 slave.cpp:254] Mesos agent started on (824)@172.17.0.4:44646
I1008 03:26:10.216593  5588 slave.cpp:255] Flags at startup: --acls="" --appc_simple_discovery_uri_prefix="http://"
--appc_store_dir="/tmp/Endpoint_SlaveEndpointTest_UnauthorizedRequest_1_P8VK6e/store/appc"
--authenticate_http_readonly="true" --authenticate_http_readwrite="true" --authenticatee="crammd5"
--authentication_backoff_factor="1secs" --authorizer="local" --cgroups_cpu_enable_pids_and_tids_count="false"
--cgroups_enable_cfs="false" --cgroups_hierarchy="/sys/fs/cgroup" --cgroups_limit_swap="false"
--cgroups_root="mesos" --container_disk_watch_interval="15secs" --containerizers="mesos" --credential="/tmp/Endpoint_SlaveEndpointTest_UnauthorizedRequest_1_P8VK6e/credential"
--default_role="*" --disallow_sharing_agent_pid_namespace="false" --disk_watch_interval="1mins"
--docker="docker" --docker_kill_orphans="true" --docker_registry="https://registry-1.docker.io"
--docker_remove_delay="6hrs" --docker_socket="/var/run/docker.sock" --docker_stop_timeout="0ns"
--docker_store_dir="/tmp/Endpoint_SlaveEndpointTest_UnauthorizedRequest_1_P8VK6e/store/docker"
--docker_volume_checkpoint_dir="/var/run/mesos/isolators/docker/volume" --enforce_container_disk_quota="false"
--executor_registration_timeout="1mins" --executor_reregistration_timeout="2secs" --executor_shutdown_grace_period="5secs"
--fetcher_cache_dir="/tmp/Endpoint_SlaveEndpointTest_UnauthorizedRequest_1_P8VK6e/fetch" --fetcher_cache_size="2GB"
--frameworks_home="" --gc_delay="1weeks" --gc_disk_headroom="0.1" --hadoop_home="" --help="false"
--hostname_lookup="true" --http_command_executor="false" --http_credentials="/tmp/Endpoint_SlaveEndpointTest_UnauthorizedRequest_1_P8VK6e/http_credentials"
--http_heartbeat_interval="30secs" --initialize_driver_logging="true" --isolation="posix/cpu,posix/mem"
--launcher="posix" --launcher_dir="/mesos/mesos-1.5.0/_build/src" --logbufsecs="0" --logging_level="INFO"
--max_completed_executors_per_framework="150" --oversubscribed_resources_interval="15secs"
--perf_duration="10secs" --perf_interval="1mins" --port="5051" --qos_correction_interval_min="0ns"
--quiet="false" --recover="reconnect" --recovery_timeout="15mins" --registration_backoff_factor="10ms"
--resources="cpus:2;gpus:0;mem:1024;disk:1024;ports:[31000-32000]" --revocable_cpu_low_priority="true"
--runtime_dir="/tmp/Endpoint_SlaveEndpointTest_UnauthorizedRequest_1_P8VK6e" --sandbox_directory="/mnt/mesos/sandbox"
--strict="true" --switch_user="true" --systemd_enable_support="true" --systemd_runtime_directory="/run/systemd/system"
--version="false" --work_dir="/tmp/Endpoint_SlaveEndpointTest_UnauthorizedRequest_1_8W9NI3"
--zk_session_timeout="10secs"
I1008 03:26:10.217141  5588 credentials.hpp:86] Loading credential for authentication from
'/tmp/Endpoint_SlaveEndpointTest_UnauthorizedRequest_1_P8VK6e/credential'
I1008 03:26:10.217366  5588 slave.cpp:287] Agent using credential for: test-principal
I1008 03:26:10.217389  5588 credentials.hpp:37] Loading credentials for authentication from
'/tmp/Endpoint_SlaveEndpointTest_UnauthorizedRequest_1_P8VK6e/http_credentials'
I1008 03:26:10.217674  5588 http.cpp:1045] Creating default 'basic' HTTP authenticator for
realm 'mesos-agent-readonly'
I1008 03:26:10.217849  5588 http.cpp:1045] Creating default 'basic' HTTP authenticator for
realm 'mesos-agent-readwrite'
I1008 03:26:10.219338  5588 slave.cpp:585] Agent resources: [{"name":"cpus","scalar":{"value":2.0},"type":"SCALAR"},{"name":"mem","scalar":{"value":1024.0},"type":"SCALAR"},{"name":"disk","scalar":{"value":1024.0},"type":"SCALAR"},{"name":"ports","ranges":{"range":[{"begin":31000,"end":32000}]},"type":"RANGES"}]
I1008 03:26:10.219594  5588 slave.cpp:593] Agent attributes: [  ]
I1008 03:26:10.219610  5588 slave.cpp:602] Agent hostname: f3a559fc27ab
I1008 03:26:10.219866  5586 status_update_manager.cpp:177] Pausing sending status updates
I1008 03:26:10.221153  5580 state.cpp:64] Recovering state from '/tmp/Endpoint_SlaveEndpointTest_UnauthorizedRequest_1_8W9NI3/meta'
I1008 03:26:10.221391  5580 status_update_manager.cpp:203] Recovering status update manager
I1008 03:26:10.221591  5579 containerizer.cpp:648] Recovering containerizer
I1008 03:26:10.223457  5575 provisioner.cpp:416] Provisioner recovery complete
I1008 03:26:10.223870  5575 slave.cpp:6326] Finished recovery
I1008 03:26:10.224428  5575 slave.cpp:6512] Querying resource estimator for oversubscribable
resources
I1008 03:26:10.224699  5578 slave.cpp:6526] Received oversubscribable resources {} from the
resource estimator
I1008 03:26:10.228376  5582 process.cpp:3929] Handling HTTP event for process 'slave(824)'
with path: '/slave(824)/monitor/statistics.json'
I1008 03:26:10.230020  5593 http.cpp:1185] HTTP GET for /slave(824)/monitor/statistics.json
from 172.17.0.4:50982
I1008 03:26:10.230089  5593 http.cpp:976] Authorizing principal 'test-principal' to GET the
'/monitor/statistics.json' endpoint
I1008 03:26:10.232621  5571 slave.cpp:869] Agent terminating
[       OK ] Endpoint/SlaveEndpointTest.UnauthorizedRequest/1 (39 ms)
[ RUN      ] Endpoint/SlaveEndpointTest.UnauthorizedRequest/2
I1008 03:26:10.247319  5571 containerizer.cpp:292] Using isolation { environment_secret, posix/cpu,
posix/mem, filesystem/posix, network/cni }
W1008 03:26:10.248018  5571 backend.cpp:76] Failed to create 'aufs' backend: AufsBackend requires
root privileges
W1008 03:26:10.248165  5571 backend.cpp:76] Failed to create 'bind' backend: BindBackend requires
root privileges
I1008 03:26:10.248209  5571 provisioner.cpp:255] Using default backend 'copy'
I1008 03:26:10.253348  5590 slave.cpp:254] Mesos agent started on (825)@172.17.0.4:44646
I1008 03:26:10.253396  5590 slave.cpp:255] Flags at startup: --acls="" --appc_simple_discovery_uri_prefix="http://"
--appc_store_dir="/tmp/Endpoint_SlaveEndpointTest_UnauthorizedRequest_2_NLBfYY/store/appc"
--authenticate_http_readonly="true" --authenticate_http_readwrite="true" --authenticatee="crammd5"
--authentication_backoff_factor="1secs" --authorizer="local" --cgroups_cpu_enable_pids_and_tids_count="false"
--cgroups_enable_cfs="false" --cgroups_hierarchy="/sys/fs/cgroup" --cgroups_limit_swap="false"
--cgroups_root="mesos" --container_disk_watch_interval="15secs" --containerizers="mesos" --credential="/tmp/Endpoint_SlaveEndpointTest_UnauthorizedRequest_2_NLBfYY/credential"
--default_role="*" --disallow_sharing_agent_pid_namespace="false" --disk_watch_interval="1mins"
--docker="docker" --docker_kill_orphans="true" --docker_registry="https://registry-1.docker.io"
--docker_remove_delay="6hrs" --docker_socket="/var/run/docker.sock" --docker_stop_timeout="0ns"
--docker_store_dir="/tmp/Endpoint_SlaveEndpointTest_UnauthorizedRequest_2_NLBfYY/store/docker"
--docker_volume_checkpoint_dir="/var/run/mesos/isolators/docker/volume" --enforce_container_disk_quota="false"
--executor_registration_timeout="1mins" --executor_reregistration_timeout="2secs" --executor_shutdown_grace_period="5secs"
--fetcher_cache_dir="/tmp/Endpoint_SlaveEndpointTest_UnauthorizedRequest_2_NLBfYY/fetch" --fetcher_cache_size="2GB"
--frameworks_home="" --gc_delay="1weeks" --gc_disk_headroom="0.1" --hadoop_home="" --help="false"
--hostname_lookup="true" --http_command_executor="false" --http_credentials="/tmp/Endpoint_SlaveEndpointTest_UnauthorizedRequest_2_NLBfYY/http_credentials"
--http_heartbeat_interval="30secs" --initialize_driver_logging="true" --isolation="posix/cpu,posix/mem"
--launcher="posix" --launcher_dir="/mesos/mesos-1.5.0/_build/src" --logbufsecs="0" --logging_level="INFO"
--max_completed_executors_per_framework="150" --oversubscribed_resources_interval="15secs"
--perf_duration="10secs" --perf_interval="1mins" --port="5051" --qos_correction_interval_min="0ns"
--quiet="false" --recover="reconnect" --recovery_timeout="15mins" --registration_backoff_factor="10ms"
--resources="cpus:2;gpus:0;mem:1024;disk:1024;ports:[31000-32000]" --revocable_cpu_low_priority="true"
--runtime_dir="/tmp/Endpoint_SlaveEndpointTest_UnauthorizedRequest_2_NLBfYY" --sandbox_directory="/mnt/mesos/sandbox"
--strict="true" --switch_user="true" --systemd_enable_support="true" --systemd_runtime_directory="/run/systemd/system"
--version="false" --work_dir="/tmp/Endpoint_SlaveEndpointTest_UnauthorizedRequest_2_mJMxuN"
--zk_session_timeout="10secs"
I1008 03:26:10.254058  5590 credentials.hpp:86] Loading credential for authentication from
'/tmp/Endpoint_SlaveEndpointTest_UnauthorizedRequest_2_NLBfYY/credential'
I1008 03:26:10.254274  5590 slave.cpp:287] Agent using credential for: test-principal
I1008 03:26:10.254317  5590 credentials.hpp:37] Loading credentials for authentication from
'/tmp/Endpoint_SlaveEndpointTest_UnauthorizedRequest_2_NLBfYY/http_credentials'
I1008 03:26:10.254604  5590 http.cpp:1045] Creating default 'basic' HTTP authenticator for
realm 'mesos-agent-readonly'
I1008 03:26:10.254798  5590 http.cpp:1045] Creating default 'basic' HTTP authenticator for
realm 'mesos-agent-readwrite'
I1008 03:26:10.256163  5590 slave.cpp:585] Agent resources: [{"name":"cpus","scalar":{"value":2.0},"type":"SCALAR"},{"name":"mem","scalar":{"value":1024.0},"type":"SCALAR"},{"name":"disk","scalar":{"value":1024.0},"type":"SCALAR"},{"name":"ports","ranges":{"range":[{"begin":31000,"end":32000}]},"type":"RANGES"}]
I1008 03:26:10.256395  5590 slave.cpp:593] Agent attributes: [  ]
I1008 03:26:10.256408  5590 slave.cpp:602] Agent hostname: f3a559fc27ab
I1008 03:26:10.256556  5582 status_update_manager.cpp:177] Pausing sending status updates
I1008 03:26:10.257864  5572 state.cpp:64] Recovering state from '/tmp/Endpoint_SlaveEndpointTest_UnauthorizedRequest_2_mJMxuN/meta'
I1008 03:26:10.258517  5587 status_update_manager.cpp:203] Recovering status update manager
I1008 03:26:10.258790  5585 containerizer.cpp:648] Recovering containerizer
I1008 03:26:10.260695  5575 provisioner.cpp:416] Provisioner recovery complete
I1008 03:26:10.261099  5580 slave.cpp:6326] Finished recovery
I1008 03:26:10.261497  5580 slave.cpp:6512] Querying resource estimator for oversubscribable
resources
I1008 03:26:10.261760  5573 slave.cpp:6526] Received oversubscribable resources {} from the
resource estimator
I1008 03:26:10.264770  5581 process.cpp:3929] Handling HTTP event for process 'slave(825)'
with path: '/slave(825)/containers'
I1008 03:26:10.266494  5577 http.cpp:1185] HTTP GET for /slave(825)/containers from 172.17.0.4:50984
I1008 03:26:10.266561  5577 http.cpp:976] Authorizing principal 'test-principal' to GET the
'/containers' endpoint
I1008 03:26:10.269170  5571 slave.cpp:869] Agent terminating
[       OK ] Endpoint/SlaveEndpointTest.UnauthorizedRequest/2 (36 ms)
[ RUN      ] Endpoint/SlaveEndpointTest.NoAuthorizer/0
I1008 03:26:10.284778  5571 containerizer.cpp:292] Using isolation { environment_secret, posix/cpu,
posix/mem, filesystem/posix, network/cni }
W1008 03:26:10.285356  5571 backend.cpp:76] Failed to create 'aufs' backend: AufsBackend requires
root privileges
W1008 03:26:10.285485  5571 backend.cpp:76] Failed to create 'bind' backend: BindBackend requires
root privileges
I1008 03:26:10.285532  5571 provisioner.cpp:255] Using default backend 'copy'
I1008 03:26:10.287632  5571 cluster.cpp:448] Creating default 'local' authorizer
I1008 03:26:10.290128  5590 slave.cpp:254] Mesos agent started on (826)@172.17.0.4:44646
I1008 03:26:10.290156  5590 slave.cpp:255] Flags at startup: --acls="" --appc_simple_discovery_uri_prefix="http://"
--appc_store_dir="/tmp/Endpoint_SlaveEndpointTest_NoAuthorizer_0_tLSLbJ/store/appc" --authenticate_http_readonly="true"
--authenticate_http_readwrite="true" --authenticatee="crammd5" --authentication_backoff_factor="1secs"
--authorizer="local" --cgroups_cpu_enable_pids_and_tids_count="false" --cgroups_enable_cfs="false"
--cgroups_hierarchy="/sys/fs/cgroup" --cgroups_limit_swap="false" --cgroups_root="mesos" --container_disk_watch_interval="15secs"
--containerizers="mesos" --credential="/tmp/Endpoint_SlaveEndpointTest_NoAuthorizer_0_tLSLbJ/credential"
--default_role="*" --disallow_sharing_agent_pid_namespace="false" --disk_watch_interval="1mins"
--docker="docker" --docker_kill_orphans="true" --docker_registry="https://registry-1.docker.io"
--docker_remove_delay="6hrs" --docker_socket="/var/run/docker.sock" --docker_stop_timeout="0ns"
--docker_store_dir="/tmp/Endpoint_SlaveEndpointTest_NoAuthorizer_0_tLSLbJ/store/docker" --docker_volume_checkpoint_dir="/var/run/mesos/isolators/docker/volume"
--enforce_container_disk_quota="false" --executor_registration_timeout="1mins" --executor_reregistration_timeout="2secs"
--executor_shutdown_grace_period="5secs" --fetcher_cache_dir="/tmp/Endpoint_SlaveEndpointTest_NoAuthorizer_0_tLSLbJ/fetch"
--fetcher_cache_size="2GB" --frameworks_home="" --gc_delay="1weeks" --gc_disk_headroom="0.1"
--hadoop_home="" --help="false" --hostname_lookup="true" --http_command_executor="false" --http_credentials="/tmp/Endpoint_SlaveEndpointTest_NoAuthorizer_0_tLSLbJ/http_credentials"
--http_heartbeat_interval="30secs" --initialize_driver_logging="true" --isolation="posix/cpu,posix/mem"
--launcher="posix" --launcher_dir="/mesos/mesos-1.5.0/_build/src" --logbufsecs="0" --logging_level="INFO"
--max_completed_executors_per_framework="150" --oversubscribed_resources_interval="15secs"
--perf_duration="10secs" --perf_interval="1mins" --port="5051" --qos_correction_interval_min="0ns"
--quiet="false" --recover="reconnect" --recovery_timeout="15mins" --registration_backoff_factor="10ms"
--resources="cpus:2;gpus:0;mem:1024;disk:1024;ports:[31000-32000]" --revocable_cpu_low_priority="true"
--runtime_dir="/tmp/Endpoint_SlaveEndpointTest_NoAuthorizer_0_tLSLbJ" --sandbox_directory="/mnt/mesos/sandbox"
--strict="true" --switch_user="true" --systemd_enable_support="true" --systemd_runtime_directory="/run/systemd/system"
--version="false" --work_dir="/tmp/Endpoint_SlaveEndpointTest_NoAuthorizer_0_sNYyCx" --zk_session_timeout="10secs"
I1008 03:26:10.290643  5590 credentials.hpp:86] Loading credential for authentication from
'/tmp/Endpoint_SlaveEndpointTest_NoAuthorizer_0_tLSLbJ/credential'
I1008 03:26:10.290810  5590 slave.cpp:287] Agent using credential for: test-principal
I1008 03:26:10.290833  5590 credentials.hpp:37] Loading credentials for authentication from
'/tmp/Endpoint_SlaveEndpointTest_NoAuthorizer_0_tLSLbJ/http_credentials'
I1008 03:26:10.291076  5590 http.cpp:1045] Creating default 'basic' HTTP authenticator for
realm 'mesos-agent-readonly'
I1008 03:26:10.291232  5590 http.cpp:1045] Creating default 'basic' HTTP authenticator for
realm 'mesos-agent-readwrite'
I1008 03:26:10.292719  5590 slave.cpp:585] Agent resources: [{"name":"cpus","scalar":{"value":2.0},"type":"SCALAR"},{"name":"mem","scalar":{"value":1024.0},"type":"SCALAR"},{"name":"disk","scalar":{"value":1024.0},"type":"SCALAR"},{"name":"ports","ranges":{"range":[{"begin":31000,"end":32000}]},"type":"RANGES"}]
I1008 03:26:10.292943  5590 slave.cpp:593] Agent attributes: [  ]
I1008 03:26:10.292956  5590 slave.cpp:602] Agent hostname: f3a559fc27ab
I1008 03:26:10.293254  5594 status_update_manager.cpp:177] Pausing sending status updates
I1008 03:26:10.294247  5581 state.cpp:64] Recovering state from '/tmp/Endpoint_SlaveEndpointTest_NoAuthorizer_0_sNYyCx/meta'
I1008 03:26:10.294523  5581 status_update_manager.cpp:203] Recovering status update manager
I1008 03:26:10.294719  5586 containerizer.cpp:648] Recovering containerizer
I1008 03:26:10.296356  5584 provisioner.cpp:416] Provisioner recovery complete
I1008 03:26:10.297047  5595 slave.cpp:6326] Finished recovery
I1008 03:26:10.297514  5595 slave.cpp:6512] Querying resource estimator for oversubscribable
resources
I1008 03:26:10.297749  5589 slave.cpp:6526] Received oversubscribable resources {} from the
resource estimator
I1008 03:26:10.300442  5577 process.cpp:3929] Handling HTTP event for process 'slave(826)'
with path: '/slave(826)/monitor/statistics'
I1008 03:26:10.302220  5587 http.cpp:1185] HTTP GET for /slave(826)/monitor/statistics from
172.17.0.4:50986
I1008 03:26:10.302330  5587 http.cpp:976] Authorizing principal 'test-principal' to GET the
'/monitor/statistics' endpoint
I1008 03:26:10.306752  5584 slave.cpp:869] Agent terminating
[       OK ] Endpoint/SlaveEndpointTest.NoAuthorizer/0 (35 ms)
[ RUN      ] Endpoint/SlaveEndpointTest.NoAuthorizer/1
I1008 03:26:10.319973  5571 containerizer.cpp:292] Using isolation { environment_secret, posix/cpu,
posix/mem, filesystem/posix, network/cni }
W1008 03:26:10.320554  5571 backend.cpp:76] Failed to create 'aufs' backend: AufsBackend requires
root privileges
W1008 03:26:10.320690  5571 backend.cpp:76] Failed to create 'bind' backend: BindBackend requires
root privileges
I1008 03:26:10.320727  5571 provisioner.cpp:255] Using default backend 'copy'
I1008 03:26:10.322814  5571 cluster.cpp:448] Creating default 'local' authorizer
I1008 03:26:10.325242  5579 slave.cpp:254] Mesos agent started on (827)@172.17.0.4:44646
I1008 03:26:10.325271  5579 slave.cpp:255] Flags at startup: --acls="" --appc_simple_discovery_uri_prefix="http://"
--appc_store_dir="/tmp/Endpoint_SlaveEndpointTest_NoAuthorizer_1_Z8NFKt/store/appc" --authenticate_http_readonly="true"
--authenticate_http_readwrite="true" --authenticatee="crammd5" --authentication_backoff_factor="1secs"
--authorizer="local" --cgroups_cpu_enable_pids_and_tids_count="false" --cgroups_enable_cfs="false"
--cgroups_hierarchy="/sys/fs/cgroup" --cgroups_limit_swap="false" --cgroups_root="mesos" --container_disk_watch_interval="15secs"
--containerizers="mesos" --credential="/tmp/Endpoint_SlaveEndpointTest_NoAuthorizer_1_Z8NFKt/credential"
--default_role="*" --disallow_sharing_agent_pid_namespace="false" --disk_watch_interval="1mins"
--docker="docker" --docker_kill_orphans="true" --docker_registry="https://registry-1.docker.io"
--docker_remove_delay="6hrs" --docker_socket="/var/run/docker.sock" --docker_stop_timeout="0ns"
--docker_store_dir="/tmp/Endpoint_SlaveEndpointTest_NoAuthorizer_1_Z8NFKt/store/docker" --docker_volume_checkpoint_dir="/var/run/mesos/isolators/docker/volume"
--enforce_container_disk_quota="false" --executor_registration_timeout="1mins" --executor_reregistration_timeout="2secs"
--executor_shutdown_grace_period="5secs" --fetcher_cache_dir="/tmp/Endpoint_SlaveEndpointTest_NoAuthorizer_1_Z8NFKt/fetch"
--fetcher_cache_size="2GB" --frameworks_home="" --gc_delay="1weeks" --gc_disk_headroom="0.1"
--hadoop_home="" --help="false" --hostname_lookup="true" --http_command_executor="false" --http_credentials="/tmp/Endpoint_SlaveEndpointTest_NoAuthorizer_1_Z8NFKt/http_credentials"
--http_heartbeat_interval="30secs" --initialize_driver_logging="true" --isolation="posix/cpu,posix/mem"
--launcher="posix" --launcher_dir="/mesos/mesos-1.5.0/_build/src" --logbufsecs="0" --logging_level="INFO"
--max_completed_executors_per_framework="150" --oversubscribed_resources_interval="15secs"
--perf_duration="10secs" --perf_interval="1mins" --port="5051" --qos_correction_interval_min="0ns"
--quiet="false" --recover="reconnect" --recovery_timeout="15mins" --registration_backoff_factor="10ms"
--resources="cpus:2;gpus:0;mem:1024;disk:1024;ports:[31000-32000]" --revocable_cpu_low_priority="true"
--runtime_dir="/tmp/Endpoint_SlaveEndpointTest_NoAuthorizer_1_Z8NFKt" --sandbox_directory="/mnt/mesos/sandbox"
--strict="true" --switch_user="true" --systemd_enable_support="true" --systemd_runtime_directory="/run/systemd/system"
--version="false" --work_dir="/tmp/Endpoint_SlaveEndpointTest_NoAuthorizer_1_UQ285h" --zk_session_timeout="10secs"
I1008 03:26:10.325692  5579 credentials.hpp:86] Loading credential for authentication from
'/tmp/Endpoint_SlaveEndpointTest_NoAuthorizer_1_Z8NFKt/credential'
I1008 03:26:10.325836  5579 slave.cpp:287] Agent using credential for: test-principal
I1008 03:26:10.325858  5579 credentials.hpp:37] Loading credentials for authentication from
'/tmp/Endpoint_SlaveEndpointTest_NoAuthorizer_1_Z8NFKt/http_credentials'
I1008 03:26:10.326081  5579 http.cpp:1045] Creating default 'basic' HTTP authenticator for
realm 'mesos-agent-readonly'
I1008 03:26:10.326228  5579 http.cpp:1045] Creating default 'basic' HTTP authenticator for
realm 'mesos-agent-readwrite'
I1008 03:26:10.327620  5579 slave.cpp:585] Agent resources: [{"name":"cpus","scalar":{"value":2.0},"type":"SCALAR"},{"name":"mem","scalar":{"value":1024.0},"type":"SCALAR"},{"name":"disk","scalar":{"value":1024.0},"type":"SCALAR"},{"name":"ports","ranges":{"range":[{"begin":31000,"end":32000}]},"type":"RANGES"}]
I1008 03:26:10.327850  5579 slave.cpp:593] Agent attributes: [  ]
I1008 03:26:10.327864  5579 slave.cpp:602] Agent hostname: f3a559fc27ab
I1008 03:26:10.328100  5594 status_update_manager.cpp:177] Pausing sending status updates
I1008 03:26:10.329488  5584 state.cpp:64] Recovering state from '/tmp/Endpoint_SlaveEndpointTest_NoAuthorizer_1_UQ285h/meta'
I1008 03:26:10.330093  5590 status_update_manager.cpp:203] Recovering status update manager
I1008 03:26:10.330497  5592 containerizer.cpp:648] Recovering containerizer
I1008 03:26:10.332228  5577 provisioner.cpp:416] Provisioner recovery complete
I1008 03:26:10.332759  5578 slave.cpp:6326] Finished recovery
I1008 03:26:10.333431  5578 slave.cpp:6512] Querying resource estimator for oversubscribable
resources
I1008 03:26:10.333757  5589 slave.cpp:6526] Received oversubscribable resources {} from the
resource estimator
I1008 03:26:10.336807  5573 process.cpp:3929] Handling HTTP event for process 'slave(827)'
with path: '/slave(827)/monitor/statistics.json'
I1008 03:26:10.337931  5586 http.cpp:1185] HTTP GET for /slave(827)/monitor/statistics.json
from 172.17.0.4:50988
I1008 03:26:10.338047  5586 http.cpp:976] Authorizing principal 'test-principal' to GET the
'/monitor/statistics.json' endpoint
I1008 03:26:10.342578  5571 slave.cpp:869] Agent terminating
[       OK ] Endpoint/SlaveEndpointTest.NoAuthorizer/1 (36 ms)
[ RUN      ] Endpoint/SlaveEndpointTest.NoAuthorizer/2
I1008 03:26:10.357084  5571 containerizer.cpp:292] Using isolation { environment_secret, posix/cpu,
posix/mem, filesystem/posix, network/cni }
W1008 03:26:10.357631  5571 backend.cpp:76] Failed to create 'aufs' backend: AufsBackend requires
root privileges
W1008 03:26:10.357761  5571 backend.cpp:76] Failed to create 'bind' backend: BindBackend requires
root privileges
I1008 03:26:10.357796  5571 provisioner.cpp:255] Using default backend 'copy'
I1008 03:26:10.359856  5571 cluster.cpp:448] Creating default 'local' authorizer
I1008 03:26:10.362426  5579 slave.cpp:254] Mesos agent started on (828)@172.17.0.4:44646
I1008 03:26:10.362460  5579 slave.cpp:255] Flags at startup: --acls="" --appc_simple_discovery_uri_prefix="http://"
--appc_store_dir="/tmp/Endpoint_SlaveEndpointTest_NoAuthorizer_2_dWKmFe/store/appc" --authenticate_http_readonly="true"
--authenticate_http_readwrite="true" --authenticatee="crammd5" --authentication_backoff_factor="1secs"
--authorizer="local" --cgroups_cpu_enable_pids_and_tids_count="false" --cgroups_enable_cfs="false"
--cgroups_hierarchy="/sys/fs/cgroup" --cgroups_limit_swap="false" --cgroups_root="mesos" --container_disk_watch_interval="15secs"
--containerizers="mesos" --credential="/tmp/Endpoint_SlaveEndpointTest_NoAuthorizer_2_dWKmFe/credential"
--default_role="*" --disallow_sharing_agent_pid_namespace="false" --disk_watch_interval="1mins"
--docker="docker" --docker_kill_orphans="true" --docker_registry="https://registry-1.docker.io"
--docker_remove_delay="6hrs" --docker_socket="/var/run/docker.sock" --docker_stop_timeout="0ns"
--docker_store_dir="/tmp/Endpoint_SlaveEndpointTest_NoAuthorizer_2_dWKmFe/store/docker" --docker_volume_checkpoint_dir="/var/run/mesos/isolators/docker/volume"
--enforce_container_disk_quota="false" --executor_registration_timeout="1mins" --executor_reregistration_timeout="2secs"
--executor_shutdown_grace_period="5secs" --fetcher_cache_dir="/tmp/Endpoint_SlaveEndpointTest_NoAuthorizer_2_dWKmFe/fetch"
--fetcher_cache_size="2GB" --frameworks_home="" --gc_delay="1weeks" --gc_disk_headroom="0.1"
--hadoop_home="" --help="false" --hostname_lookup="true" --http_command_executor="false" --http_credentials="/tmp/Endpoint_SlaveEndpointTest_NoAuthorizer_2_dWKmFe/http_credentials"
--http_heartbeat_interval="30secs" --initialize_driver_logging="true" --isolation="posix/cpu,posix/mem"
--launcher="posix" --launcher_dir="/mesos/mesos-1.5.0/_build/src" --logbufsecs="0" --logging_level="INFO"
--max_completed_executors_per_framework="150" --oversubscribed_resources_interval="15secs"
--perf_duration="10secs" --perf_interval="1mins" --port="5051" --qos_correction_interval_min="0ns"
--quiet="false" --recover="reconnect" --recovery_timeout="15mins" --registration_backoff_factor="10ms"
--resources="cpus:2;gpus:0;mem:1024;disk:1024;ports:[31000-32000]" --revocable_cpu_low_priority="true"
--runtime_dir="/tmp/Endpoint_SlaveEndpointTest_NoAuthorizer_2_dWKmFe" --sandbox_directory="/mnt/mesos/sandbox"
--strict="true" --switch_user="true" --systemd_enable_support="true" --systemd_runtime_directory="/run/systemd/system"
--version="false" --work_dir="/tmp/Endpoint_SlaveEndpointTest_NoAuthorizer_2_SHdlV2" --zk_session_timeout="10secs"
I1008 03:26:10.362905  5579 credentials.hpp:86] Loading credential for authentication from
'/tmp/Endpoint_SlaveEndpointTest_NoAuthorizer_2_dWKmFe/credential'
I1008 03:26:10.363128  5579 slave.cpp:287] Agent using credential for: test-principal
I1008 03:26:10.363158  5579 credentials.hpp:37] Loading credentials for authentication from
'/tmp/Endpoint_SlaveEndpointTest_NoAuthorizer_2_dWKmFe/http_credentials'
I1008 03:26:10.363478  5579 http.cpp:1045] Creating default 'basic' HTTP authenticator for
realm 'mesos-agent-readonly'
I1008 03:26:10.363720  5579 http.cpp:1045] Creating default 'basic' HTTP authenticator for
realm 'mesos-agent-readwrite'
I1008 03:26:10.365473  5579 slave.cpp:585] Agent resources: [{"name":"cpus","scalar":{"value":2.0},"type":"SCALAR"},{"name":"mem","scalar":{"value":1024.0},"type":"SCALAR"},{"name":"disk","scalar":{"value":1024.0},"type":"SCALAR"},{"name":"ports","ranges":{"range":[{"begin":31000,"end":32000}]},"type":"RANGES"}]
I1008 03:26:10.365780  5579 slave.cpp:593] Agent attributes: [  ]
I1008 03:26:10.365798  5579 slave.cpp:602] Agent hostname: f3a559fc27ab
I1008 03:26:10.366003  5575 status_update_manager.cpp:177] Pausing sending status updates
I1008 03:26:10.367887  5580 state.cpp:64] Recovering state from '/tmp/Endpoint_SlaveEndpointTest_NoAuthorizer_2_SHdlV2/meta'
I1008 03:26:10.368190  5586 status_update_manager.cpp:203] Recovering status update manager
I1008 03:26:10.368412  5586 containerizer.cpp:648] Recovering containerizer
I1008 03:26:10.370187  5572 provisioner.cpp:416] Provisioner recovery complete
I1008 03:26:10.370748  5575 slave.cpp:6326] Finished recovery
I1008 03:26:10.371245  5575 slave.cpp:6512] Querying resource estimator for oversubscribable
resources
I1008 03:26:10.371505  5580 slave.cpp:6526] Received oversubscribable resources {} from the
resource estimator
I1008 03:26:10.374126  5576 process.cpp:3929] Handling HTTP event for process 'slave(828)'
with path: '/slave(828)/containers'
I1008 03:26:10.375416  5573 http.cpp:1185] HTTP GET for /slave(828)/containers from 172.17.0.4:50990
I1008 03:26:10.375504  5573 http.cpp:976] Authorizing principal 'test-principal' to GET the
'/containers' endpoint
I1008 03:26:10.379890  5571 slave.cpp:869] Agent terminating
[       OK ] Endpoint/SlaveEndpointTest.NoAuthorizer/2 (35 ms)
[----------] 9 tests from Endpoint/SlaveEndpointTest (312 ms total)

[----------] 2 tests from ContainerizerType/DefaultContainerDNSFlagTest
[ RUN      ] ContainerizerType/DefaultContainerDNSFlagTest.ValidateFlag/0
[       OK ] ContainerizerType/DefaultContainerDNSFlagTest.ValidateFlag/0 (10 ms)
[ RUN      ] ContainerizerType/DefaultContainerDNSFlagTest.ValidateFlag/1
[       OK ] ContainerizerType/DefaultContainerDNSFlagTest.ValidateFlag/1 (9 ms)
[----------] 2 tests from ContainerizerType/DefaultContainerDNSFlagTest (19 ms total)

[----------] Global test environment tear-down
[==========] 1688 tests from 185 test cases ran. (598902 ms total)
[  PASSED  ] 1687 tests.
[  FAILED  ] 1 test, listed below:
[  FAILED  ] MasterTest.IgnoreOldAgentReregistration

 1 FAILED TEST
  YOU HAVE 21 DISABLED TESTS

I1008 03:26:10.467061  5596 process.cpp:1068] Failed to accept socket: future discarded
make[4]: *** [check-local] Error 1
make[4]: Leaving directory `/mesos/mesos-1.5.0/_build/src'
make[3]: *** [check-am] Error 2
make[3]: Leaving directory `/mesos/mesos-1.5.0/_build/src'
make[2]: *** [check] Error 2
make[2]: Leaving directory `/mesos/mesos-1.5.0/_build/src'
make[1]: *** [check-recursive] Error 1
make[1]: Leaving directory `/mesos/mesos-1.5.0/_build'
make: *** [distcheck] Error 1
+ docker rmi mesos-1507429893-4934
Untagged: mesos-1507429893-4934:latest
Deleted: sha256:b2ecb515e379fc51c7f2aba0138ac27d89c8f07e25615a797d1c7fa64047d4cd
Deleted: sha256:72d272c878a49fc240c524012dbc0caa5104c4fe2014469159f5d2c9db5b4d56
Deleted: sha256:c64eddd77ecb536d94caa744aa4a7a01a3b2f90b54610dfc2b0fc58ec0a41422
Deleted: sha256:3d7cda9f00ea3a001a31ecc4ae9b96faeaf3ff1c7efeb20433a85d72cb6d4a4e
Deleted: sha256:9c486e54b8dac7fcba015e3d10e460ad10d1e997a19aa9863f1ccb68e1929857
Deleted: sha256:7733aa14684db8c187e32593c88d1bf79a248ee34ef4fb5300d5a42d97f67468
Deleted: sha256:de1265e1bd7fe63486f575ee413b31cbd8331be877f519b96aaa815593580f34
Deleted: sha256:a39ba0997894d2fd106e9b2573878f6cd08510beb8b310915948e533d64f10bf
Deleted: sha256:ebf29c9ee69abd82fbc30cc568c3a7d463d047fc61f4193bc416eff2d1f7a50a
Deleted: sha256:0cf22cd974c1d9eb6d26f5344a809299d9cd3f2ddf4b4b8dd7864f72dca2d905
Deleted: sha256:252846a29c36e7b57475e8d2af81d456e4afd6e2b4d6732c95e66b9c8140d9b6
Deleted: sha256:253aece17be0aa2b9340e20d5dcfbb64de045f0425d6a1f1adbebee00facf327
Deleted: sha256:19bb69291936ba7c7587124ad360f3d78dfc6404f464984d4c57682d840708ef
Deleted: sha256:f162916f6af7a27e7cac41050e860b6c945e3cbdf3feb4acb59acd2272cdc899
Deleted: sha256:4354fcba2ef50ea97c6e9c28cc0335eb27fe88751eaaf03434649a7f8461e597
Deleted: sha256:ad7433af4a78fc5c26768d95f9c4e17ee7bdacce31267301c00d2ac02016267a
Deleted: sha256:6986960f70abeea20884287e4d6719c9ccd197c800d32a4fb4ad8a61433e6034
Deleted: sha256:013c31abad696804d94841759db84a7ab8406d8b28be6f51047fa1f7ae67f24e
Deleted: sha256:22e2c1120787b415a4be2a13e65aea7cfda618a5b3f3f4fbf12844444cc07230
Deleted: sha256:abe136d921fee33c485ddcca7a1af5e55785bb1e0a926249e9765f3324f7c6dc
Deleted: sha256:59b0ee9275848460e6910561dbbacca3601c085ed75a3560d7f9884e726c614b
Deleted: sha256:27eea04678aeaa598fd21cd668493d6b9e141fb9c8f188b935854f5075755b68
Deleted: sha256:3edeaad32ec1c8372556c91f504d4993856d7473424bac6cb9e10e6fcdfd0fb6
Deleted: sha256:7fc9f26df87a355576afbf8ba3aad92a043448242a50ff5711fe061438017f48
Deleted: sha256:5ea71cc928904f8a8f30c9d436dd5e00bfc8abfb516a0930a58c2beafb08a6ef
Deleted: sha256:ad3dc5bbd2158c8cf6446285580ba6f6ed2338a0a1b7c392c42496c0cffc9c88
Deleted: sha256:a11def2de6359149628c3519f1c72100ab8ce1f684cbcc09b298a87c675e3cf2
Deleted: sha256:5a8b739c4f6ac1478e9b6cca847c4fe8b93752933d45edb0614ccb26efd66883
Build step 'Execute shell' marked build as failure

Mime
View raw message