mesos-builds mailing list archives

Site index · List index
Message view « Date » · « Thread »
Top « Date » · « Thread »
From Apache Jenkins Server <jenk...@builds.apache.org>
Subject Build failed in Jenkins: Mesos-Reviewbot #19715
Date Sun, 08 Oct 2017 07:26:34 GMT
See <https://builds.apache.org/job/Mesos-Reviewbot/19715/display/redirect>

------------------------------------------
[...truncated 32.32 MB...]
I1008 07:26:28.265786  5564 credentials.hpp:37] Loading credentials for authentication from
'/tmp/Endpoint_SlaveEndpointTest_AuthorizedRequest_2_BMEV2t/http_credentials'
I1008 07:26:28.266041  5564 http.cpp:1045] Creating default 'basic' HTTP authenticator for
realm 'mesos-agent-readonly'
I1008 07:26:28.266201  5564 http.cpp:1045] Creating default 'basic' HTTP authenticator for
realm 'mesos-agent-readwrite'
I1008 07:26:28.267618  5564 slave.cpp:585] Agent resources: [{"name":"cpus","scalar":{"value":2.0},"type":"SCALAR"},{"name":"mem","scalar":{"value":1024.0},"type":"SCALAR"},{"name":"disk","scalar":{"value":1024.0},"type":"SCALAR"},{"name":"ports","ranges":{"range":[{"begin":31000,"end":32000}]},"type":"RANGES"}]
I1008 07:26:28.267858  5564 slave.cpp:593] Agent attributes: [  ]
I1008 07:26:28.267873  5564 slave.cpp:602] Agent hostname: 184618c8908f
I1008 07:26:28.267992  5563 status_update_manager.cpp:177] Pausing sending status updates
I1008 07:26:28.269474  5573 state.cpp:64] Recovering state from '/tmp/Endpoint_SlaveEndpointTest_AuthorizedRequest_2_DNUQ8Q/meta'
I1008 07:26:28.269815  5570 status_update_manager.cpp:203] Recovering status update manager
I1008 07:26:28.270136  5569 containerizer.cpp:648] Recovering containerizer
I1008 07:26:28.272022  5577 provisioner.cpp:416] Provisioner recovery complete
I1008 07:26:28.272436  5566 slave.cpp:6326] Finished recovery
I1008 07:26:28.272899  5566 slave.cpp:6512] Querying resource estimator for oversubscribable
resources
I1008 07:26:28.273167  5566 slave.cpp:6526] Received oversubscribable resources {} from the
resource estimator
I1008 07:26:28.275738  5565 process.cpp:3929] Handling HTTP event for process 'slave(822)'
with path: '/slave(822)/containers'
I1008 07:26:28.277688  5576 http.cpp:1185] HTTP GET for /slave(822)/containers from 172.17.0.4:35708
I1008 07:26:28.277807  5576 http.cpp:976] Authorizing principal 'test-principal' to GET the
'/containers' endpoint
I1008 07:26:28.282287  5562 slave.cpp:869] Agent terminating
[       OK ] Endpoint/SlaveEndpointTest.AuthorizedRequest/2 (38 ms)
[ RUN      ] Endpoint/SlaveEndpointTest.UnauthorizedRequest/0
I1008 07:26:28.297235  5562 containerizer.cpp:292] Using isolation { environment_secret, posix/cpu,
posix/mem, filesystem/posix, network/cni }
W1008 07:26:28.297869  5562 backend.cpp:76] Failed to create 'aufs' backend: AufsBackend requires
root privileges
W1008 07:26:28.298014  5562 backend.cpp:76] Failed to create 'bind' backend: BindBackend requires
root privileges
I1008 07:26:28.298066  5562 provisioner.cpp:255] Using default backend 'copy'
I1008 07:26:28.303061  5584 slave.cpp:254] Mesos agent started on (823)@172.17.0.4:37514
I1008 07:26:28.303105  5584 slave.cpp:255] Flags at startup: --acls="" --appc_simple_discovery_uri_prefix="http://"
--appc_store_dir="/tmp/Endpoint_SlaveEndpointTest_UnauthorizedRequest_0_4iLSYZ/store/appc"
--authenticate_http_readonly="true" --authenticate_http_readwrite="true" --authenticatee="crammd5"
--authentication_backoff_factor="1secs" --authorizer="local" --cgroups_cpu_enable_pids_and_tids_count="false"
--cgroups_enable_cfs="false" --cgroups_hierarchy="/sys/fs/cgroup" --cgroups_limit_swap="false"
--cgroups_root="mesos" --container_disk_watch_interval="15secs" --containerizers="mesos" --credential="/tmp/Endpoint_SlaveEndpointTest_UnauthorizedRequest_0_4iLSYZ/credential"
--default_role="*" --disallow_sharing_agent_pid_namespace="false" --disk_watch_interval="1mins"
--docker="docker" --docker_kill_orphans="true" --docker_registry="https://registry-1.docker.io"
--docker_remove_delay="6hrs" --docker_socket="/var/run/docker.sock" --docker_stop_timeout="0ns"
--docker_store_dir="/tmp/Endpoint_SlaveEndpointTest_UnauthorizedRequest_0_4iLSYZ/store/docker"
--docker_volume_checkpoint_dir="/var/run/mesos/isolators/docker/volume" --enforce_container_disk_quota="false"
--executor_registration_timeout="1mins" --executor_reregistration_timeout="2secs" --executor_shutdown_grace_period="5secs"
--fetcher_cache_dir="/tmp/Endpoint_SlaveEndpointTest_UnauthorizedRequest_0_4iLSYZ/fetch" --fetcher_cache_size="2GB"
--frameworks_home="" --gc_delay="1weeks" --gc_disk_headroom="0.1" --hadoop_home="" --help="false"
--hostname_lookup="true" --http_command_executor="false" --http_credentials="/tmp/Endpoint_SlaveEndpointTest_UnauthorizedRequest_0_4iLSYZ/http_credentials"
--http_heartbeat_interval="30secs" --initialize_driver_logging="true" --isolation="posix/cpu,posix/mem"
--launcher="posix" --launcher_dir="/mesos/mesos-1.5.0/_build/src" --logbufsecs="0" --logging_level="INFO"
--max_completed_executors_per_framework="150" --oversubscribed_resources_interval="15secs"
--perf_duration="10secs" --perf_interval="1mins" --port="5051" --qos_correction_interval_min="0ns"
--quiet="false" --recover="reconnect" --recovery_timeout="15mins" --registration_backoff_factor="10ms"
--resources="cpus:2;gpus:0;mem:1024;disk:1024;ports:[31000-32000]" --revocable_cpu_low_priority="true"
--runtime_dir="/tmp/Endpoint_SlaveEndpointTest_UnauthorizedRequest_0_4iLSYZ" --sandbox_directory="/mnt/mesos/sandbox"
--strict="true" --switch_user="true" --systemd_enable_support="true" --systemd_runtime_directory="/run/systemd/system"
--version="false" --work_dir="/tmp/Endpoint_SlaveEndpointTest_UnauthorizedRequest_0_neI0Ym"
--zk_session_timeout="10secs"
I1008 07:26:28.303601  5584 credentials.hpp:86] Loading credential for authentication from
'/tmp/Endpoint_SlaveEndpointTest_UnauthorizedRequest_0_4iLSYZ/credential'
I1008 07:26:28.303822  5584 slave.cpp:287] Agent using credential for: test-principal
I1008 07:26:28.303864  5584 credentials.hpp:37] Loading credentials for authentication from
'/tmp/Endpoint_SlaveEndpointTest_UnauthorizedRequest_0_4iLSYZ/http_credentials'
I1008 07:26:28.304239  5584 http.cpp:1045] Creating default 'basic' HTTP authenticator for
realm 'mesos-agent-readonly'
I1008 07:26:28.304478  5584 http.cpp:1045] Creating default 'basic' HTTP authenticator for
realm 'mesos-agent-readwrite'
I1008 07:26:28.306587  5584 slave.cpp:585] Agent resources: [{"name":"cpus","scalar":{"value":2.0},"type":"SCALAR"},{"name":"mem","scalar":{"value":1024.0},"type":"SCALAR"},{"name":"disk","scalar":{"value":1024.0},"type":"SCALAR"},{"name":"ports","ranges":{"range":[{"begin":31000,"end":32000}]},"type":"RANGES"}]
I1008 07:26:28.306985  5584 slave.cpp:593] Agent attributes: [  ]
I1008 07:26:28.307006  5584 slave.cpp:602] Agent hostname: 184618c8908f
I1008 07:26:28.307221  5581 status_update_manager.cpp:177] Pausing sending status updates
I1008 07:26:28.309406  5576 state.cpp:64] Recovering state from '/tmp/Endpoint_SlaveEndpointTest_UnauthorizedRequest_0_neI0Ym/meta'
I1008 07:26:28.309722  5566 status_update_manager.cpp:203] Recovering status update manager
I1008 07:26:28.309921  5580 containerizer.cpp:648] Recovering containerizer
I1008 07:26:28.311568  5574 provisioner.cpp:416] Provisioner recovery complete
I1008 07:26:28.312016  5564 slave.cpp:6326] Finished recovery
I1008 07:26:28.312481  5564 slave.cpp:6512] Querying resource estimator for oversubscribable
resources
I1008 07:26:28.312741  5572 slave.cpp:6526] Received oversubscribable resources {} from the
resource estimator
I1008 07:26:28.315232  5577 process.cpp:3929] Handling HTTP event for process 'slave(823)'
with path: '/slave(823)/monitor/statistics'
I1008 07:26:28.316633  5568 http.cpp:1185] HTTP GET for /slave(823)/monitor/statistics from
172.17.0.4:35710
I1008 07:26:28.316754  5568 http.cpp:976] Authorizing principal 'test-principal' to GET the
'/monitor/statistics' endpoint
I1008 07:26:28.319603  5562 slave.cpp:869] Agent terminating
[       OK ] Endpoint/SlaveEndpointTest.UnauthorizedRequest/0 (37 ms)
[ RUN      ] Endpoint/SlaveEndpointTest.UnauthorizedRequest/1
I1008 07:26:28.332339  5562 containerizer.cpp:292] Using isolation { environment_secret, posix/cpu,
posix/mem, filesystem/posix, network/cni }
W1008 07:26:28.332816  5562 backend.cpp:76] Failed to create 'aufs' backend: AufsBackend requires
root privileges
W1008 07:26:28.332929  5562 backend.cpp:76] Failed to create 'bind' backend: BindBackend requires
root privileges
I1008 07:26:28.332963  5562 provisioner.cpp:255] Using default backend 'copy'
I1008 07:26:28.336488  5576 slave.cpp:254] Mesos agent started on (824)@172.17.0.4:37514
I1008 07:26:28.336515  5576 slave.cpp:255] Flags at startup: --acls="" --appc_simple_discovery_uri_prefix="http://"
--appc_store_dir="/tmp/Endpoint_SlaveEndpointTest_UnauthorizedRequest_1_a4c5gw/store/appc"
--authenticate_http_readonly="true" --authenticate_http_readwrite="true" --authenticatee="crammd5"
--authentication_backoff_factor="1secs" --authorizer="local" --cgroups_cpu_enable_pids_and_tids_count="false"
--cgroups_enable_cfs="false" --cgroups_hierarchy="/sys/fs/cgroup" --cgroups_limit_swap="false"
--cgroups_root="mesos" --container_disk_watch_interval="15secs" --containerizers="mesos" --credential="/tmp/Endpoint_SlaveEndpointTest_UnauthorizedRequest_1_a4c5gw/credential"
--default_role="*" --disallow_sharing_agent_pid_namespace="false" --disk_watch_interval="1mins"
--docker="docker" --docker_kill_orphans="true" --docker_registry="https://registry-1.docker.io"
--docker_remove_delay="6hrs" --docker_socket="/var/run/docker.sock" --docker_stop_timeout="0ns"
--docker_store_dir="/tmp/Endpoint_SlaveEndpointTest_UnauthorizedRequest_1_a4c5gw/store/docker"
--docker_volume_checkpoint_dir="/var/run/mesos/isolators/docker/volume" --enforce_container_disk_quota="false"
--executor_registration_timeout="1mins" --executor_reregistration_timeout="2secs" --executor_shutdown_grace_period="5secs"
--fetcher_cache_dir="/tmp/Endpoint_SlaveEndpointTest_UnauthorizedRequest_1_a4c5gw/fetch" --fetcher_cache_size="2GB"
--frameworks_home="" --gc_delay="1weeks" --gc_disk_headroom="0.1" --hadoop_home="" --help="false"
--hostname_lookup="true" --http_command_executor="false" --http_credentials="/tmp/Endpoint_SlaveEndpointTest_UnauthorizedRequest_1_a4c5gw/http_credentials"
--http_heartbeat_interval="30secs" --initialize_driver_logging="true" --isolation="posix/cpu,posix/mem"
--launcher="posix" --launcher_dir="/mesos/mesos-1.5.0/_build/src" --logbufsecs="0" --logging_level="INFO"
--max_completed_executors_per_framework="150" --oversubscribed_resources_interval="15secs"
--perf_duration="10secs" --perf_interval="1mins" --port="5051" --qos_correction_interval_min="0ns"
--quiet="false" --recover="reconnect" --recovery_timeout="15mins" --registration_backoff_factor="10ms"
--resources="cpus:2;gpus:0;mem:1024;disk:1024;ports:[31000-32000]" --revocable_cpu_low_priority="true"
--runtime_dir="/tmp/Endpoint_SlaveEndpointTest_UnauthorizedRequest_1_a4c5gw" --sandbox_directory="/mnt/mesos/sandbox"
--strict="true" --switch_user="true" --systemd_enable_support="true" --systemd_runtime_directory="/run/systemd/system"
--version="false" --work_dir="/tmp/Endpoint_SlaveEndpointTest_UnauthorizedRequest_1_iGYNbT"
--zk_session_timeout="10secs"
I1008 07:26:28.337182  5576 credentials.hpp:86] Loading credential for authentication from
'/tmp/Endpoint_SlaveEndpointTest_UnauthorizedRequest_1_a4c5gw/credential'
I1008 07:26:28.337368  5576 slave.cpp:287] Agent using credential for: test-principal
I1008 07:26:28.337399  5576 credentials.hpp:37] Loading credentials for authentication from
'/tmp/Endpoint_SlaveEndpointTest_UnauthorizedRequest_1_a4c5gw/http_credentials'
I1008 07:26:28.337668  5576 http.cpp:1045] Creating default 'basic' HTTP authenticator for
realm 'mesos-agent-readonly'
I1008 07:26:28.337869  5576 http.cpp:1045] Creating default 'basic' HTTP authenticator for
realm 'mesos-agent-readwrite'
I1008 07:26:28.339529  5576 slave.cpp:585] Agent resources: [{"name":"cpus","scalar":{"value":2.0},"type":"SCALAR"},{"name":"mem","scalar":{"value":1024.0},"type":"SCALAR"},{"name":"disk","scalar":{"value":1024.0},"type":"SCALAR"},{"name":"ports","ranges":{"range":[{"begin":31000,"end":32000}]},"type":"RANGES"}]
I1008 07:26:28.339812  5576 slave.cpp:593] Agent attributes: [  ]
I1008 07:26:28.339828  5576 slave.cpp:602] Agent hostname: 184618c8908f
I1008 07:26:28.340023  5580 status_update_manager.cpp:177] Pausing sending status updates
I1008 07:26:28.341552  5570 state.cpp:64] Recovering state from '/tmp/Endpoint_SlaveEndpointTest_UnauthorizedRequest_1_iGYNbT/meta'
I1008 07:26:28.341989  5577 status_update_manager.cpp:203] Recovering status update manager
I1008 07:26:28.342212  5565 containerizer.cpp:648] Recovering containerizer
I1008 07:26:28.343861  5566 provisioner.cpp:416] Provisioner recovery complete
I1008 07:26:28.344574  5566 slave.cpp:6326] Finished recovery
I1008 07:26:28.345324  5566 slave.cpp:6512] Querying resource estimator for oversubscribable
resources
I1008 07:26:28.345625  5581 slave.cpp:6526] Received oversubscribable resources {} from the
resource estimator
I1008 07:26:28.348469  5571 process.cpp:3929] Handling HTTP event for process 'slave(824)'
with path: '/slave(824)/monitor/statistics.json'
I1008 07:26:28.350088  5584 http.cpp:1185] HTTP GET for /slave(824)/monitor/statistics.json
from 172.17.0.4:35712
I1008 07:26:28.350222  5584 http.cpp:976] Authorizing principal 'test-principal' to GET the
'/monitor/statistics.json' endpoint
I1008 07:26:28.352933  5562 slave.cpp:869] Agent terminating
[       OK ] Endpoint/SlaveEndpointTest.UnauthorizedRequest/1 (33 ms)
[ RUN      ] Endpoint/SlaveEndpointTest.UnauthorizedRequest/2
I1008 07:26:28.367353  5562 containerizer.cpp:292] Using isolation { environment_secret, posix/cpu,
posix/mem, filesystem/posix, network/cni }
W1008 07:26:28.367915  5562 backend.cpp:76] Failed to create 'aufs' backend: AufsBackend requires
root privileges
W1008 07:26:28.368044  5562 backend.cpp:76] Failed to create 'bind' backend: BindBackend requires
root privileges
I1008 07:26:28.368088  5562 provisioner.cpp:255] Using default backend 'copy'
I1008 07:26:28.372798  5579 slave.cpp:254] Mesos agent started on (825)@172.17.0.4:37514
I1008 07:26:28.372850  5579 slave.cpp:255] Flags at startup: --acls="" --appc_simple_discovery_uri_prefix="http://"
--appc_store_dir="/tmp/Endpoint_SlaveEndpointTest_UnauthorizedRequest_2_1jwkT2/store/appc"
--authenticate_http_readonly="true" --authenticate_http_readwrite="true" --authenticatee="crammd5"
--authentication_backoff_factor="1secs" --authorizer="local" --cgroups_cpu_enable_pids_and_tids_count="false"
--cgroups_enable_cfs="false" --cgroups_hierarchy="/sys/fs/cgroup" --cgroups_limit_swap="false"
--cgroups_root="mesos" --container_disk_watch_interval="15secs" --containerizers="mesos" --credential="/tmp/Endpoint_SlaveEndpointTest_UnauthorizedRequest_2_1jwkT2/credential"
--default_role="*" --disallow_sharing_agent_pid_namespace="false" --disk_watch_interval="1mins"
--docker="docker" --docker_kill_orphans="true" --docker_registry="https://registry-1.docker.io"
--docker_remove_delay="6hrs" --docker_socket="/var/run/docker.sock" --docker_stop_timeout="0ns"
--docker_store_dir="/tmp/Endpoint_SlaveEndpointTest_UnauthorizedRequest_2_1jwkT2/store/docker"
--docker_volume_checkpoint_dir="/var/run/mesos/isolators/docker/volume" --enforce_container_disk_quota="false"
--executor_registration_timeout="1mins" --executor_reregistration_timeout="2secs" --executor_shutdown_grace_period="5secs"
--fetcher_cache_dir="/tmp/Endpoint_SlaveEndpointTest_UnauthorizedRequest_2_1jwkT2/fetch" --fetcher_cache_size="2GB"
--frameworks_home="" --gc_delay="1weeks" --gc_disk_headroom="0.1" --hadoop_home="" --help="false"
--hostname_lookup="true" --http_command_executor="false" --http_credentials="/tmp/Endpoint_SlaveEndpointTest_UnauthorizedRequest_2_1jwkT2/http_credentials"
--http_heartbeat_interval="30secs" --initialize_driver_logging="true" --isolation="posix/cpu,posix/mem"
--launcher="posix" --launcher_dir="/mesos/mesos-1.5.0/_build/src" --logbufsecs="0" --logging_level="INFO"
--max_completed_executors_per_framework="150" --oversubscribed_resources_interval="15secs"
--perf_duration="10secs" --perf_interval="1mins" --port="5051" --qos_correction_interval_min="0ns"
--quiet="false" --recover="reconnect" --recovery_timeout="15mins" --registration_backoff_factor="10ms"
--resources="cpus:2;gpus:0;mem:1024;disk:1024;ports:[31000-32000]" --revocable_cpu_low_priority="true"
--runtime_dir="/tmp/Endpoint_SlaveEndpointTest_UnauthorizedRequest_2_1jwkT2" --sandbox_directory="/mnt/mesos/sandbox"
--strict="true" --switch_user="true" --systemd_enable_support="true" --systemd_runtime_directory="/run/systemd/system"
--version="false" --work_dir="/tmp/Endpoint_SlaveEndpointTest_UnauthorizedRequest_2_7mAXIp"
--zk_session_timeout="10secs"
I1008 07:26:28.373514  5579 credentials.hpp:86] Loading credential for authentication from
'/tmp/Endpoint_SlaveEndpointTest_UnauthorizedRequest_2_1jwkT2/credential'
I1008 07:26:28.373775  5579 slave.cpp:287] Agent using credential for: test-principal
I1008 07:26:28.373800  5579 credentials.hpp:37] Loading credentials for authentication from
'/tmp/Endpoint_SlaveEndpointTest_UnauthorizedRequest_2_1jwkT2/http_credentials'
I1008 07:26:28.374151  5579 http.cpp:1045] Creating default 'basic' HTTP authenticator for
realm 'mesos-agent-readonly'
I1008 07:26:28.374425  5579 http.cpp:1045] Creating default 'basic' HTTP authenticator for
realm 'mesos-agent-readwrite'
I1008 07:26:28.376677  5579 slave.cpp:585] Agent resources: [{"name":"cpus","scalar":{"value":2.0},"type":"SCALAR"},{"name":"mem","scalar":{"value":1024.0},"type":"SCALAR"},{"name":"disk","scalar":{"value":1024.0},"type":"SCALAR"},{"name":"ports","ranges":{"range":[{"begin":31000,"end":32000}]},"type":"RANGES"}]
I1008 07:26:28.377091  5579 slave.cpp:593] Agent attributes: [  ]
I1008 07:26:28.377115  5579 slave.cpp:602] Agent hostname: 184618c8908f
I1008 07:26:28.377346  5574 status_update_manager.cpp:177] Pausing sending status updates
I1008 07:26:28.379382  5586 state.cpp:64] Recovering state from '/tmp/Endpoint_SlaveEndpointTest_UnauthorizedRequest_2_7mAXIp/meta'
I1008 07:26:28.379714  5586 status_update_manager.cpp:203] Recovering status update manager
I1008 07:26:28.379941  5571 containerizer.cpp:648] Recovering containerizer
I1008 07:26:28.381804  5563 provisioner.cpp:416] Provisioner recovery complete
I1008 07:26:28.382596  5563 slave.cpp:6326] Finished recovery
I1008 07:26:28.383219  5563 slave.cpp:6512] Querying resource estimator for oversubscribable
resources
I1008 07:26:28.383644  5578 slave.cpp:6526] Received oversubscribable resources {} from the
resource estimator
I1008 07:26:28.386881  5571 process.cpp:3929] Handling HTTP event for process 'slave(825)'
with path: '/slave(825)/containers'
I1008 07:26:28.388399  5581 http.cpp:1185] HTTP GET for /slave(825)/containers from 172.17.0.4:35714
I1008 07:26:28.388533  5581 http.cpp:976] Authorizing principal 'test-principal' to GET the
'/containers' endpoint
I1008 07:26:28.392664  5562 slave.cpp:869] Agent terminating
[       OK ] Endpoint/SlaveEndpointTest.UnauthorizedRequest/2 (40 ms)
[ RUN      ] Endpoint/SlaveEndpointTest.NoAuthorizer/0
I1008 07:26:28.407753  5562 containerizer.cpp:292] Using isolation { environment_secret, posix/cpu,
posix/mem, filesystem/posix, network/cni }
W1008 07:26:28.408315  5562 backend.cpp:76] Failed to create 'aufs' backend: AufsBackend requires
root privileges
W1008 07:26:28.408447  5562 backend.cpp:76] Failed to create 'bind' backend: BindBackend requires
root privileges
I1008 07:26:28.408484  5562 provisioner.cpp:255] Using default backend 'copy'
I1008 07:26:28.410553  5562 cluster.cpp:448] Creating default 'local' authorizer
I1008 07:26:28.412914  5578 slave.cpp:254] Mesos agent started on (826)@172.17.0.4:37514
I1008 07:26:28.412940  5578 slave.cpp:255] Flags at startup: --acls="" --appc_simple_discovery_uri_prefix="http://"
--appc_store_dir="/tmp/Endpoint_SlaveEndpointTest_NoAuthorizer_0_8jhdTz/store/appc" --authenticate_http_readonly="true"
--authenticate_http_readwrite="true" --authenticatee="crammd5" --authentication_backoff_factor="1secs"
--authorizer="local" --cgroups_cpu_enable_pids_and_tids_count="false" --cgroups_enable_cfs="false"
--cgroups_hierarchy="/sys/fs/cgroup" --cgroups_limit_swap="false" --cgroups_root="mesos" --container_disk_watch_interval="15secs"
--containerizers="mesos" --credential="/tmp/Endpoint_SlaveEndpointTest_NoAuthorizer_0_8jhdTz/credential"
--default_role="*" --disallow_sharing_agent_pid_namespace="false" --disk_watch_interval="1mins"
--docker="docker" --docker_kill_orphans="true" --docker_registry="https://registry-1.docker.io"
--docker_remove_delay="6hrs" --docker_socket="/var/run/docker.sock" --docker_stop_timeout="0ns"
--docker_store_dir="/tmp/Endpoint_SlaveEndpointTest_NoAuthorizer_0_8jhdTz/store/docker" --docker_volume_checkpoint_dir="/var/run/mesos/isolators/docker/volume"
--enforce_container_disk_quota="false" --executor_registration_timeout="1mins" --executor_reregistration_timeout="2secs"
--executor_shutdown_grace_period="5secs" --fetcher_cache_dir="/tmp/Endpoint_SlaveEndpointTest_NoAuthorizer_0_8jhdTz/fetch"
--fetcher_cache_size="2GB" --frameworks_home="" --gc_delay="1weeks" --gc_disk_headroom="0.1"
--hadoop_home="" --help="false" --hostname_lookup="true" --http_command_executor="false" --http_credentials="/tmp/Endpoint_SlaveEndpointTest_NoAuthorizer_0_8jhdTz/http_credentials"
--http_heartbeat_interval="30secs" --initialize_driver_logging="true" --isolation="posix/cpu,posix/mem"
--launcher="posix" --launcher_dir="/mesos/mesos-1.5.0/_build/src" --logbufsecs="0" --logging_level="INFO"
--max_completed_executors_per_framework="150" --oversubscribed_resources_interval="15secs"
--perf_duration="10secs" --perf_interval="1mins" --port="5051" --qos_correction_interval_min="0ns"
--quiet="false" --recover="reconnect" --recovery_timeout="15mins" --registration_backoff_factor="10ms"
--resources="cpus:2;gpus:0;mem:1024;disk:1024;ports:[31000-32000]" --revocable_cpu_low_priority="true"
--runtime_dir="/tmp/Endpoint_SlaveEndpointTest_NoAuthorizer_0_8jhdTz" --sandbox_directory="/mnt/mesos/sandbox"
--strict="true" --switch_user="true" --systemd_enable_support="true" --systemd_runtime_directory="/run/systemd/system"
--version="false" --work_dir="/tmp/Endpoint_SlaveEndpointTest_NoAuthorizer_0_OrCRCW" --zk_session_timeout="10secs"
I1008 07:26:28.413442  5578 credentials.hpp:86] Loading credential for authentication from
'/tmp/Endpoint_SlaveEndpointTest_NoAuthorizer_0_8jhdTz/credential'
I1008 07:26:28.413596  5578 slave.cpp:287] Agent using credential for: test-principal
I1008 07:26:28.413621  5578 credentials.hpp:37] Loading credentials for authentication from
'/tmp/Endpoint_SlaveEndpointTest_NoAuthorizer_0_8jhdTz/http_credentials'
I1008 07:26:28.413918  5578 http.cpp:1045] Creating default 'basic' HTTP authenticator for
realm 'mesos-agent-readonly'
I1008 07:26:28.414096  5578 http.cpp:1045] Creating default 'basic' HTTP authenticator for
realm 'mesos-agent-readwrite'
I1008 07:26:28.415556  5578 slave.cpp:585] Agent resources: [{"name":"cpus","scalar":{"value":2.0},"type":"SCALAR"},{"name":"mem","scalar":{"value":1024.0},"type":"SCALAR"},{"name":"disk","scalar":{"value":1024.0},"type":"SCALAR"},{"name":"ports","ranges":{"range":[{"begin":31000,"end":32000}]},"type":"RANGES"}]
I1008 07:26:28.415796  5578 slave.cpp:593] Agent attributes: [  ]
I1008 07:26:28.415808  5578 slave.cpp:602] Agent hostname: 184618c8908f
I1008 07:26:28.415988  5568 status_update_manager.cpp:177] Pausing sending status updates
I1008 07:26:28.417253  5580 state.cpp:64] Recovering state from '/tmp/Endpoint_SlaveEndpointTest_NoAuthorizer_0_OrCRCW/meta'
I1008 07:26:28.417681  5577 status_update_manager.cpp:203] Recovering status update manager
I1008 07:26:28.417979  5572 containerizer.cpp:648] Recovering containerizer
I1008 07:26:28.419708  5576 provisioner.cpp:416] Provisioner recovery complete
I1008 07:26:28.420310  5568 slave.cpp:6326] Finished recovery
I1008 07:26:28.420883  5568 slave.cpp:6512] Querying resource estimator for oversubscribable
resources
I1008 07:26:28.421174  5580 slave.cpp:6526] Received oversubscribable resources {} from the
resource estimator
I1008 07:26:28.423940  5579 process.cpp:3929] Handling HTTP event for process 'slave(826)'
with path: '/slave(826)/monitor/statistics'
I1008 07:26:28.425578  5584 http.cpp:1185] HTTP GET for /slave(826)/monitor/statistics from
172.17.0.4:35716
I1008 07:26:28.425662  5584 http.cpp:976] Authorizing principal 'test-principal' to GET the
'/monitor/statistics' endpoint
I1008 07:26:28.429985  5574 slave.cpp:869] Agent terminating
[       OK ] Endpoint/SlaveEndpointTest.NoAuthorizer/0 (37 ms)
[ RUN      ] Endpoint/SlaveEndpointTest.NoAuthorizer/1
I1008 07:26:28.447521  5562 containerizer.cpp:292] Using isolation { environment_secret, posix/cpu,
posix/mem, filesystem/posix, network/cni }
W1008 07:26:28.448262  5562 backend.cpp:76] Failed to create 'aufs' backend: AufsBackend requires
root privileges
W1008 07:26:28.448444  5562 backend.cpp:76] Failed to create 'bind' backend: BindBackend requires
root privileges
I1008 07:26:28.448492  5562 provisioner.cpp:255] Using default backend 'copy'
I1008 07:26:28.451083  5562 cluster.cpp:448] Creating default 'local' authorizer
I1008 07:26:28.454133  5575 slave.cpp:254] Mesos agent started on (827)@172.17.0.4:37514
I1008 07:26:28.454164  5575 slave.cpp:255] Flags at startup: --acls="" --appc_simple_discovery_uri_prefix="http://"
--appc_store_dir="/tmp/Endpoint_SlaveEndpointTest_NoAuthorizer_1_aIt0f7/store/appc" --authenticate_http_readonly="true"
--authenticate_http_readwrite="true" --authenticatee="crammd5" --authentication_backoff_factor="1secs"
--authorizer="local" --cgroups_cpu_enable_pids_and_tids_count="false" --cgroups_enable_cfs="false"
--cgroups_hierarchy="/sys/fs/cgroup" --cgroups_limit_swap="false" --cgroups_root="mesos" --container_disk_watch_interval="15secs"
--containerizers="mesos" --credential="/tmp/Endpoint_SlaveEndpointTest_NoAuthorizer_1_aIt0f7/credential"
--default_role="*" --disallow_sharing_agent_pid_namespace="false" --disk_watch_interval="1mins"
--docker="docker" --docker_kill_orphans="true" --docker_registry="https://registry-1.docker.io"
--docker_remove_delay="6hrs" --docker_socket="/var/run/docker.sock" --docker_stop_timeout="0ns"
--docker_store_dir="/tmp/Endpoint_SlaveEndpointTest_NoAuthorizer_1_aIt0f7/store/docker" --docker_volume_checkpoint_dir="/var/run/mesos/isolators/docker/volume"
--enforce_container_disk_quota="false" --executor_registration_timeout="1mins" --executor_reregistration_timeout="2secs"
--executor_shutdown_grace_period="5secs" --fetcher_cache_dir="/tmp/Endpoint_SlaveEndpointTest_NoAuthorizer_1_aIt0f7/fetch"
--fetcher_cache_size="2GB" --frameworks_home="" --gc_delay="1weeks" --gc_disk_headroom="0.1"
--hadoop_home="" --help="false" --hostname_lookup="true" --http_command_executor="false" --http_credentials="/tmp/Endpoint_SlaveEndpointTest_NoAuthorizer_1_aIt0f7/http_credentials"
--http_heartbeat_interval="30secs" --initialize_driver_logging="true" --isolation="posix/cpu,posix/mem"
--launcher="posix" --launcher_dir="/mesos/mesos-1.5.0/_build/src" --logbufsecs="0" --logging_level="INFO"
--max_completed_executors_per_framework="150" --oversubscribed_resources_interval="15secs"
--perf_duration="10secs" --perf_interval="1mins" --port="5051" --qos_correction_interval_min="0ns"
--quiet="false" --recover="reconnect" --recovery_timeout="15mins" --registration_backoff_factor="10ms"
--resources="cpus:2;gpus:0;mem:1024;disk:1024;ports:[31000-32000]" --revocable_cpu_low_priority="true"
--runtime_dir="/tmp/Endpoint_SlaveEndpointTest_NoAuthorizer_1_aIt0f7" --sandbox_directory="/mnt/mesos/sandbox"
--strict="true" --switch_user="true" --systemd_enable_support="true" --systemd_runtime_directory="/run/systemd/system"
--version="false" --work_dir="/tmp/Endpoint_SlaveEndpointTest_NoAuthorizer_1_a2tQTt" --zk_session_timeout="10secs"
I1008 07:26:28.454635  5575 credentials.hpp:86] Loading credential for authentication from
'/tmp/Endpoint_SlaveEndpointTest_NoAuthorizer_1_aIt0f7/credential'
I1008 07:26:28.460875  5575 slave.cpp:287] Agent using credential for: test-principal
I1008 07:26:28.460909  5575 credentials.hpp:37] Loading credentials for authentication from
'/tmp/Endpoint_SlaveEndpointTest_NoAuthorizer_1_aIt0f7/http_credentials'
I1008 07:26:28.461184  5575 http.cpp:1045] Creating default 'basic' HTTP authenticator for
realm 'mesos-agent-readonly'
I1008 07:26:28.461388  5575 http.cpp:1045] Creating default 'basic' HTTP authenticator for
realm 'mesos-agent-readwrite'
I1008 07:26:28.463109  5575 slave.cpp:585] Agent resources: [{"name":"cpus","scalar":{"value":2.0},"type":"SCALAR"},{"name":"mem","scalar":{"value":1024.0},"type":"SCALAR"},{"name":"disk","scalar":{"value":1024.0},"type":"SCALAR"},{"name":"ports","ranges":{"range":[{"begin":31000,"end":32000}]},"type":"RANGES"}]
I1008 07:26:28.463405  5575 slave.cpp:593] Agent attributes: [  ]
I1008 07:26:28.463420  5575 slave.cpp:602] Agent hostname: 184618c8908f
I1008 07:26:28.463632  5569 status_update_manager.cpp:177] Pausing sending status updates
I1008 07:26:28.465178  5568 state.cpp:64] Recovering state from '/tmp/Endpoint_SlaveEndpointTest_NoAuthorizer_1_a2tQTt/meta'
I1008 07:26:28.465555  5574 status_update_manager.cpp:203] Recovering status update manager
I1008 07:26:28.465744  5573 containerizer.cpp:648] Recovering containerizer
I1008 07:26:28.467294  5565 provisioner.cpp:416] Provisioner recovery complete
I1008 07:26:28.467761  5569 slave.cpp:6326] Finished recovery
I1008 07:26:28.468216  5569 slave.cpp:6512] Querying resource estimator for oversubscribable
resources
I1008 07:26:28.468456  5580 slave.cpp:6526] Received oversubscribable resources {} from the
resource estimator
I1008 07:26:28.471618  5563 process.cpp:3929] Handling HTTP event for process 'slave(827)'
with path: '/slave(827)/monitor/statistics.json'
I1008 07:26:28.473379  5584 http.cpp:1185] HTTP GET for /slave(827)/monitor/statistics.json
from 172.17.0.4:35718
I1008 07:26:28.473482  5584 http.cpp:976] Authorizing principal 'test-principal' to GET the
'/monitor/statistics.json' endpoint
I1008 07:26:28.477893  5562 slave.cpp:869] Agent terminating
[       OK ] Endpoint/SlaveEndpointTest.NoAuthorizer/1 (47 ms)
[ RUN      ] Endpoint/SlaveEndpointTest.NoAuthorizer/2
I1008 07:26:28.493072  5562 containerizer.cpp:292] Using isolation { environment_secret, posix/cpu,
posix/mem, filesystem/posix, network/cni }
W1008 07:26:28.493645  5562 backend.cpp:76] Failed to create 'aufs' backend: AufsBackend requires
root privileges
W1008 07:26:28.493789  5562 backend.cpp:76] Failed to create 'bind' backend: BindBackend requires
root privileges
I1008 07:26:28.493832  5562 provisioner.cpp:255] Using default backend 'copy'
I1008 07:26:28.495790  5562 cluster.cpp:448] Creating default 'local' authorizer
I1008 07:26:28.498281  5583 slave.cpp:254] Mesos agent started on (828)@172.17.0.4:37514
I1008 07:26:28.498306  5583 slave.cpp:255] Flags at startup: --acls="" --appc_simple_discovery_uri_prefix="http://"
--appc_store_dir="/tmp/Endpoint_SlaveEndpointTest_NoAuthorizer_2_GaZC4E/store/appc" --authenticate_http_readonly="true"
--authenticate_http_readwrite="true" --authenticatee="crammd5" --authentication_backoff_factor="1secs"
--authorizer="local" --cgroups_cpu_enable_pids_and_tids_count="false" --cgroups_enable_cfs="false"
--cgroups_hierarchy="/sys/fs/cgroup" --cgroups_limit_swap="false" --cgroups_root="mesos" --container_disk_watch_interval="15secs"
--containerizers="mesos" --credential="/tmp/Endpoint_SlaveEndpointTest_NoAuthorizer_2_GaZC4E/credential"
--default_role="*" --disallow_sharing_agent_pid_namespace="false" --disk_watch_interval="1mins"
--docker="docker" --docker_kill_orphans="true" --docker_registry="https://registry-1.docker.io"
--docker_remove_delay="6hrs" --docker_socket="/var/run/docker.sock" --docker_stop_timeout="0ns"
--docker_store_dir="/tmp/Endpoint_SlaveEndpointTest_NoAuthorizer_2_GaZC4E/store/docker" --docker_volume_checkpoint_dir="/var/run/mesos/isolators/docker/volume"
--enforce_container_disk_quota="false" --executor_registration_timeout="1mins" --executor_reregistration_timeout="2secs"
--executor_shutdown_grace_period="5secs" --fetcher_cache_dir="/tmp/Endpoint_SlaveEndpointTest_NoAuthorizer_2_GaZC4E/fetch"
--fetcher_cache_size="2GB" --frameworks_home="" --gc_delay="1weeks" --gc_disk_headroom="0.1"
--hadoop_home="" --help="false" --hostname_lookup="true" --http_command_executor="false" --http_credentials="/tmp/Endpoint_SlaveEndpointTest_NoAuthorizer_2_GaZC4E/http_credentials"
--http_heartbeat_interval="30secs" --initialize_driver_logging="true" --isolation="posix/cpu,posix/mem"
--launcher="posix" --launcher_dir="/mesos/mesos-1.5.0/_build/src" --logbufsecs="0" --logging_level="INFO"
--max_completed_executors_per_framework="150" --oversubscribed_resources_interval="15secs"
--perf_duration="10secs" --perf_interval="1mins" --port="5051" --qos_correction_interval_min="0ns"
--quiet="false" --recover="reconnect" --recovery_timeout="15mins" --registration_backoff_factor="10ms"
--resources="cpus:2;gpus:0;mem:1024;disk:1024;ports:[31000-32000]" --revocable_cpu_low_priority="true"
--runtime_dir="/tmp/Endpoint_SlaveEndpointTest_NoAuthorizer_2_GaZC4E" --sandbox_directory="/mnt/mesos/sandbox"
--strict="true" --switch_user="true" --systemd_enable_support="true" --systemd_runtime_directory="/run/systemd/system"
--version="false" --work_dir="/tmp/Endpoint_SlaveEndpointTest_NoAuthorizer_2_6IxAB1" --zk_session_timeout="10secs"
I1008 07:26:28.498770  5583 credentials.hpp:86] Loading credential for authentication from
'/tmp/Endpoint_SlaveEndpointTest_NoAuthorizer_2_GaZC4E/credential'
I1008 07:26:28.498937  5583 slave.cpp:287] Agent using credential for: test-principal
I1008 07:26:28.498960  5583 credentials.hpp:37] Loading credentials for authentication from
'/tmp/Endpoint_SlaveEndpointTest_NoAuthorizer_2_GaZC4E/http_credentials'
I1008 07:26:28.499269  5583 http.cpp:1045] Creating default 'basic' HTTP authenticator for
realm 'mesos-agent-readonly'
I1008 07:26:28.499455  5583 http.cpp:1045] Creating default 'basic' HTTP authenticator for
realm 'mesos-agent-readwrite'
I1008 07:26:28.501184  5583 slave.cpp:585] Agent resources: [{"name":"cpus","scalar":{"value":2.0},"type":"SCALAR"},{"name":"mem","scalar":{"value":1024.0},"type":"SCALAR"},{"name":"disk","scalar":{"value":1024.0},"type":"SCALAR"},{"name":"ports","ranges":{"range":[{"begin":31000,"end":32000}]},"type":"RANGES"}]
I1008 07:26:28.501477  5583 slave.cpp:593] Agent attributes: [  ]
I1008 07:26:28.501495  5583 slave.cpp:602] Agent hostname: 184618c8908f
I1008 07:26:28.501727  5575 status_update_manager.cpp:177] Pausing sending status updates
I1008 07:26:28.503237  5566 state.cpp:64] Recovering state from '/tmp/Endpoint_SlaveEndpointTest_NoAuthorizer_2_6IxAB1/meta'
I1008 07:26:28.503674  5568 status_update_manager.cpp:203] Recovering status update manager
I1008 07:26:28.503989  5571 containerizer.cpp:648] Recovering containerizer
I1008 07:26:28.505807  5579 provisioner.cpp:416] Provisioner recovery complete
I1008 07:26:28.506299  5584 slave.cpp:6326] Finished recovery
I1008 07:26:28.507092  5584 slave.cpp:6512] Querying resource estimator for oversubscribable
resources
I1008 07:26:28.507367  5568 slave.cpp:6526] Received oversubscribable resources {} from the
resource estimator
I1008 07:26:28.510046  5581 process.cpp:3929] Handling HTTP event for process 'slave(828)'
with path: '/slave(828)/containers'
I1008 07:26:28.511834  5577 http.cpp:1185] HTTP GET for /slave(828)/containers from 172.17.0.4:35720
I1008 07:26:28.511952  5577 http.cpp:976] Authorizing principal 'test-principal' to GET the
'/containers' endpoint
I1008 07:26:28.516887  5562 slave.cpp:869] Agent terminating
[       OK ] Endpoint/SlaveEndpointTest.NoAuthorizer/2 (37 ms)
[----------] 9 tests from Endpoint/SlaveEndpointTest (357 ms total)

[----------] 2 tests from ContainerizerType/DefaultContainerDNSFlagTest
[ RUN      ] ContainerizerType/DefaultContainerDNSFlagTest.ValidateFlag/0
[       OK ] ContainerizerType/DefaultContainerDNSFlagTest.ValidateFlag/0 (12 ms)
[ RUN      ] ContainerizerType/DefaultContainerDNSFlagTest.ValidateFlag/1
[       OK ] ContainerizerType/DefaultContainerDNSFlagTest.ValidateFlag/1 (11 ms)
[----------] 2 tests from ContainerizerType/DefaultContainerDNSFlagTest (23 ms total)

[----------] Global test environment tear-down
[==========] 1688 tests from 185 test cases ran. (584612 ms total)
[  PASSED  ] 1687 tests.
[  FAILED  ] 1 test, listed below:
[  FAILED  ] MasterTest.IgnoreOldAgentReregistration

 1 FAILED TEST
  YOU HAVE 21 DISABLED TESTS

I1008 07:26:28.611333  5587 process.cpp:1068] Failed to accept socket: future discarded
make[4]: *** [check-local] Error 1
make[4]: Leaving directory `/mesos/mesos-1.5.0/_build/src'
make[3]: *** [check-am] Error 2
make[3]: Leaving directory `/mesos/mesos-1.5.0/_build/src'
make[2]: *** [check] Error 2
make[2]: Leaving directory `/mesos/mesos-1.5.0/_build/src'
make[1]: *** [check-recursive] Error 1
make[1]: Leaving directory `/mesos/mesos-1.5.0/_build'
make: *** [distcheck] Error 1
+ docker rmi mesos-1507444292-26316
Untagged: mesos-1507444292-26316:latest
Deleted: sha256:cf929192a2b46dee0b65afb01d50472446a818ff799698a00d8f4f67b5cceafc
Deleted: sha256:ba3752852c4f7a2522d7c8061a1379f598d3fde9558c0b7eeea9dbd8bca49194
Deleted: sha256:14e2ef3c42097324134e84c2db506a8ef2a49dc5243a2217f5d39b23471b6ea2
Deleted: sha256:28ded6a5c00c807edb2a8b36fa78cb83573b15503043f98633555bf78be10256
Deleted: sha256:7fcd339a53d0c1e30653750269fb13cada5ba6f4950b5672458bced4b3b313b4
Deleted: sha256:955b45bed51a6ea1c031d9c2d35f60748135932b53a62531d7cf4a06f29adf79
Deleted: sha256:aa54b868a3b790123833b1022723373a1510a75bb43ae67bf7bb71635fba768f
Deleted: sha256:a28579619e2c49bbed6953d5fdb6b04c62a0804a0cae8c43375321203c75517b
Deleted: sha256:a8d6f93c8807e9af8d8ad0873001130a991252397446225be6445e6332bc9459
Deleted: sha256:cee944292f3afd0fd1077286ac595f844af14bdb76c45f4154fc5253a1e4c831
Deleted: sha256:21cd33cbae2e797e6cae69c4659266be4ad9aba5417e3763406a55de652da3b2
Deleted: sha256:5483d8c24a2eb176452802f7e88e83a32e6e8cf862e0b3ab81fc18096c794477
Deleted: sha256:ad5f6cbd999d4c871a5da3e3245a5d7c8c9864b0c4955bf4698baa1a70f045eb
Deleted: sha256:041d5d9214aa65069ab84be19743c48882527ee808be3fd5c6d583a3cbde3fab
Deleted: sha256:30ca47a074de5629e7cf616ffe45024cc92c47513408368c7129bf9c647e4c27
Deleted: sha256:1f91913337325a8e18669e47639d6f0c938b2b655e38143afdf859857b862eb9
Deleted: sha256:c37414823ff078d9d5a89df7a50eb8db7ff3f146459f77b4ba2d7bbf1c5e3e23
Deleted: sha256:74a5a7e6d0f6e77de755f94cbe5a4c3dffeec736893a32967ff867cce5673823
Deleted: sha256:4428382af226a7f0d0c7b7179fae5102f2445cbac55e5cab160548cf85579bf9
Deleted: sha256:57e868ec7b6d386d2acf0acf3771a4f9ffb580ce6d3e15dca8ba563305109fd2
Deleted: sha256:74db601e3b65ffeeda62c7987ec9be1ea4c105a460376d8f71c1f1552502fd13
Deleted: sha256:6bd1fe3ccc95cdd90cdd718c66c89449ac0751fdb069a0c636477ef953cbfd7e
Deleted: sha256:86fe57fb8bff522c6e7619c38183b5133cdd4716065e681d5f272c1f0ede44aa
Deleted: sha256:e11d870bcc361f3ad9f1808fea39a4cc96912f4a39c4937bd9924c49205fd740
Deleted: sha256:32de869192eb3067c537d297237904bc99f584f8063ed5b5428c8645d6f7ae7c
Deleted: sha256:1dfa4a501b608b194d3cb63f631c93fe1bf1fd2d0bda7439a251529ea74f8f53
Deleted: sha256:fbc8c94ecd7d3118210d3eef3e9d33470bb2ec2a8da7a815bb567b6fb1363acb
Deleted: sha256:9e9c68982c38943913b9079ef34f1c9ad712ae305109d248f68e1f9c08e026c7
Build step 'Execute shell' marked build as failure

Mime
View raw message