mesos-builds mailing list archives

Site index · List index
Message view « Date » · « Thread »
Top « Date » · « Thread »
From Apache Jenkins Server <jenk...@builds.apache.org>
Subject Build failed in Jenkins: Mesos-Buildbot » autotools,gcc,--verbose --disable-libtool-wrappers --enable-libevent --enable-ssl,GLOG_v=1 MESOS_VERBOSE=1,centos:7,(ubuntu)&&(!ubuntu-us1)&&(!ubuntu-eu2)&&(!qnode3)&&(!H23) #4324
Date Fri, 13 Oct 2017 23:49:10 GMT
See <https://builds.apache.org/job/Mesos-Buildbot/BUILDTOOL=autotools,COMPILER=gcc,CONFIGURATION=--verbose%20--disable-libtool-wrappers%20--enable-libevent%20--enable-ssl,ENVIRONMENT=GLOG_v=1%20MESOS_VERBOSE=1,OS=centos%3A7,label_exp=(ubuntu)&&(!ubuntu-us1)&&(!ubuntu-eu2)&&(!qnode3)&&(!H23)/4324/display/redirect?page=changes>

Changes:

[jpeach] Added a benchmark test for allocating shared resources.

------------------------------------------
[...truncated 33.19 MB...]
I1013 23:49:01.126778 19350 slave.cpp:255] Flags at startup: --acls="" --appc_simple_discovery_uri_prefix="http://"
--appc_store_dir="/tmp/Endpoint_SlaveEndpointTest_UnauthorizedRequest_0_Ozm9ms/store/appc"
--authenticate_http_executors="true" --authenticate_http_readonly="true" --authenticate_http_readwrite="true"
--authenticatee="crammd5" --authentication_backoff_factor="1secs" --authorizer="local" --cgroups_cpu_enable_pids_and_tids_count="false"
--cgroups_enable_cfs="false" --cgroups_hierarchy="/sys/fs/cgroup" --cgroups_limit_swap="false"
--cgroups_root="mesos" --container_disk_watch_interval="15secs" --containerizers="mesos" --credential="/tmp/Endpoint_SlaveEndpointTest_UnauthorizedRequest_0_Ozm9ms/credential"
--default_role="*" --disallow_sharing_agent_pid_namespace="false" --disk_watch_interval="1mins"
--docker="docker" --docker_kill_orphans="true" --docker_registry="https://registry-1.docker.io"
--docker_remove_delay="6hrs" --docker_socket="/var/run/docker.sock" --docker_stop_timeout="0ns"
--docker_store_dir="/tmp/Endpoint_SlaveEndpointTest_UnauthorizedRequest_0_Ozm9ms/store/docker"
--docker_volume_checkpoint_dir="/var/run/mesos/isolators/docker/volume" --enforce_container_disk_quota="false"
--executor_registration_timeout="1mins" --executor_reregistration_timeout="2secs" --executor_secret_key="/tmp/Endpoint_SlaveEndpointTest_UnauthorizedRequest_0_Ozm9ms/executor_secret_key"
--executor_shutdown_grace_period="5secs" --fetcher_cache_dir="/tmp/Endpoint_SlaveEndpointTest_UnauthorizedRequest_0_Ozm9ms/fetch"
--fetcher_cache_size="2GB" --frameworks_home="" --gc_delay="1weeks" --gc_disk_headroom="0.1"
--hadoop_home="" --help="false" --hostname_lookup="true" --http_command_executor="false" --http_credentials="/tmp/Endpoint_SlaveEndpointTest_UnauthorizedRequest_0_Ozm9ms/http_credentials"
--http_heartbeat_interval="30secs" --initialize_driver_logging="true" --isolation="posix/cpu,posix/mem"
--launcher="posix" --launcher_dir="/mesos/mesos-1.5.0/_build/src" --logbufsecs="0" --logging_level="INFO"
--max_completed_executors_per_framework="150" --oversubscribed_resources_interval="15secs"
--perf_duration="10secs" --perf_interval="1mins" --port="5051" --qos_correction_interval_min="0ns"
--quiet="false" --recover="reconnect" --recovery_timeout="15mins" --registration_backoff_factor="10ms"
--resources="cpus:2;gpus:0;mem:1024;disk:1024;ports:[31000-32000]" --revocable_cpu_low_priority="true"
--runtime_dir="/tmp/Endpoint_SlaveEndpointTest_UnauthorizedRequest_0_Ozm9ms" --sandbox_directory="/mnt/mesos/sandbox"
--strict="true" --switch_user="true" --systemd_enable_support="true" --systemd_runtime_directory="/run/systemd/system"
--version="false" --work_dir="/tmp/Endpoint_SlaveEndpointTest_UnauthorizedRequest_0_oYdRIn"
--zk_session_timeout="10secs"
I1013 23:49:01.127164 19350 credentials.hpp:86] Loading credential for authentication from
'/tmp/Endpoint_SlaveEndpointTest_UnauthorizedRequest_0_Ozm9ms/credential'
I1013 23:49:01.127328 19350 slave.cpp:287] Agent using credential for: test-principal
I1013 23:49:01.127351 19350 credentials.hpp:37] Loading credentials for authentication from
'/tmp/Endpoint_SlaveEndpointTest_UnauthorizedRequest_0_Ozm9ms/http_credentials'
I1013 23:49:01.127637 19350 http.cpp:1045] Creating default 'basic' HTTP authenticator for
realm 'mesos-agent-executor'
I1013 23:49:01.127763 19350 http.cpp:1066] Creating default 'jwt' HTTP authenticator for realm
'mesos-agent-executor'
I1013 23:49:01.127965 19350 http.cpp:1045] Creating default 'basic' HTTP authenticator for
realm 'mesos-agent-readonly'
I1013 23:49:01.128062 19350 http.cpp:1066] Creating default 'jwt' HTTP authenticator for realm
'mesos-agent-readonly'
I1013 23:49:01.128242 19350 http.cpp:1045] Creating default 'basic' HTTP authenticator for
realm 'mesos-agent-readwrite'
I1013 23:49:01.128340 19350 http.cpp:1066] Creating default 'jwt' HTTP authenticator for realm
'mesos-agent-readwrite'
I1013 23:49:01.129791 19350 slave.cpp:585] Agent resources: [{"name":"cpus","scalar":{"value":2.0},"type":"SCALAR"},{"name":"mem","scalar":{"value":1024.0},"type":"SCALAR"},{"name":"disk","scalar":{"value":1024.0},"type":"SCALAR"},{"name":"ports","ranges":{"range":[{"begin":31000,"end":32000}]},"type":"RANGES"}]
I1013 23:49:01.130048 19350 slave.cpp:593] Agent attributes: [  ]
I1013 23:49:01.130064 19350 slave.cpp:602] Agent hostname: 13922d09266f
I1013 23:49:01.130193 19334 status_update_manager.cpp:177] Pausing sending status updates
I1013 23:49:01.131748 19338 state.cpp:64] Recovering state from '/tmp/Endpoint_SlaveEndpointTest_UnauthorizedRequest_0_oYdRIn/meta'
I1013 23:49:01.132006 19351 status_update_manager.cpp:203] Recovering status update manager
I1013 23:49:01.132218 19341 containerizer.cpp:648] Recovering containerizer
I1013 23:49:01.133622 19356 provisioner.cpp:416] Provisioner recovery complete
I1013 23:49:01.133951 19334 slave.cpp:6310] Finished recovery
I1013 23:49:01.134420 19334 slave.cpp:6492] Querying resource estimator for oversubscribable
resources
I1013 23:49:01.134675 19345 slave.cpp:6506] Received oversubscribable resources {} from the
resource estimator
I1013 23:49:01.136965 19352 process.cpp:3929] Handling HTTP event for process 'slave(825)'
with path: '/slave(825)/monitor/statistics'
I1013 23:49:01.138697 19344 http.cpp:1185] HTTP GET for /slave(825)/monitor/statistics from
172.17.0.3:33284
I1013 23:49:01.138783 19344 http.cpp:976] Authorizing principal 'test-principal' to GET the
'/monitor/statistics' endpoint
I1013 23:49:01.140431 19343 slave.cpp:869] Agent terminating
[       OK ] Endpoint/SlaveEndpointTest.UnauthorizedRequest/0 (32 ms)
[ RUN      ] Endpoint/SlaveEndpointTest.UnauthorizedRequest/1
I1013 23:49:01.151620  9512 containerizer.cpp:292] Using isolation { environment_secret, posix/cpu,
posix/mem, filesystem/posix, network/cni }
W1013 23:49:01.152158  9512 backend.cpp:76] Failed to create 'aufs' backend: AufsBackend requires
root privileges
W1013 23:49:01.152272  9512 backend.cpp:76] Failed to create 'bind' backend: BindBackend requires
root privileges
I1013 23:49:01.152305  9512 provisioner.cpp:255] Using default backend 'copy'
I1013 23:49:01.155831 19349 slave.cpp:254] Mesos agent started on (826)@172.17.0.3:35992
I1013 23:49:01.155859 19349 slave.cpp:255] Flags at startup: --acls="" --appc_simple_discovery_uri_prefix="http://"
--appc_store_dir="/tmp/Endpoint_SlaveEndpointTest_UnauthorizedRequest_1_4uG4cL/store/appc"
--authenticate_http_executors="true" --authenticate_http_readonly="true" --authenticate_http_readwrite="true"
--authenticatee="crammd5" --authentication_backoff_factor="1secs" --authorizer="local" --cgroups_cpu_enable_pids_and_tids_count="false"
--cgroups_enable_cfs="false" --cgroups_hierarchy="/sys/fs/cgroup" --cgroups_limit_swap="false"
--cgroups_root="mesos" --container_disk_watch_interval="15secs" --containerizers="mesos" --credential="/tmp/Endpoint_SlaveEndpointTest_UnauthorizedRequest_1_4uG4cL/credential"
--default_role="*" --disallow_sharing_agent_pid_namespace="false" --disk_watch_interval="1mins"
--docker="docker" --docker_kill_orphans="true" --docker_registry="https://registry-1.docker.io"
--docker_remove_delay="6hrs" --docker_socket="/var/run/docker.sock" --docker_stop_timeout="0ns"
--docker_store_dir="/tmp/Endpoint_SlaveEndpointTest_UnauthorizedRequest_1_4uG4cL/store/docker"
--docker_volume_checkpoint_dir="/var/run/mesos/isolators/docker/volume" --enforce_container_disk_quota="false"
--executor_registration_timeout="1mins" --executor_reregistration_timeout="2secs" --executor_secret_key="/tmp/Endpoint_SlaveEndpointTest_UnauthorizedRequest_1_4uG4cL/executor_secret_key"
--executor_shutdown_grace_period="5secs" --fetcher_cache_dir="/tmp/Endpoint_SlaveEndpointTest_UnauthorizedRequest_1_4uG4cL/fetch"
--fetcher_cache_size="2GB" --frameworks_home="" --gc_delay="1weeks" --gc_disk_headroom="0.1"
--hadoop_home="" --help="false" --hostname_lookup="true" --http_command_executor="false" --http_credentials="/tmp/Endpoint_SlaveEndpointTest_UnauthorizedRequest_1_4uG4cL/http_credentials"
--http_heartbeat_interval="30secs" --initialize_driver_logging="true" --isolation="posix/cpu,posix/mem"
--launcher="posix" --launcher_dir="/mesos/mesos-1.5.0/_build/src" --logbufsecs="0" --logging_level="INFO"
--max_completed_executors_per_framework="150" --oversubscribed_resources_interval="15secs"
--perf_duration="10secs" --perf_interval="1mins" --port="5051" --qos_correction_interval_min="0ns"
--quiet="false" --recover="reconnect" --recovery_timeout="15mins" --registration_backoff_factor="10ms"
--resources="cpus:2;gpus:0;mem:1024;disk:1024;ports:[31000-32000]" --revocable_cpu_low_priority="true"
--runtime_dir="/tmp/Endpoint_SlaveEndpointTest_UnauthorizedRequest_1_4uG4cL" --sandbox_directory="/mnt/mesos/sandbox"
--strict="true" --switch_user="true" --systemd_enable_support="true" --systemd_runtime_directory="/run/systemd/system"
--version="false" --work_dir="/tmp/Endpoint_SlaveEndpointTest_UnauthorizedRequest_1_MHLsuG"
--zk_session_timeout="10secs"
I1013 23:49:01.156246 19349 credentials.hpp:86] Loading credential for authentication from
'/tmp/Endpoint_SlaveEndpointTest_UnauthorizedRequest_1_4uG4cL/credential'
I1013 23:49:01.156419 19349 slave.cpp:287] Agent using credential for: test-principal
I1013 23:49:01.156441 19349 credentials.hpp:37] Loading credentials for authentication from
'/tmp/Endpoint_SlaveEndpointTest_UnauthorizedRequest_1_4uG4cL/http_credentials'
I1013 23:49:01.156735 19349 http.cpp:1045] Creating default 'basic' HTTP authenticator for
realm 'mesos-agent-executor'
I1013 23:49:01.156872 19349 http.cpp:1066] Creating default 'jwt' HTTP authenticator for realm
'mesos-agent-executor'
I1013 23:49:01.157081 19349 http.cpp:1045] Creating default 'basic' HTTP authenticator for
realm 'mesos-agent-readonly'
I1013 23:49:01.157181 19349 http.cpp:1066] Creating default 'jwt' HTTP authenticator for realm
'mesos-agent-readonly'
I1013 23:49:01.157362 19349 http.cpp:1045] Creating default 'basic' HTTP authenticator for
realm 'mesos-agent-readwrite'
I1013 23:49:01.157464 19349 http.cpp:1066] Creating default 'jwt' HTTP authenticator for realm
'mesos-agent-readwrite'
I1013 23:49:01.158948 19349 slave.cpp:585] Agent resources: [{"name":"cpus","scalar":{"value":2.0},"type":"SCALAR"},{"name":"mem","scalar":{"value":1024.0},"type":"SCALAR"},{"name":"disk","scalar":{"value":1024.0},"type":"SCALAR"},{"name":"ports","ranges":{"range":[{"begin":31000,"end":32000}]},"type":"RANGES"}]
I1013 23:49:01.159189 19349 slave.cpp:593] Agent attributes: [  ]
I1013 23:49:01.159204 19349 slave.cpp:602] Agent hostname: 13922d09266f
I1013 23:49:01.159346 19334 status_update_manager.cpp:177] Pausing sending status updates
I1013 23:49:01.160922 19343 state.cpp:64] Recovering state from '/tmp/Endpoint_SlaveEndpointTest_UnauthorizedRequest_1_MHLsuG/meta'
I1013 23:49:01.161237 19342 status_update_manager.cpp:203] Recovering status update manager
I1013 23:49:01.161432 19356 containerizer.cpp:648] Recovering containerizer
I1013 23:49:01.162727 19351 provisioner.cpp:416] Provisioner recovery complete
I1013 23:49:01.163086 19357 slave.cpp:6310] Finished recovery
I1013 23:49:01.163592 19357 slave.cpp:6492] Querying resource estimator for oversubscribable
resources
I1013 23:49:01.163866 19339 slave.cpp:6506] Received oversubscribable resources {} from the
resource estimator
I1013 23:49:01.166131 19338 process.cpp:3929] Handling HTTP event for process 'slave(826)'
with path: '/slave(826)/monitor/statistics.json'
I1013 23:49:01.167927 19341 http.cpp:1185] HTTP GET for /slave(826)/monitor/statistics.json
from 172.17.0.3:33286
I1013 23:49:01.168014 19341 http.cpp:976] Authorizing principal 'test-principal' to GET the
'/monitor/statistics.json' endpoint
I1013 23:49:01.169773 19334 slave.cpp:869] Agent terminating
[       OK ] Endpoint/SlaveEndpointTest.UnauthorizedRequest/1 (29 ms)
[ RUN      ] Endpoint/SlaveEndpointTest.UnauthorizedRequest/2
I1013 23:49:01.180619  9512 containerizer.cpp:292] Using isolation { environment_secret, posix/cpu,
posix/mem, filesystem/posix, network/cni }
W1013 23:49:01.181147  9512 backend.cpp:76] Failed to create 'aufs' backend: AufsBackend requires
root privileges
W1013 23:49:01.181267  9512 backend.cpp:76] Failed to create 'bind' backend: BindBackend requires
root privileges
I1013 23:49:01.181299  9512 provisioner.cpp:255] Using default backend 'copy'
I1013 23:49:01.184653 19347 slave.cpp:254] Mesos agent started on (827)@172.17.0.3:35992
I1013 23:49:01.184679 19347 slave.cpp:255] Flags at startup: --acls="" --appc_simple_discovery_uri_prefix="http://"
--appc_store_dir="/tmp/Endpoint_SlaveEndpointTest_UnauthorizedRequest_2_cxylk4/store/appc"
--authenticate_http_executors="true" --authenticate_http_readonly="true" --authenticate_http_readwrite="true"
--authenticatee="crammd5" --authentication_backoff_factor="1secs" --authorizer="local" --cgroups_cpu_enable_pids_and_tids_count="false"
--cgroups_enable_cfs="false" --cgroups_hierarchy="/sys/fs/cgroup" --cgroups_limit_swap="false"
--cgroups_root="mesos" --container_disk_watch_interval="15secs" --containerizers="mesos" --credential="/tmp/Endpoint_SlaveEndpointTest_UnauthorizedRequest_2_cxylk4/credential"
--default_role="*" --disallow_sharing_agent_pid_namespace="false" --disk_watch_interval="1mins"
--docker="docker" --docker_kill_orphans="true" --docker_registry="https://registry-1.docker.io"
--docker_remove_delay="6hrs" --docker_socket="/var/run/docker.sock" --docker_stop_timeout="0ns"
--docker_store_dir="/tmp/Endpoint_SlaveEndpointTest_UnauthorizedRequest_2_cxylk4/store/docker"
--docker_volume_checkpoint_dir="/var/run/mesos/isolators/docker/volume" --enforce_container_disk_quota="false"
--executor_registration_timeout="1mins" --executor_reregistration_timeout="2secs" --executor_secret_key="/tmp/Endpoint_SlaveEndpointTest_UnauthorizedRequest_2_cxylk4/executor_secret_key"
--executor_shutdown_grace_period="5secs" --fetcher_cache_dir="/tmp/Endpoint_SlaveEndpointTest_UnauthorizedRequest_2_cxylk4/fetch"
--fetcher_cache_size="2GB" --frameworks_home="" --gc_delay="1weeks" --gc_disk_headroom="0.1"
--hadoop_home="" --help="false" --hostname_lookup="true" --http_command_executor="false" --http_credentials="/tmp/Endpoint_SlaveEndpointTest_UnauthorizedRequest_2_cxylk4/http_credentials"
--http_heartbeat_interval="30secs" --initialize_driver_logging="true" --isolation="posix/cpu,posix/mem"
--launcher="posix" --launcher_dir="/mesos/mesos-1.5.0/_build/src" --logbufsecs="0" --logging_level="INFO"
--max_completed_executors_per_framework="150" --oversubscribed_resources_interval="15secs"
--perf_duration="10secs" --perf_interval="1mins" --port="5051" --qos_correction_interval_min="0ns"
--quiet="false" --recover="reconnect" --recovery_timeout="15mins" --registration_backoff_factor="10ms"
--resources="cpus:2;gpus:0;mem:1024;disk:1024;ports:[31000-32000]" --revocable_cpu_low_priority="true"
--runtime_dir="/tmp/Endpoint_SlaveEndpointTest_UnauthorizedRequest_2_cxylk4" --sandbox_directory="/mnt/mesos/sandbox"
--strict="true" --switch_user="true" --systemd_enable_support="true" --systemd_runtime_directory="/run/systemd/system"
--version="false" --work_dir="/tmp/Endpoint_SlaveEndpointTest_UnauthorizedRequest_2_Sx9oxZ"
--zk_session_timeout="10secs"
I1013 23:49:01.185045 19347 credentials.hpp:86] Loading credential for authentication from
'/tmp/Endpoint_SlaveEndpointTest_UnauthorizedRequest_2_cxylk4/credential'
I1013 23:49:01.185194 19347 slave.cpp:287] Agent using credential for: test-principal
I1013 23:49:01.185215 19347 credentials.hpp:37] Loading credentials for authentication from
'/tmp/Endpoint_SlaveEndpointTest_UnauthorizedRequest_2_cxylk4/http_credentials'
I1013 23:49:01.185492 19347 http.cpp:1045] Creating default 'basic' HTTP authenticator for
realm 'mesos-agent-executor'
I1013 23:49:01.185607 19347 http.cpp:1066] Creating default 'jwt' HTTP authenticator for realm
'mesos-agent-executor'
I1013 23:49:01.185806 19347 http.cpp:1045] Creating default 'basic' HTTP authenticator for
realm 'mesos-agent-readonly'
I1013 23:49:01.185942 19347 http.cpp:1066] Creating default 'jwt' HTTP authenticator for realm
'mesos-agent-readonly'
I1013 23:49:01.186127 19347 http.cpp:1045] Creating default 'basic' HTTP authenticator for
realm 'mesos-agent-readwrite'
I1013 23:49:01.186225 19347 http.cpp:1066] Creating default 'jwt' HTTP authenticator for realm
'mesos-agent-readwrite'
I1013 23:49:01.187602 19347 slave.cpp:585] Agent resources: [{"name":"cpus","scalar":{"value":2.0},"type":"SCALAR"},{"name":"mem","scalar":{"value":1024.0},"type":"SCALAR"},{"name":"disk","scalar":{"value":1024.0},"type":"SCALAR"},{"name":"ports","ranges":{"range":[{"begin":31000,"end":32000}]},"type":"RANGES"}]
I1013 23:49:01.187834 19347 slave.cpp:593] Agent attributes: [  ]
I1013 23:49:01.187849 19347 slave.cpp:602] Agent hostname: 13922d09266f
I1013 23:49:01.187997 19354 status_update_manager.cpp:177] Pausing sending status updates
I1013 23:49:01.189394 19341 state.cpp:64] Recovering state from '/tmp/Endpoint_SlaveEndpointTest_UnauthorizedRequest_2_Sx9oxZ/meta'
I1013 23:49:01.189663 19338 status_update_manager.cpp:203] Recovering status update manager
I1013 23:49:01.189844 19343 containerizer.cpp:648] Recovering containerizer
I1013 23:49:01.191009 19348 provisioner.cpp:416] Provisioner recovery complete
I1013 23:49:01.191368 19346 slave.cpp:6310] Finished recovery
I1013 23:49:01.191795 19346 slave.cpp:6492] Querying resource estimator for oversubscribable
resources
I1013 23:49:01.192015 19355 slave.cpp:6506] Received oversubscribable resources {} from the
resource estimator
I1013 23:49:01.193841 19350 process.cpp:3929] Handling HTTP event for process 'slave(827)'
with path: '/slave(827)/containers'
I1013 23:49:01.195559 19348 http.cpp:1185] HTTP GET for /slave(827)/containers from 172.17.0.3:33288
I1013 23:49:01.195629 19348 http.cpp:976] Authorizing principal 'test-principal' to GET the
'/containers' endpoint
I1013 23:49:01.197226 19335 slave.cpp:869] Agent terminating
[       OK ] Endpoint/SlaveEndpointTest.UnauthorizedRequest/2 (27 ms)
[ RUN      ] Endpoint/SlaveEndpointTest.NoAuthorizer/0
I1013 23:49:01.207990  9512 containerizer.cpp:292] Using isolation { environment_secret, posix/cpu,
posix/mem, filesystem/posix, network/cni }
W1013 23:49:01.208499  9512 backend.cpp:76] Failed to create 'aufs' backend: AufsBackend requires
root privileges
W1013 23:49:01.208608  9512 backend.cpp:76] Failed to create 'bind' backend: BindBackend requires
root privileges
I1013 23:49:01.208642  9512 provisioner.cpp:255] Using default backend 'copy'
I1013 23:49:01.210213  9512 cluster.cpp:448] Creating default 'local' authorizer
I1013 23:49:01.212177 19342 slave.cpp:254] Mesos agent started on (828)@172.17.0.3:35992
I1013 23:49:01.212203 19342 slave.cpp:255] Flags at startup: --acls="" --appc_simple_discovery_uri_prefix="http://"
--appc_store_dir="/tmp/Endpoint_SlaveEndpointTest_NoAuthorizer_0_SEJXHn/store/appc" --authenticate_http_executors="true"
--authenticate_http_readonly="true" --authenticate_http_readwrite="true" --authenticatee="crammd5"
--authentication_backoff_factor="1secs" --authorizer="local" --cgroups_cpu_enable_pids_and_tids_count="false"
--cgroups_enable_cfs="false" --cgroups_hierarchy="/sys/fs/cgroup" --cgroups_limit_swap="false"
--cgroups_root="mesos" --container_disk_watch_interval="15secs" --containerizers="mesos" --credential="/tmp/Endpoint_SlaveEndpointTest_NoAuthorizer_0_SEJXHn/credential"
--default_role="*" --disallow_sharing_agent_pid_namespace="false" --disk_watch_interval="1mins"
--docker="docker" --docker_kill_orphans="true" --docker_registry="https://registry-1.docker.io"
--docker_remove_delay="6hrs" --docker_socket="/var/run/docker.sock" --docker_stop_timeout="0ns"
--docker_store_dir="/tmp/Endpoint_SlaveEndpointTest_NoAuthorizer_0_SEJXHn/store/docker" --docker_volume_checkpoint_dir="/var/run/mesos/isolators/docker/volume"
--enforce_container_disk_quota="false" --executor_registration_timeout="1mins" --executor_reregistration_timeout="2secs"
--executor_secret_key="/tmp/Endpoint_SlaveEndpointTest_NoAuthorizer_0_SEJXHn/executor_secret_key"
--executor_shutdown_grace_period="5secs" --fetcher_cache_dir="/tmp/Endpoint_SlaveEndpointTest_NoAuthorizer_0_SEJXHn/fetch"
--fetcher_cache_size="2GB" --frameworks_home="" --gc_delay="1weeks" --gc_disk_headroom="0.1"
--hadoop_home="" --help="false" --hostname_lookup="true" --http_command_executor="false" --http_credentials="/tmp/Endpoint_SlaveEndpointTest_NoAuthorizer_0_SEJXHn/http_credentials"
--http_heartbeat_interval="30secs" --initialize_driver_logging="true" --isolation="posix/cpu,posix/mem"
--launcher="posix" --launcher_dir="/mesos/mesos-1.5.0/_build/src" --logbufsecs="0" --logging_level="INFO"
--max_completed_executors_per_framework="150" --oversubscribed_resources_interval="15secs"
--perf_duration="10secs" --perf_interval="1mins" --port="5051" --qos_correction_interval_min="0ns"
--quiet="false" --recover="reconnect" --recovery_timeout="15mins" --registration_backoff_factor="10ms"
--resources="cpus:2;gpus:0;mem:1024;disk:1024;ports:[31000-32000]" --revocable_cpu_low_priority="true"
--runtime_dir="/tmp/Endpoint_SlaveEndpointTest_NoAuthorizer_0_SEJXHn" --sandbox_directory="/mnt/mesos/sandbox"
--strict="true" --switch_user="true" --systemd_enable_support="true" --systemd_runtime_directory="/run/systemd/system"
--version="false" --work_dir="/tmp/Endpoint_SlaveEndpointTest_NoAuthorizer_0_2ORYQi" --zk_session_timeout="10secs"
I1013 23:49:01.212602 19342 credentials.hpp:86] Loading credential for authentication from
'/tmp/Endpoint_SlaveEndpointTest_NoAuthorizer_0_SEJXHn/credential'
I1013 23:49:01.212764 19342 slave.cpp:287] Agent using credential for: test-principal
I1013 23:49:01.212791 19342 credentials.hpp:37] Loading credentials for authentication from
'/tmp/Endpoint_SlaveEndpointTest_NoAuthorizer_0_SEJXHn/http_credentials'
I1013 23:49:01.213091 19342 http.cpp:1045] Creating default 'basic' HTTP authenticator for
realm 'mesos-agent-executor'
I1013 23:49:01.213212 19342 http.cpp:1066] Creating default 'jwt' HTTP authenticator for realm
'mesos-agent-executor'
I1013 23:49:01.213428 19342 http.cpp:1045] Creating default 'basic' HTTP authenticator for
realm 'mesos-agent-readonly'
I1013 23:49:01.213533 19342 http.cpp:1066] Creating default 'jwt' HTTP authenticator for realm
'mesos-agent-readonly'
I1013 23:49:01.213737 19342 http.cpp:1045] Creating default 'basic' HTTP authenticator for
realm 'mesos-agent-readwrite'
I1013 23:49:01.213845 19342 http.cpp:1066] Creating default 'jwt' HTTP authenticator for realm
'mesos-agent-readwrite'
I1013 23:49:01.216262 19342 slave.cpp:585] Agent resources: [{"name":"cpus","scalar":{"value":2.0},"type":"SCALAR"},{"name":"mem","scalar":{"value":1024.0},"type":"SCALAR"},{"name":"disk","scalar":{"value":1024.0},"type":"SCALAR"},{"name":"ports","ranges":{"range":[{"begin":31000,"end":32000}]},"type":"RANGES"}]
I1013 23:49:01.216684 19342 slave.cpp:593] Agent attributes: [  ]
I1013 23:49:01.216714 19342 slave.cpp:602] Agent hostname: 13922d09266f
I1013 23:49:01.216842 19344 status_update_manager.cpp:177] Pausing sending status updates
I1013 23:49:01.218866 19343 state.cpp:64] Recovering state from '/tmp/Endpoint_SlaveEndpointTest_NoAuthorizer_0_2ORYQi/meta'
I1013 23:49:01.219152 19343 status_update_manager.cpp:203] Recovering status update manager
I1013 23:49:01.219341 19354 containerizer.cpp:648] Recovering containerizer
I1013 23:49:01.220537 19339 provisioner.cpp:416] Provisioner recovery complete
I1013 23:49:01.220826 19344 slave.cpp:6310] Finished recovery
I1013 23:49:01.221225 19344 slave.cpp:6492] Querying resource estimator for oversubscribable
resources
I1013 23:49:01.221446 19337 slave.cpp:6506] Received oversubscribable resources {} from the
resource estimator
I1013 23:49:01.223479 19338 process.cpp:3929] Handling HTTP event for process 'slave(828)'
with path: '/slave(828)/monitor/statistics'
I1013 23:49:01.225101 19349 http.cpp:1185] HTTP GET for /slave(828)/monitor/statistics from
172.17.0.3:33290
I1013 23:49:01.225168 19349 http.cpp:976] Authorizing principal 'test-principal' to GET the
'/monitor/statistics' endpoint
I1013 23:49:01.228637  9512 slave.cpp:869] Agent terminating
[       OK ] Endpoint/SlaveEndpointTest.NoAuthorizer/0 (31 ms)
[ RUN      ] Endpoint/SlaveEndpointTest.NoAuthorizer/1
I1013 23:49:01.239570  9512 containerizer.cpp:292] Using isolation { environment_secret, posix/cpu,
posix/mem, filesystem/posix, network/cni }
W1013 23:49:01.240067  9512 backend.cpp:76] Failed to create 'aufs' backend: AufsBackend requires
root privileges
W1013 23:49:01.240175  9512 backend.cpp:76] Failed to create 'bind' backend: BindBackend requires
root privileges
I1013 23:49:01.240206  9512 provisioner.cpp:255] Using default backend 'copy'
I1013 23:49:01.241788  9512 cluster.cpp:448] Creating default 'local' authorizer
I1013 23:49:01.243664 19335 slave.cpp:254] Mesos agent started on (829)@172.17.0.3:35992
I1013 23:49:01.243693 19335 slave.cpp:255] Flags at startup: --acls="" --appc_simple_discovery_uri_prefix="http://"
--appc_store_dir="/tmp/Endpoint_SlaveEndpointTest_NoAuthorizer_1_Y1a2nH/store/appc" --authenticate_http_executors="true"
--authenticate_http_readonly="true" --authenticate_http_readwrite="true" --authenticatee="crammd5"
--authentication_backoff_factor="1secs" --authorizer="local" --cgroups_cpu_enable_pids_and_tids_count="false"
--cgroups_enable_cfs="false" --cgroups_hierarchy="/sys/fs/cgroup" --cgroups_limit_swap="false"
--cgroups_root="mesos" --container_disk_watch_interval="15secs" --containerizers="mesos" --credential="/tmp/Endpoint_SlaveEndpointTest_NoAuthorizer_1_Y1a2nH/credential"
--default_role="*" --disallow_sharing_agent_pid_namespace="false" --disk_watch_interval="1mins"
--docker="docker" --docker_kill_orphans="true" --docker_registry="https://registry-1.docker.io"
--docker_remove_delay="6hrs" --docker_socket="/var/run/docker.sock" --docker_stop_timeout="0ns"
--docker_store_dir="/tmp/Endpoint_SlaveEndpointTest_NoAuthorizer_1_Y1a2nH/store/docker" --docker_volume_checkpoint_dir="/var/run/mesos/isolators/docker/volume"
--enforce_container_disk_quota="false" --executor_registration_timeout="1mins" --executor_reregistration_timeout="2secs"
--executor_secret_key="/tmp/Endpoint_SlaveEndpointTest_NoAuthorizer_1_Y1a2nH/executor_secret_key"
--executor_shutdown_grace_period="5secs" --fetcher_cache_dir="/tmp/Endpoint_SlaveEndpointTest_NoAuthorizer_1_Y1a2nH/fetch"
--fetcher_cache_size="2GB" --frameworks_home="" --gc_delay="1weeks" --gc_disk_headroom="0.1"
--hadoop_home="" --help="false" --hostname_lookup="true" --http_command_executor="false" --http_credentials="/tmp/Endpoint_SlaveEndpointTest_NoAuthorizer_1_Y1a2nH/http_credentials"
--http_heartbeat_interval="30secs" --initialize_driver_logging="true" --isolation="posix/cpu,posix/mem"
--launcher="posix" --launcher_dir="/mesos/mesos-1.5.0/_build/src" --logbufsecs="0" --logging_level="INFO"
--max_completed_executors_per_framework="150" --oversubscribed_resources_interval="15secs"
--perf_duration="10secs" --perf_interval="1mins" --port="5051" --qos_correction_interval_min="0ns"
--quiet="false" --recover="reconnect" --recovery_timeout="15mins" --registration_backoff_factor="10ms"
--resources="cpus:2;gpus:0;mem:1024;disk:1024;ports:[31000-32000]" --revocable_cpu_low_priority="true"
--runtime_dir="/tmp/Endpoint_SlaveEndpointTest_NoAuthorizer_1_Y1a2nH" --sandbox_directory="/mnt/mesos/sandbox"
--strict="true" --switch_user="true" --systemd_enable_support="true" --systemd_runtime_directory="/run/systemd/system"
--version="false" --work_dir="/tmp/Endpoint_SlaveEndpointTest_NoAuthorizer_1_eGwmsC" --zk_session_timeout="10secs"
I1013 23:49:01.244305 19335 credentials.hpp:86] Loading credential for authentication from
'/tmp/Endpoint_SlaveEndpointTest_NoAuthorizer_1_Y1a2nH/credential'
I1013 23:49:01.244500 19335 slave.cpp:287] Agent using credential for: test-principal
I1013 23:49:01.244529 19335 credentials.hpp:37] Loading credentials for authentication from
'/tmp/Endpoint_SlaveEndpointTest_NoAuthorizer_1_Y1a2nH/http_credentials'
I1013 23:49:01.244935 19335 http.cpp:1045] Creating default 'basic' HTTP authenticator for
realm 'mesos-agent-executor'
I1013 23:49:01.245069 19335 http.cpp:1066] Creating default 'jwt' HTTP authenticator for realm
'mesos-agent-executor'
I1013 23:49:01.245267 19335 http.cpp:1045] Creating default 'basic' HTTP authenticator for
realm 'mesos-agent-readonly'
I1013 23:49:01.245373 19335 http.cpp:1066] Creating default 'jwt' HTTP authenticator for realm
'mesos-agent-readonly'
I1013 23:49:01.245555 19335 http.cpp:1045] Creating default 'basic' HTTP authenticator for
realm 'mesos-agent-readwrite'
I1013 23:49:01.245656 19335 http.cpp:1066] Creating default 'jwt' HTTP authenticator for realm
'mesos-agent-readwrite'
I1013 23:49:01.247048 19335 slave.cpp:585] Agent resources: [{"name":"cpus","scalar":{"value":2.0},"type":"SCALAR"},{"name":"mem","scalar":{"value":1024.0},"type":"SCALAR"},{"name":"disk","scalar":{"value":1024.0},"type":"SCALAR"},{"name":"ports","ranges":{"range":[{"begin":31000,"end":32000}]},"type":"RANGES"}]
I1013 23:49:01.247280 19335 slave.cpp:593] Agent attributes: [  ]
I1013 23:49:01.247292 19335 slave.cpp:602] Agent hostname: 13922d09266f
I1013 23:49:01.247407 19349 status_update_manager.cpp:177] Pausing sending status updates
I1013 23:49:01.248723 19340 state.cpp:64] Recovering state from '/tmp/Endpoint_SlaveEndpointTest_NoAuthorizer_1_eGwmsC/meta'
I1013 23:49:01.248970 19336 status_update_manager.cpp:203] Recovering status update manager
I1013 23:49:01.249138 19357 containerizer.cpp:648] Recovering containerizer
I1013 23:49:01.250349 19345 provisioner.cpp:416] Provisioner recovery complete
I1013 23:49:01.250635 19349 slave.cpp:6310] Finished recovery
I1013 23:49:01.251060 19349 slave.cpp:6492] Querying resource estimator for oversubscribable
resources
I1013 23:49:01.251296 19337 slave.cpp:6506] Received oversubscribable resources {} from the
resource estimator
I1013 23:49:01.253082 19348 process.cpp:3929] Handling HTTP event for process 'slave(829)'
with path: '/slave(829)/monitor/statistics.json'
I1013 23:49:01.254756 19350 http.cpp:1185] HTTP GET for /slave(829)/monitor/statistics.json
from 172.17.0.3:33292
I1013 23:49:01.254820 19350 http.cpp:976] Authorizing principal 'test-principal' to GET the
'/monitor/statistics.json' endpoint
I1013 23:49:01.257446  9512 slave.cpp:869] Agent terminating
[       OK ] Endpoint/SlaveEndpointTest.NoAuthorizer/1 (28 ms)
[ RUN      ] Endpoint/SlaveEndpointTest.NoAuthorizer/2
I1013 23:49:01.268263  9512 containerizer.cpp:292] Using isolation { environment_secret, posix/cpu,
posix/mem, filesystem/posix, network/cni }
W1013 23:49:01.268777  9512 backend.cpp:76] Failed to create 'aufs' backend: AufsBackend requires
root privileges
W1013 23:49:01.268896  9512 backend.cpp:76] Failed to create 'bind' backend: BindBackend requires
root privileges
I1013 23:49:01.268932  9512 provisioner.cpp:255] Using default backend 'copy'
I1013 23:49:01.270534  9512 cluster.cpp:448] Creating default 'local' authorizer
I1013 23:49:01.272425 19345 slave.cpp:254] Mesos agent started on (830)@172.17.0.3:35992
I1013 23:49:01.272449 19345 slave.cpp:255] Flags at startup: --acls="" --appc_simple_discovery_uri_prefix="http://"
--appc_store_dir="/tmp/Endpoint_SlaveEndpointTest_NoAuthorizer_2_krWml1/store/appc" --authenticate_http_executors="true"
--authenticate_http_readonly="true" --authenticate_http_readwrite="true" --authenticatee="crammd5"
--authentication_backoff_factor="1secs" --authorizer="local" --cgroups_cpu_enable_pids_and_tids_count="false"
--cgroups_enable_cfs="false" --cgroups_hierarchy="/sys/fs/cgroup" --cgroups_limit_swap="false"
--cgroups_root="mesos" --container_disk_watch_interval="15secs" --containerizers="mesos" --credential="/tmp/Endpoint_SlaveEndpointTest_NoAuthorizer_2_krWml1/credential"
--default_role="*" --disallow_sharing_agent_pid_namespace="false" --disk_watch_interval="1mins"
--docker="docker" --docker_kill_orphans="true" --docker_registry="https://registry-1.docker.io"
--docker_remove_delay="6hrs" --docker_socket="/var/run/docker.sock" --docker_stop_timeout="0ns"
--docker_store_dir="/tmp/Endpoint_SlaveEndpointTest_NoAuthorizer_2_krWml1/store/docker" --docker_volume_checkpoint_dir="/var/run/mesos/isolators/docker/volume"
--enforce_container_disk_quota="false" --executor_registration_timeout="1mins" --executor_reregistration_timeout="2secs"
--executor_secret_key="/tmp/Endpoint_SlaveEndpointTest_NoAuthorizer_2_krWml1/executor_secret_key"
--executor_shutdown_grace_period="5secs" --fetcher_cache_dir="/tmp/Endpoint_SlaveEndpointTest_NoAuthorizer_2_krWml1/fetch"
--fetcher_cache_size="2GB" --frameworks_home="" --gc_delay="1weeks" --gc_disk_headroom="0.1"
--hadoop_home="" --help="false" --hostname_lookup="true" --http_command_executor="false" --http_credentials="/tmp/Endpoint_SlaveEndpointTest_NoAuthorizer_2_krWml1/http_credentials"
--http_heartbeat_interval="30secs" --initialize_driver_logging="true" --isolation="posix/cpu,posix/mem"
--launcher="posix" --launcher_dir="/mesos/mesos-1.5.0/_build/src" --logbufsecs="0" --logging_level="INFO"
--max_completed_executors_per_framework="150" --oversubscribed_resources_interval="15secs"
--perf_duration="10secs" --perf_interval="1mins" --port="5051" --qos_correction_interval_min="0ns"
--quiet="false" --recover="reconnect" --recovery_timeout="15mins" --registration_backoff_factor="10ms"
--resources="cpus:2;gpus:0;mem:1024;disk:1024;ports:[31000-32000]" --revocable_cpu_low_priority="true"
--runtime_dir="/tmp/Endpoint_SlaveEndpointTest_NoAuthorizer_2_krWml1" --sandbox_directory="/mnt/mesos/sandbox"
--strict="true" --switch_user="true" --systemd_enable_support="true" --systemd_runtime_directory="/run/systemd/system"
--version="false" --work_dir="/tmp/Endpoint_SlaveEndpointTest_NoAuthorizer_2_urfqlW" --zk_session_timeout="10secs"
I1013 23:49:01.272809 19345 credentials.hpp:86] Loading credential for authentication from
'/tmp/Endpoint_SlaveEndpointTest_NoAuthorizer_2_krWml1/credential'
I1013 23:49:01.272959 19345 slave.cpp:287] Agent using credential for: test-principal
I1013 23:49:01.272980 19345 credentials.hpp:37] Loading credentials for authentication from
'/tmp/Endpoint_SlaveEndpointTest_NoAuthorizer_2_krWml1/http_credentials'
I1013 23:49:01.273258 19345 http.cpp:1045] Creating default 'basic' HTTP authenticator for
realm 'mesos-agent-executor'
I1013 23:49:01.273373 19345 http.cpp:1066] Creating default 'jwt' HTTP authenticator for realm
'mesos-agent-executor'
I1013 23:49:01.273566 19345 http.cpp:1045] Creating default 'basic' HTTP authenticator for
realm 'mesos-agent-readonly'
I1013 23:49:01.273663 19345 http.cpp:1066] Creating default 'jwt' HTTP authenticator for realm
'mesos-agent-readonly'
I1013 23:49:01.273841 19345 http.cpp:1045] Creating default 'basic' HTTP authenticator for
realm 'mesos-agent-readwrite'
I1013 23:49:01.273953 19345 http.cpp:1066] Creating default 'jwt' HTTP authenticator for realm
'mesos-agent-readwrite'
I1013 23:49:01.275332 19345 slave.cpp:585] Agent resources: [{"name":"cpus","scalar":{"value":2.0},"type":"SCALAR"},{"name":"mem","scalar":{"value":1024.0},"type":"SCALAR"},{"name":"disk","scalar":{"value":1024.0},"type":"SCALAR"},{"name":"ports","ranges":{"range":[{"begin":31000,"end":32000}]},"type":"RANGES"}]
I1013 23:49:01.275562 19345 slave.cpp:593] Agent attributes: [  ]
I1013 23:49:01.275573 19345 slave.cpp:602] Agent hostname: 13922d09266f
I1013 23:49:01.275710 19341 status_update_manager.cpp:177] Pausing sending status updates
I1013 23:49:01.277009 19335 state.cpp:64] Recovering state from '/tmp/Endpoint_SlaveEndpointTest_NoAuthorizer_2_urfqlW/meta'
I1013 23:49:01.277287 19343 status_update_manager.cpp:203] Recovering status update manager
I1013 23:49:01.277576 19336 containerizer.cpp:648] Recovering containerizer
I1013 23:49:01.278725 19355 provisioner.cpp:416] Provisioner recovery complete
I1013 23:49:01.279098 19341 slave.cpp:6310] Finished recovery
I1013 23:49:01.279563 19341 slave.cpp:6492] Querying resource estimator for oversubscribable
resources
I1013 23:49:01.279806 19344 slave.cpp:6506] Received oversubscribable resources {} from the
resource estimator
I1013 23:49:01.281623 19338 process.cpp:3929] Handling HTTP event for process 'slave(830)'
with path: '/slave(830)/containers'
I1013 23:49:01.283274 19355 http.cpp:1185] HTTP GET for /slave(830)/containers from 172.17.0.3:33294
I1013 23:49:01.283339 19355 http.cpp:976] Authorizing principal 'test-principal' to GET the
'/containers' endpoint
I1013 23:49:01.287093 19341 slave.cpp:869] Agent terminating
[       OK ] Endpoint/SlaveEndpointTest.NoAuthorizer/2 (29 ms)
[----------] 9 tests from Endpoint/SlaveEndpointTest (283 ms total)

[----------] 2 tests from ContainerizerType/DefaultContainerDNSFlagTest
[ RUN      ] ContainerizerType/DefaultContainerDNSFlagTest.ValidateFlag/0
[       OK ] ContainerizerType/DefaultContainerDNSFlagTest.ValidateFlag/0 (10 ms)
[ RUN      ] ContainerizerType/DefaultContainerDNSFlagTest.ValidateFlag/1
[       OK ] ContainerizerType/DefaultContainerDNSFlagTest.ValidateFlag/1 (10 ms)
[----------] 2 tests from ContainerizerType/DefaultContainerDNSFlagTest (20 ms total)

[----------] Global test environment tear-down
[==========] 1700 tests from 187 test cases ran. (629869 ms total)
[  PASSED  ] 1699 tests.
[  FAILED  ] 1 test, listed below:
[  FAILED  ] ExamplesTest.TestFramework

 1 FAILED TEST
  YOU HAVE 21 DISABLED TESTS

I1013 23:49:01.382971 19358 process.cpp:1068] Failed to accept socket: future discarded
make[4]: *** [check-local] Error 1
make[4]: Leaving directory `/mesos/mesos-1.5.0/_build/src'
make[3]: *** [check-am] Error 2
make[3]: Leaving directory `/mesos/mesos-1.5.0/_build/src'
make[2]: *** [check] Error 2
make[2]: Leaving directory `/mesos/mesos-1.5.0/_build/src'
make[1]: *** [check-recursive] Error 1
make[1]: Leaving directory `/mesos/mesos-1.5.0/_build'
make: *** [distcheck] Error 1
+ docker rmi mesos-1507935783-6972
Untagged: mesos-1507935783-6972:latest
Deleted: sha256:768a1ec6075a8dc526297441bc929a2693f6b49cb8dc31c5393b0bf6eb37eb65
Deleted: sha256:569d6e7d2596ef28c23a15b8dc9cc88bafe7b228df3e13333145a95d383d6c5f
Deleted: sha256:62f02800c328a337c1e0de13b57df746e0b103b61569ee03888101df9975e52b
Deleted: sha256:78fc0f987b7706d2c662dffcd275d3bfc2ccd7c95d3679f6597c7585f11f5af3
Deleted: sha256:072989934ba651d70814053c938c5ffb0443a8d8ffb65c081ca7bbfb92b24524
Deleted: sha256:65ab0fe3cc900a3d70cd651364848b4b67fa0c97f1f024f8e6bb5b16cab3055f
Deleted: sha256:ede12af4ab278b9a3b252e290a71fb193e9c7637316b69c87039551b5a6696c7
Deleted: sha256:28e4334c065281e292136dbafde093e45785ce395d8e098315b1ed0675c56906
Deleted: sha256:ae26da5cfb547957c856ed56f9280d851ee4e9ecb4829fa688dfd10588d4e73a
Deleted: sha256:e0b584c2bd033bffc80d0de21f58274858ccee6f0ac846a38a2c392bc421a909
Deleted: sha256:f402ac1f5ae25af8387c797207bcce2cf5ce40b9ea10fe4ff4e12c7eab37740c
Deleted: sha256:560b347a39ebd530e1e4abed980ae7410ef7dce17676666d093e8971c6225ca1
Deleted: sha256:595957cded4aee4c9a66e08266c7a97839bec8af573cc539a916d1e8f4bc1629
Deleted: sha256:b84a23a22cb4e96956b2655b86fe8cd112b6030f7d9c7f365c52344f030d9f22
Deleted: sha256:09d3ac0275d2a21dc356d4cb4d51d7180efcee0d8c2bda3971a9586da79338e8
Deleted: sha256:20eac0bc8071b59ff5b686b8d7f685abbf3811047933c21f36473bbb651e3120
Deleted: sha256:8bc5214236fd96d344ef1578fe57233c56c9ce282aad38039247e00c1d1b08f5
Deleted: sha256:df75567a8a1aa2f58df5464e95d32bbeb608ace814ca76283a9886ec086d9cd3
Deleted: sha256:56abea12ee9e12d8ac8e4124375630445be1cec21d469526e6b5abb62d30c423
Deleted: sha256:6facaa0ecae18016cf016ba76780ec9b2682e04c870c55fbe8911c6275514283
Deleted: sha256:f42f12fb52b5b98f792e4e99e04f490caa31befb7abe7cd21f8fcdbccd6f3e2a
Deleted: sha256:46337352c7f2a79930ab61c0241952df6697d9471dcbc0e8b6736aa525a675c1
Deleted: sha256:a1ea818bddb5deb74fdc2f238babb7b6c940d623b578890ffdc86d3e808c4406
Deleted: sha256:0e83da1e87a810e8b1d92299eb48af9072c39f7896f26596df6d8f794abb242e
Deleted: sha256:68f7d1fbd9c74efcd57d108cfc621374b95b6c764f3d8930a3594882b340ab04
Deleted: sha256:42bb9984db4c5e6e856b9e6af037c571353a7c46a6689387a599297a2597e641
Deleted: sha256:bc4a4718aff78469d11821dfa4e6e8eb73e4a07f94ca1f037337c0c42427a1b4
Deleted: sha256:52464c1298428edb7c548828ab56eb1d296b2f1fb9f3b5e27b0a6f0fabb23588
Deleted: sha256:ebc6bf595af0b6966f48a9613272ab0eef07933af1d7306e6524f591516a00d4
Build step 'Execute shell' marked build as failure


Mime
View raw message