mesos-builds mailing list archives

Site index · List index
Message view « Date » · « Thread »
Top « Date » · « Thread »
From Apache Jenkins Server <jenk...@builds.apache.org>
Subject Build failed in Jenkins: Mesos-Reviewbot #19645
Date Mon, 02 Oct 2017 15:33:47 GMT
See <https://builds.apache.org/job/Mesos-Reviewbot/19645/display/redirect>

------------------------------------------
[...truncated 31.96 MB...]
I1002 15:33:41.283349  5812 credentials.hpp:37] Loading credentials for authentication from
'/tmp/Endpoint_SlaveEndpointTest_AuthorizedRequest_2_3SuKxs/http_credentials'
I1002 15:33:41.283686  5812 http.cpp:1045] Creating default 'basic' HTTP authenticator for
realm 'mesos-agent-readonly'
I1002 15:33:41.283932  5812 http.cpp:1045] Creating default 'basic' HTTP authenticator for
realm 'mesos-agent-readwrite'
I1002 15:33:41.286214  5812 slave.cpp:585] Agent resources: [{"name":"cpus","scalar":{"value":2.0},"type":"SCALAR"},{"name":"mem","scalar":{"value":1024.0},"type":"SCALAR"},{"name":"disk","scalar":{"value":1024.0},"type":"SCALAR"},{"name":"ports","ranges":{"range":[{"begin":31000,"end":32000}]},"type":"RANGES"}]
I1002 15:33:41.286588  5812 slave.cpp:593] Agent attributes: [  ]
I1002 15:33:41.286604  5812 slave.cpp:602] Agent hostname: 7ed68760c45d
I1002 15:33:41.286798  5797 status_update_manager.cpp:177] Pausing sending status updates
I1002 15:33:41.288305  5800 state.cpp:64] Recovering state from '/tmp/Endpoint_SlaveEndpointTest_AuthorizedRequest_2_RNGYWn/meta'
I1002 15:33:41.288645  5814 status_update_manager.cpp:203] Recovering status update manager
I1002 15:33:41.288856  5813 containerizer.cpp:648] Recovering containerizer
I1002 15:33:41.290383  5793 provisioner.cpp:416] Provisioner recovery complete
I1002 15:33:41.290829  5799 slave.cpp:6313] Finished recovery
I1002 15:33:41.291290  5799 slave.cpp:6495] Querying resource estimator for oversubscribable
resources
I1002 15:33:41.291610  5803 slave.cpp:6509] Received oversubscribable resources {} from the
resource estimator
I1002 15:33:41.294229  5801 process.cpp:3929] Handling HTTP event for process 'slave(820)'
with path: '/slave(820)/containers'
I1002 15:33:41.295768  5796 http.cpp:1185] HTTP GET for /slave(820)/containers from 172.17.0.2:43724
I1002 15:33:41.295852  5796 http.cpp:976] Authorizing principal 'test-principal' to GET the
'/containers' endpoint
I1002 15:33:41.299885  5772 slave.cpp:869] Agent terminating
[       OK ] Endpoint/SlaveEndpointTest.AuthorizedRequest/2 (33 ms)
[ RUN      ] Endpoint/SlaveEndpointTest.UnauthorizedRequest/0
I1002 15:33:41.315279  5772 containerizer.cpp:292] Using isolation { environment_secret, posix/cpu,
posix/mem, filesystem/posix, network/cni }
W1002 15:33:41.316123  5772 backend.cpp:76] Failed to create 'aufs' backend: AufsBackend requires
root privileges
W1002 15:33:41.316301  5772 backend.cpp:76] Failed to create 'bind' backend: BindBackend requires
root privileges
I1002 15:33:41.316361  5772 provisioner.cpp:255] Using default backend 'copy'
I1002 15:33:41.320787  5807 slave.cpp:254] Mesos agent started on (821)@172.17.0.2:33746
I1002 15:33:41.320837  5807 slave.cpp:255] Flags at startup: --acls="" --appc_simple_discovery_uri_prefix="http://"
--appc_store_dir="/tmp/Endpoint_SlaveEndpointTest_UnauthorizedRequest_0_iIj0bL/store/appc"
--authenticate_http_readonly="true" --authenticate_http_readwrite="true" --authenticatee="crammd5"
--authentication_backoff_factor="1secs" --authorizer="local" --cgroups_cpu_enable_pids_and_tids_count="false"
--cgroups_enable_cfs="false" --cgroups_hierarchy="/sys/fs/cgroup" --cgroups_limit_swap="false"
--cgroups_root="mesos" --container_disk_watch_interval="15secs" --containerizers="mesos" --credential="/tmp/Endpoint_SlaveEndpointTest_UnauthorizedRequest_0_iIj0bL/credential"
--default_role="*" --disallow_sharing_agent_pid_namespace="false" --disk_watch_interval="1mins"
--docker="docker" --docker_kill_orphans="true" --docker_registry="https://registry-1.docker.io"
--docker_remove_delay="6hrs" --docker_socket="/var/run/docker.sock" --docker_stop_timeout="0ns"
--docker_store_dir="/tmp/Endpoint_SlaveEndpointTest_UnauthorizedRequest_0_iIj0bL/store/docker"
--docker_volume_checkpoint_dir="/var/run/mesos/isolators/docker/volume" --enforce_container_disk_quota="false"
--executor_registration_timeout="1mins" --executor_reregistration_timeout="2secs" --executor_shutdown_grace_period="5secs"
--fetcher_cache_dir="/tmp/Endpoint_SlaveEndpointTest_UnauthorizedRequest_0_iIj0bL/fetch" --fetcher_cache_size="2GB"
--frameworks_home="" --gc_delay="1weeks" --gc_disk_headroom="0.1" --hadoop_home="" --help="false"
--hostname_lookup="true" --http_command_executor="false" --http_credentials="/tmp/Endpoint_SlaveEndpointTest_UnauthorizedRequest_0_iIj0bL/http_credentials"
--http_heartbeat_interval="30secs" --initialize_driver_logging="true" --isolation="posix/cpu,posix/mem"
--launcher="posix" --launcher_dir="/mesos/mesos-1.5.0/_build/src" --logbufsecs="0" --logging_level="INFO"
--max_completed_executors_per_framework="150" --oversubscribed_resources_interval="15secs"
--perf_duration="10secs" --perf_interval="1mins" --port="5051" --qos_correction_interval_min="0ns"
--quiet="false" --recover="reconnect" --recovery_timeout="15mins" --registration_backoff_factor="10ms"
--resources="cpus:2;gpus:0;mem:1024;disk:1024;ports:[31000-32000]" --revocable_cpu_low_priority="true"
--runtime_dir="/tmp/Endpoint_SlaveEndpointTest_UnauthorizedRequest_0_iIj0bL" --sandbox_directory="/mnt/mesos/sandbox"
--strict="true" --switch_user="true" --systemd_enable_support="true" --systemd_runtime_directory="/run/systemd/system"
--version="false" --work_dir="/tmp/Endpoint_SlaveEndpointTest_UnauthorizedRequest_0_iDD5vG"
--zk_session_timeout="10secs"
I1002 15:33:41.321487  5807 credentials.hpp:86] Loading credential for authentication from
'/tmp/Endpoint_SlaveEndpointTest_UnauthorizedRequest_0_iIj0bL/credential'
I1002 15:33:41.321732  5807 slave.cpp:287] Agent using credential for: test-principal
I1002 15:33:41.321769  5807 credentials.hpp:37] Loading credentials for authentication from
'/tmp/Endpoint_SlaveEndpointTest_UnauthorizedRequest_0_iIj0bL/http_credentials'
I1002 15:33:41.322067  5807 http.cpp:1045] Creating default 'basic' HTTP authenticator for
realm 'mesos-agent-readonly'
I1002 15:33:41.322281  5807 http.cpp:1045] Creating default 'basic' HTTP authenticator for
realm 'mesos-agent-readwrite'
I1002 15:33:41.323940  5807 slave.cpp:585] Agent resources: [{"name":"cpus","scalar":{"value":2.0},"type":"SCALAR"},{"name":"mem","scalar":{"value":1024.0},"type":"SCALAR"},{"name":"disk","scalar":{"value":1024.0},"type":"SCALAR"},{"name":"ports","ranges":{"range":[{"begin":31000,"end":32000}]},"type":"RANGES"}]
I1002 15:33:41.324352  5807 slave.cpp:593] Agent attributes: [  ]
I1002 15:33:41.324375  5807 slave.cpp:602] Agent hostname: 7ed68760c45d
I1002 15:33:41.324532  5794 status_update_manager.cpp:177] Pausing sending status updates
I1002 15:33:41.326624  5810 state.cpp:64] Recovering state from '/tmp/Endpoint_SlaveEndpointTest_UnauthorizedRequest_0_iDD5vG/meta'
I1002 15:33:41.326977  5810 status_update_manager.cpp:203] Recovering status update manager
I1002 15:33:41.327199  5797 containerizer.cpp:648] Recovering containerizer
I1002 15:33:41.328758  5805 provisioner.cpp:416] Provisioner recovery complete
I1002 15:33:41.329360  5806 slave.cpp:6313] Finished recovery
I1002 15:33:41.330078  5806 slave.cpp:6495] Querying resource estimator for oversubscribable
resources
I1002 15:33:41.330432  5791 slave.cpp:6509] Received oversubscribable resources {} from the
resource estimator
I1002 15:33:41.333209  5813 process.cpp:3929] Handling HTTP event for process 'slave(821)'
with path: '/slave(821)/monitor/statistics'
I1002 15:33:41.334812  5809 http.cpp:1185] HTTP GET for /slave(821)/monitor/statistics from
172.17.0.2:43726
I1002 15:33:41.334893  5809 http.cpp:976] Authorizing principal 'test-principal' to GET the
'/monitor/statistics' endpoint
I1002 15:33:41.337852  5772 slave.cpp:869] Agent terminating
[       OK ] Endpoint/SlaveEndpointTest.UnauthorizedRequest/0 (39 ms)
[ RUN      ] Endpoint/SlaveEndpointTest.UnauthorizedRequest/1
I1002 15:33:41.351516  5772 containerizer.cpp:292] Using isolation { environment_secret, posix/cpu,
posix/mem, filesystem/posix, network/cni }
W1002 15:33:41.352146  5772 backend.cpp:76] Failed to create 'aufs' backend: AufsBackend requires
root privileges
W1002 15:33:41.352270  5772 backend.cpp:76] Failed to create 'bind' backend: BindBackend requires
root privileges
I1002 15:33:41.352320  5772 provisioner.cpp:255] Using default backend 'copy'
I1002 15:33:41.356520  5802 slave.cpp:254] Mesos agent started on (822)@172.17.0.2:33746
I1002 15:33:41.356547  5802 slave.cpp:255] Flags at startup: --acls="" --appc_simple_discovery_uri_prefix="http://"
--appc_store_dir="/tmp/Endpoint_SlaveEndpointTest_UnauthorizedRequest_1_fg7dd4/store/appc"
--authenticate_http_readonly="true" --authenticate_http_readwrite="true" --authenticatee="crammd5"
--authentication_backoff_factor="1secs" --authorizer="local" --cgroups_cpu_enable_pids_and_tids_count="false"
--cgroups_enable_cfs="false" --cgroups_hierarchy="/sys/fs/cgroup" --cgroups_limit_swap="false"
--cgroups_root="mesos" --container_disk_watch_interval="15secs" --containerizers="mesos" --credential="/tmp/Endpoint_SlaveEndpointTest_UnauthorizedRequest_1_fg7dd4/credential"
--default_role="*" --disallow_sharing_agent_pid_namespace="false" --disk_watch_interval="1mins"
--docker="docker" --docker_kill_orphans="true" --docker_registry="https://registry-1.docker.io"
--docker_remove_delay="6hrs" --docker_socket="/var/run/docker.sock" --docker_stop_timeout="0ns"
--docker_store_dir="/tmp/Endpoint_SlaveEndpointTest_UnauthorizedRequest_1_fg7dd4/store/docker"
--docker_volume_checkpoint_dir="/var/run/mesos/isolators/docker/volume" --enforce_container_disk_quota="false"
--executor_registration_timeout="1mins" --executor_reregistration_timeout="2secs" --executor_shutdown_grace_period="5secs"
--fetcher_cache_dir="/tmp/Endpoint_SlaveEndpointTest_UnauthorizedRequest_1_fg7dd4/fetch" --fetcher_cache_size="2GB"
--frameworks_home="" --gc_delay="1weeks" --gc_disk_headroom="0.1" --hadoop_home="" --help="false"
--hostname_lookup="true" --http_command_executor="false" --http_credentials="/tmp/Endpoint_SlaveEndpointTest_UnauthorizedRequest_1_fg7dd4/http_credentials"
--http_heartbeat_interval="30secs" --initialize_driver_logging="true" --isolation="posix/cpu,posix/mem"
--launcher="posix" --launcher_dir="/mesos/mesos-1.5.0/_build/src" --logbufsecs="0" --logging_level="INFO"
--max_completed_executors_per_framework="150" --oversubscribed_resources_interval="15secs"
--perf_duration="10secs" --perf_interval="1mins" --port="5051" --qos_correction_interval_min="0ns"
--quiet="false" --recover="reconnect" --recovery_timeout="15mins" --registration_backoff_factor="10ms"
--resources="cpus:2;gpus:0;mem:1024;disk:1024;ports:[31000-32000]" --revocable_cpu_low_priority="true"
--runtime_dir="/tmp/Endpoint_SlaveEndpointTest_UnauthorizedRequest_1_fg7dd4" --sandbox_directory="/mnt/mesos/sandbox"
--strict="true" --switch_user="true" --systemd_enable_support="true" --systemd_runtime_directory="/run/systemd/system"
--version="false" --work_dir="/tmp/Endpoint_SlaveEndpointTest_UnauthorizedRequest_1_lmpDrZ"
--zk_session_timeout="10secs"
I1002 15:33:41.356988  5802 credentials.hpp:86] Loading credential for authentication from
'/tmp/Endpoint_SlaveEndpointTest_UnauthorizedRequest_1_fg7dd4/credential'
I1002 15:33:41.357161  5802 slave.cpp:287] Agent using credential for: test-principal
I1002 15:33:41.357185  5802 credentials.hpp:37] Loading credentials for authentication from
'/tmp/Endpoint_SlaveEndpointTest_UnauthorizedRequest_1_fg7dd4/http_credentials'
I1002 15:33:41.357439  5802 http.cpp:1045] Creating default 'basic' HTTP authenticator for
realm 'mesos-agent-readonly'
I1002 15:33:41.357645  5802 http.cpp:1045] Creating default 'basic' HTTP authenticator for
realm 'mesos-agent-readwrite'
I1002 15:33:41.359081  5802 slave.cpp:585] Agent resources: [{"name":"cpus","scalar":{"value":2.0},"type":"SCALAR"},{"name":"mem","scalar":{"value":1024.0},"type":"SCALAR"},{"name":"disk","scalar":{"value":1024.0},"type":"SCALAR"},{"name":"ports","ranges":{"range":[{"begin":31000,"end":32000}]},"type":"RANGES"}]
I1002 15:33:41.359310  5802 slave.cpp:593] Agent attributes: [  ]
I1002 15:33:41.359331  5802 slave.cpp:602] Agent hostname: 7ed68760c45d
I1002 15:33:41.359526  5792 status_update_manager.cpp:177] Pausing sending status updates
I1002 15:33:41.360729  5805 state.cpp:64] Recovering state from '/tmp/Endpoint_SlaveEndpointTest_UnauthorizedRequest_1_lmpDrZ/meta'
I1002 15:33:41.361125  5806 status_update_manager.cpp:203] Recovering status update manager
I1002 15:33:41.361369  5808 containerizer.cpp:648] Recovering containerizer
I1002 15:33:41.362922  5800 provisioner.cpp:416] Provisioner recovery complete
I1002 15:33:41.363442  5798 slave.cpp:6313] Finished recovery
I1002 15:33:41.363925  5798 slave.cpp:6495] Querying resource estimator for oversubscribable
resources
I1002 15:33:41.364234  5793 slave.cpp:6509] Received oversubscribable resources {} from the
resource estimator
I1002 15:33:41.366854  5801 process.cpp:3929] Handling HTTP event for process 'slave(822)'
with path: '/slave(822)/monitor/statistics.json'
I1002 15:33:41.368227  5811 http.cpp:1185] HTTP GET for /slave(822)/monitor/statistics.json
from 172.17.0.2:43728
I1002 15:33:41.368306  5811 http.cpp:976] Authorizing principal 'test-principal' to GET the
'/monitor/statistics.json' endpoint
I1002 15:33:41.371565  5772 slave.cpp:869] Agent terminating
[       OK ] Endpoint/SlaveEndpointTest.UnauthorizedRequest/1 (32 ms)
[ RUN      ] Endpoint/SlaveEndpointTest.UnauthorizedRequest/2
I1002 15:33:41.386272  5772 containerizer.cpp:292] Using isolation { environment_secret, posix/cpu,
posix/mem, filesystem/posix, network/cni }
W1002 15:33:41.386931  5772 backend.cpp:76] Failed to create 'aufs' backend: AufsBackend requires
root privileges
W1002 15:33:41.387099  5772 backend.cpp:76] Failed to create 'bind' backend: BindBackend requires
root privileges
I1002 15:33:41.387131  5772 provisioner.cpp:255] Using default backend 'copy'
I1002 15:33:41.391837  5807 slave.cpp:254] Mesos agent started on (823)@172.17.0.2:33746
I1002 15:33:41.391863  5807 slave.cpp:255] Flags at startup: --acls="" --appc_simple_discovery_uri_prefix="http://"
--appc_store_dir="/tmp/Endpoint_SlaveEndpointTest_UnauthorizedRequest_2_CmWDyn/store/appc"
--authenticate_http_readonly="true" --authenticate_http_readwrite="true" --authenticatee="crammd5"
--authentication_backoff_factor="1secs" --authorizer="local" --cgroups_cpu_enable_pids_and_tids_count="false"
--cgroups_enable_cfs="false" --cgroups_hierarchy="/sys/fs/cgroup" --cgroups_limit_swap="false"
--cgroups_root="mesos" --container_disk_watch_interval="15secs" --containerizers="mesos" --credential="/tmp/Endpoint_SlaveEndpointTest_UnauthorizedRequest_2_CmWDyn/credential"
--default_role="*" --disallow_sharing_agent_pid_namespace="false" --disk_watch_interval="1mins"
--docker="docker" --docker_kill_orphans="true" --docker_registry="https://registry-1.docker.io"
--docker_remove_delay="6hrs" --docker_socket="/var/run/docker.sock" --docker_stop_timeout="0ns"
--docker_store_dir="/tmp/Endpoint_SlaveEndpointTest_UnauthorizedRequest_2_CmWDyn/store/docker"
--docker_volume_checkpoint_dir="/var/run/mesos/isolators/docker/volume" --enforce_container_disk_quota="false"
--executor_registration_timeout="1mins" --executor_reregistration_timeout="2secs" --executor_shutdown_grace_period="5secs"
--fetcher_cache_dir="/tmp/Endpoint_SlaveEndpointTest_UnauthorizedRequest_2_CmWDyn/fetch" --fetcher_cache_size="2GB"
--frameworks_home="" --gc_delay="1weeks" --gc_disk_headroom="0.1" --hadoop_home="" --help="false"
--hostname_lookup="true" --http_command_executor="false" --http_credentials="/tmp/Endpoint_SlaveEndpointTest_UnauthorizedRequest_2_CmWDyn/http_credentials"
--http_heartbeat_interval="30secs" --initialize_driver_logging="true" --isolation="posix/cpu,posix/mem"
--launcher="posix" --launcher_dir="/mesos/mesos-1.5.0/_build/src" --logbufsecs="0" --logging_level="INFO"
--max_completed_executors_per_framework="150" --oversubscribed_resources_interval="15secs"
--perf_duration="10secs" --perf_interval="1mins" --port="5051" --qos_correction_interval_min="0ns"
--quiet="false" --recover="reconnect" --recovery_timeout="15mins" --registration_backoff_factor="10ms"
--resources="cpus:2;gpus:0;mem:1024;disk:1024;ports:[31000-32000]" --revocable_cpu_low_priority="true"
--runtime_dir="/tmp/Endpoint_SlaveEndpointTest_UnauthorizedRequest_2_CmWDyn" --sandbox_directory="/mnt/mesos/sandbox"
--strict="true" --switch_user="true" --systemd_enable_support="true" --systemd_runtime_directory="/run/systemd/system"
--version="false" --work_dir="/tmp/Endpoint_SlaveEndpointTest_UnauthorizedRequest_2_760WHi"
--zk_session_timeout="10secs"
I1002 15:33:41.392227  5807 credentials.hpp:86] Loading credential for authentication from
'/tmp/Endpoint_SlaveEndpointTest_UnauthorizedRequest_2_CmWDyn/credential'
I1002 15:33:41.392364  5807 slave.cpp:287] Agent using credential for: test-principal
I1002 15:33:41.392390  5807 credentials.hpp:37] Loading credentials for authentication from
'/tmp/Endpoint_SlaveEndpointTest_UnauthorizedRequest_2_CmWDyn/http_credentials'
I1002 15:33:41.392635  5807 http.cpp:1045] Creating default 'basic' HTTP authenticator for
realm 'mesos-agent-readonly'
I1002 15:33:41.392778  5807 http.cpp:1045] Creating default 'basic' HTTP authenticator for
realm 'mesos-agent-readwrite'
I1002 15:33:41.394073  5807 slave.cpp:585] Agent resources: [{"name":"cpus","scalar":{"value":2.0},"type":"SCALAR"},{"name":"mem","scalar":{"value":1024.0},"type":"SCALAR"},{"name":"disk","scalar":{"value":1024.0},"type":"SCALAR"},{"name":"ports","ranges":{"range":[{"begin":31000,"end":32000}]},"type":"RANGES"}]
I1002 15:33:41.394297  5807 slave.cpp:593] Agent attributes: [  ]
I1002 15:33:41.394316  5807 slave.cpp:602] Agent hostname: 7ed68760c45d
I1002 15:33:41.394529  5808 status_update_manager.cpp:177] Pausing sending status updates
I1002 15:33:41.395648  5797 state.cpp:64] Recovering state from '/tmp/Endpoint_SlaveEndpointTest_UnauthorizedRequest_2_760WHi/meta'
I1002 15:33:41.395936  5810 status_update_manager.cpp:203] Recovering status update manager
I1002 15:33:41.396150  5810 containerizer.cpp:648] Recovering containerizer
I1002 15:33:41.397434  5799 provisioner.cpp:416] Provisioner recovery complete
I1002 15:33:41.397892  5805 slave.cpp:6313] Finished recovery
I1002 15:33:41.398344  5805 slave.cpp:6495] Querying resource estimator for oversubscribable
resources
I1002 15:33:41.398663  5798 slave.cpp:6509] Received oversubscribable resources {} from the
resource estimator
I1002 15:33:41.400944  5796 process.cpp:3929] Handling HTTP event for process 'slave(823)'
with path: '/slave(823)/containers'
I1002 15:33:41.402163  5795 http.cpp:1185] HTTP GET for /slave(823)/containers from 172.17.0.2:43730
I1002 15:33:41.402235  5795 http.cpp:976] Authorizing principal 'test-principal' to GET the
'/containers' endpoint
I1002 15:33:41.405030  5812 slave.cpp:869] Agent terminating
[       OK ] Endpoint/SlaveEndpointTest.UnauthorizedRequest/2 (33 ms)
[ RUN      ] Endpoint/SlaveEndpointTest.NoAuthorizer/0
I1002 15:33:41.419620  5772 containerizer.cpp:292] Using isolation { environment_secret, posix/cpu,
posix/mem, filesystem/posix, network/cni }
W1002 15:33:41.420256  5772 backend.cpp:76] Failed to create 'aufs' backend: AufsBackend requires
root privileges
W1002 15:33:41.420387  5772 backend.cpp:76] Failed to create 'bind' backend: BindBackend requires
root privileges
I1002 15:33:41.420433  5772 provisioner.cpp:255] Using default backend 'copy'
I1002 15:33:41.422605  5772 cluster.cpp:448] Creating default 'local' authorizer
I1002 15:33:41.424962  5798 slave.cpp:254] Mesos agent started on (824)@172.17.0.2:33746
I1002 15:33:41.424988  5798 slave.cpp:255] Flags at startup: --acls="" --appc_simple_discovery_uri_prefix="http://"
--appc_store_dir="/tmp/Endpoint_SlaveEndpointTest_NoAuthorizer_0_MexdeH/store/appc" --authenticate_http_readonly="true"
--authenticate_http_readwrite="true" --authenticatee="crammd5" --authentication_backoff_factor="1secs"
--authorizer="local" --cgroups_cpu_enable_pids_and_tids_count="false" --cgroups_enable_cfs="false"
--cgroups_hierarchy="/sys/fs/cgroup" --cgroups_limit_swap="false" --cgroups_root="mesos" --container_disk_watch_interval="15secs"
--containerizers="mesos" --credential="/tmp/Endpoint_SlaveEndpointTest_NoAuthorizer_0_MexdeH/credential"
--default_role="*" --disallow_sharing_agent_pid_namespace="false" --disk_watch_interval="1mins"
--docker="docker" --docker_kill_orphans="true" --docker_registry="https://registry-1.docker.io"
--docker_remove_delay="6hrs" --docker_socket="/var/run/docker.sock" --docker_stop_timeout="0ns"
--docker_store_dir="/tmp/Endpoint_SlaveEndpointTest_NoAuthorizer_0_MexdeH/store/docker" --docker_volume_checkpoint_dir="/var/run/mesos/isolators/docker/volume"
--enforce_container_disk_quota="false" --executor_registration_timeout="1mins" --executor_reregistration_timeout="2secs"
--executor_shutdown_grace_period="5secs" --fetcher_cache_dir="/tmp/Endpoint_SlaveEndpointTest_NoAuthorizer_0_MexdeH/fetch"
--fetcher_cache_size="2GB" --frameworks_home="" --gc_delay="1weeks" --gc_disk_headroom="0.1"
--hadoop_home="" --help="false" --hostname_lookup="true" --http_command_executor="false" --http_credentials="/tmp/Endpoint_SlaveEndpointTest_NoAuthorizer_0_MexdeH/http_credentials"
--http_heartbeat_interval="30secs" --initialize_driver_logging="true" --isolation="posix/cpu,posix/mem"
--launcher="posix" --launcher_dir="/mesos/mesos-1.5.0/_build/src" --logbufsecs="0" --logging_level="INFO"
--max_completed_executors_per_framework="150" --oversubscribed_resources_interval="15secs"
--perf_duration="10secs" --perf_interval="1mins" --port="5051" --qos_correction_interval_min="0ns"
--quiet="false" --recover="reconnect" --recovery_timeout="15mins" --registration_backoff_factor="10ms"
--resources="cpus:2;gpus:0;mem:1024;disk:1024;ports:[31000-32000]" --revocable_cpu_low_priority="true"
--runtime_dir="/tmp/Endpoint_SlaveEndpointTest_NoAuthorizer_0_MexdeH" --sandbox_directory="/mnt/mesos/sandbox"
--strict="true" --switch_user="true" --systemd_enable_support="true" --systemd_runtime_directory="/run/systemd/system"
--version="false" --work_dir="/tmp/Endpoint_SlaveEndpointTest_NoAuthorizer_0_eOfyiC" --zk_session_timeout="10secs"
I1002 15:33:41.425379  5798 credentials.hpp:86] Loading credential for authentication from
'/tmp/Endpoint_SlaveEndpointTest_NoAuthorizer_0_MexdeH/credential'
I1002 15:33:41.425523  5798 slave.cpp:287] Agent using credential for: test-principal
I1002 15:33:41.425554  5798 credentials.hpp:37] Loading credentials for authentication from
'/tmp/Endpoint_SlaveEndpointTest_NoAuthorizer_0_MexdeH/http_credentials'
I1002 15:33:41.425792  5798 http.cpp:1045] Creating default 'basic' HTTP authenticator for
realm 'mesos-agent-readonly'
I1002 15:33:41.425950  5798 http.cpp:1045] Creating default 'basic' HTTP authenticator for
realm 'mesos-agent-readwrite'
I1002 15:33:41.427326  5798 slave.cpp:585] Agent resources: [{"name":"cpus","scalar":{"value":2.0},"type":"SCALAR"},{"name":"mem","scalar":{"value":1024.0},"type":"SCALAR"},{"name":"disk","scalar":{"value":1024.0},"type":"SCALAR"},{"name":"ports","ranges":{"range":[{"begin":31000,"end":32000}]},"type":"RANGES"}]
I1002 15:33:41.427559  5798 slave.cpp:593] Agent attributes: [  ]
I1002 15:33:41.427573  5798 slave.cpp:602] Agent hostname: 7ed68760c45d
I1002 15:33:41.427803  5791 status_update_manager.cpp:177] Pausing sending status updates
I1002 15:33:41.429132  5799 state.cpp:64] Recovering state from '/tmp/Endpoint_SlaveEndpointTest_NoAuthorizer_0_eOfyiC/meta'
I1002 15:33:41.429579  5799 status_update_manager.cpp:203] Recovering status update manager
I1002 15:33:41.429850  5797 containerizer.cpp:648] Recovering containerizer
I1002 15:33:41.431530  5806 provisioner.cpp:416] Provisioner recovery complete
I1002 15:33:41.431942  5810 slave.cpp:6313] Finished recovery
I1002 15:33:41.432440  5810 slave.cpp:6495] Querying resource estimator for oversubscribable
resources
I1002 15:33:41.432760  5804 slave.cpp:6509] Received oversubscribable resources {} from the
resource estimator
I1002 15:33:41.435335  5802 process.cpp:3929] Handling HTTP event for process 'slave(824)'
with path: '/slave(824)/monitor/statistics'
I1002 15:33:41.436830  5796 http.cpp:1185] HTTP GET for /slave(824)/monitor/statistics from
172.17.0.2:43732
I1002 15:33:41.436911  5796 http.cpp:976] Authorizing principal 'test-principal' to GET the
'/monitor/statistics' endpoint
I1002 15:33:41.440884  5772 slave.cpp:869] Agent terminating
[       OK ] Endpoint/SlaveEndpointTest.NoAuthorizer/0 (35 ms)
[ RUN      ] Endpoint/SlaveEndpointTest.NoAuthorizer/1
I1002 15:33:41.454171  5772 containerizer.cpp:292] Using isolation { environment_secret, posix/cpu,
posix/mem, filesystem/posix, network/cni }
W1002 15:33:41.454746  5772 backend.cpp:76] Failed to create 'aufs' backend: AufsBackend requires
root privileges
W1002 15:33:41.454865  5772 backend.cpp:76] Failed to create 'bind' backend: BindBackend requires
root privileges
I1002 15:33:41.454910  5772 provisioner.cpp:255] Using default backend 'copy'
I1002 15:33:41.456846  5772 cluster.cpp:448] Creating default 'local' authorizer
I1002 15:33:41.459116  5804 slave.cpp:254] Mesos agent started on (825)@172.17.0.2:33746
I1002 15:33:41.459146  5804 slave.cpp:255] Flags at startup: --acls="" --appc_simple_discovery_uri_prefix="http://"
--appc_store_dir="/tmp/Endpoint_SlaveEndpointTest_NoAuthorizer_1_w2pse1/store/appc" --authenticate_http_readonly="true"
--authenticate_http_readwrite="true" --authenticatee="crammd5" --authentication_backoff_factor="1secs"
--authorizer="local" --cgroups_cpu_enable_pids_and_tids_count="false" --cgroups_enable_cfs="false"
--cgroups_hierarchy="/sys/fs/cgroup" --cgroups_limit_swap="false" --cgroups_root="mesos" --container_disk_watch_interval="15secs"
--containerizers="mesos" --credential="/tmp/Endpoint_SlaveEndpointTest_NoAuthorizer_1_w2pse1/credential"
--default_role="*" --disallow_sharing_agent_pid_namespace="false" --disk_watch_interval="1mins"
--docker="docker" --docker_kill_orphans="true" --docker_registry="https://registry-1.docker.io"
--docker_remove_delay="6hrs" --docker_socket="/var/run/docker.sock" --docker_stop_timeout="0ns"
--docker_store_dir="/tmp/Endpoint_SlaveEndpointTest_NoAuthorizer_1_w2pse1/store/docker" --docker_volume_checkpoint_dir="/var/run/mesos/isolators/docker/volume"
--enforce_container_disk_quota="false" --executor_registration_timeout="1mins" --executor_reregistration_timeout="2secs"
--executor_shutdown_grace_period="5secs" --fetcher_cache_dir="/tmp/Endpoint_SlaveEndpointTest_NoAuthorizer_1_w2pse1/fetch"
--fetcher_cache_size="2GB" --frameworks_home="" --gc_delay="1weeks" --gc_disk_headroom="0.1"
--hadoop_home="" --help="false" --hostname_lookup="true" --http_command_executor="false" --http_credentials="/tmp/Endpoint_SlaveEndpointTest_NoAuthorizer_1_w2pse1/http_credentials"
--http_heartbeat_interval="30secs" --initialize_driver_logging="true" --isolation="posix/cpu,posix/mem"
--launcher="posix" --launcher_dir="/mesos/mesos-1.5.0/_build/src" --logbufsecs="0" --logging_level="INFO"
--max_completed_executors_per_framework="150" --oversubscribed_resources_interval="15secs"
--perf_duration="10secs" --perf_interval="1mins" --port="5051" --qos_correction_interval_min="0ns"
--quiet="false" --recover="reconnect" --recovery_timeout="15mins" --registration_backoff_factor="10ms"
--resources="cpus:2;gpus:0;mem:1024;disk:1024;ports:[31000-32000]" --revocable_cpu_low_priority="true"
--runtime_dir="/tmp/Endpoint_SlaveEndpointTest_NoAuthorizer_1_w2pse1" --sandbox_directory="/mnt/mesos/sandbox"
--strict="true" --switch_user="true" --systemd_enable_support="true" --systemd_runtime_directory="/run/systemd/system"
--version="false" --work_dir="/tmp/Endpoint_SlaveEndpointTest_NoAuthorizer_1_EVfCdW" --zk_session_timeout="10secs"
I1002 15:33:41.459584  5804 credentials.hpp:86] Loading credential for authentication from
'/tmp/Endpoint_SlaveEndpointTest_NoAuthorizer_1_w2pse1/credential'
I1002 15:33:41.459725  5804 slave.cpp:287] Agent using credential for: test-principal
I1002 15:33:41.459748  5804 credentials.hpp:37] Loading credentials for authentication from
'/tmp/Endpoint_SlaveEndpointTest_NoAuthorizer_1_w2pse1/http_credentials'
I1002 15:33:41.459964  5804 http.cpp:1045] Creating default 'basic' HTTP authenticator for
realm 'mesos-agent-readonly'
I1002 15:33:41.460114  5804 http.cpp:1045] Creating default 'basic' HTTP authenticator for
realm 'mesos-agent-readwrite'
I1002 15:33:41.461380  5804 slave.cpp:585] Agent resources: [{"name":"cpus","scalar":{"value":2.0},"type":"SCALAR"},{"name":"mem","scalar":{"value":1024.0},"type":"SCALAR"},{"name":"disk","scalar":{"value":1024.0},"type":"SCALAR"},{"name":"ports","ranges":{"range":[{"begin":31000,"end":32000}]},"type":"RANGES"}]
I1002 15:33:41.461599  5804 slave.cpp:593] Agent attributes: [  ]
I1002 15:33:41.461612  5804 slave.cpp:602] Agent hostname: 7ed68760c45d
I1002 15:33:41.461762  5806 status_update_manager.cpp:177] Pausing sending status updates
I1002 15:33:41.462987  5795 state.cpp:64] Recovering state from '/tmp/Endpoint_SlaveEndpointTest_NoAuthorizer_1_EVfCdW/meta'
I1002 15:33:41.463304  5808 status_update_manager.cpp:203] Recovering status update manager
I1002 15:33:41.463507  5808 containerizer.cpp:648] Recovering containerizer
I1002 15:33:41.464977  5803 provisioner.cpp:416] Provisioner recovery complete
I1002 15:33:41.465415  5791 slave.cpp:6313] Finished recovery
I1002 15:33:41.465943  5791 slave.cpp:6495] Querying resource estimator for oversubscribable
resources
I1002 15:33:41.466224  5796 slave.cpp:6509] Received oversubscribable resources {} from the
resource estimator
I1002 15:33:41.468442  5805 process.cpp:3929] Handling HTTP event for process 'slave(825)'
with path: '/slave(825)/monitor/statistics.json'
I1002 15:33:41.469732  5800 http.cpp:1185] HTTP GET for /slave(825)/monitor/statistics.json
from 172.17.0.2:43734
I1002 15:33:41.469807  5800 http.cpp:976] Authorizing principal 'test-principal' to GET the
'/monitor/statistics.json' endpoint
I1002 15:33:41.473969  5772 slave.cpp:869] Agent terminating
[       OK ] Endpoint/SlaveEndpointTest.NoAuthorizer/1 (32 ms)
[ RUN      ] Endpoint/SlaveEndpointTest.NoAuthorizer/2
I1002 15:33:41.486766  5772 containerizer.cpp:292] Using isolation { environment_secret, posix/cpu,
posix/mem, filesystem/posix, network/cni }
W1002 15:33:41.487259  5772 backend.cpp:76] Failed to create 'aufs' backend: AufsBackend requires
root privileges
W1002 15:33:41.487360  5772 backend.cpp:76] Failed to create 'bind' backend: BindBackend requires
root privileges
I1002 15:33:41.487390  5772 provisioner.cpp:255] Using default backend 'copy'
I1002 15:33:41.489187  5772 cluster.cpp:448] Creating default 'local' authorizer
I1002 15:33:41.491206  5811 slave.cpp:254] Mesos agent started on (826)@172.17.0.2:33746
I1002 15:33:41.491232  5811 slave.cpp:255] Flags at startup: --acls="" --appc_simple_discovery_uri_prefix="http://"
--appc_store_dir="/tmp/Endpoint_SlaveEndpointTest_NoAuthorizer_2_KDenyl/store/appc" --authenticate_http_readonly="true"
--authenticate_http_readwrite="true" --authenticatee="crammd5" --authentication_backoff_factor="1secs"
--authorizer="local" --cgroups_cpu_enable_pids_and_tids_count="false" --cgroups_enable_cfs="false"
--cgroups_hierarchy="/sys/fs/cgroup" --cgroups_limit_swap="false" --cgroups_root="mesos" --container_disk_watch_interval="15secs"
--containerizers="mesos" --credential="/tmp/Endpoint_SlaveEndpointTest_NoAuthorizer_2_KDenyl/credential"
--default_role="*" --disallow_sharing_agent_pid_namespace="false" --disk_watch_interval="1mins"
--docker="docker" --docker_kill_orphans="true" --docker_registry="https://registry-1.docker.io"
--docker_remove_delay="6hrs" --docker_socket="/var/run/docker.sock" --docker_stop_timeout="0ns"
--docker_store_dir="/tmp/Endpoint_SlaveEndpointTest_NoAuthorizer_2_KDenyl/store/docker" --docker_volume_checkpoint_dir="/var/run/mesos/isolators/docker/volume"
--enforce_container_disk_quota="false" --executor_registration_timeout="1mins" --executor_reregistration_timeout="2secs"
--executor_shutdown_grace_period="5secs" --fetcher_cache_dir="/tmp/Endpoint_SlaveEndpointTest_NoAuthorizer_2_KDenyl/fetch"
--fetcher_cache_size="2GB" --frameworks_home="" --gc_delay="1weeks" --gc_disk_headroom="0.1"
--hadoop_home="" --help="false" --hostname_lookup="true" --http_command_executor="false" --http_credentials="/tmp/Endpoint_SlaveEndpointTest_NoAuthorizer_2_KDenyl/http_credentials"
--http_heartbeat_interval="30secs" --initialize_driver_logging="true" --isolation="posix/cpu,posix/mem"
--launcher="posix" --launcher_dir="/mesos/mesos-1.5.0/_build/src" --logbufsecs="0" --logging_level="INFO"
--max_completed_executors_per_framework="150" --oversubscribed_resources_interval="15secs"
--perf_duration="10secs" --perf_interval="1mins" --port="5051" --qos_correction_interval_min="0ns"
--quiet="false" --recover="reconnect" --recovery_timeout="15mins" --registration_backoff_factor="10ms"
--resources="cpus:2;gpus:0;mem:1024;disk:1024;ports:[31000-32000]" --revocable_cpu_low_priority="true"
--runtime_dir="/tmp/Endpoint_SlaveEndpointTest_NoAuthorizer_2_KDenyl" --sandbox_directory="/mnt/mesos/sandbox"
--strict="true" --switch_user="true" --systemd_enable_support="true" --systemd_runtime_directory="/run/systemd/system"
--version="false" --work_dir="/tmp/Endpoint_SlaveEndpointTest_NoAuthorizer_2_Sl8Dsg" --zk_session_timeout="10secs"
I1002 15:33:41.491587  5811 credentials.hpp:86] Loading credential for authentication from
'/tmp/Endpoint_SlaveEndpointTest_NoAuthorizer_2_KDenyl/credential'
I1002 15:33:41.491729  5811 slave.cpp:287] Agent using credential for: test-principal
I1002 15:33:41.491750  5811 credentials.hpp:37] Loading credentials for authentication from
'/tmp/Endpoint_SlaveEndpointTest_NoAuthorizer_2_KDenyl/http_credentials'
I1002 15:33:41.491984  5811 http.cpp:1045] Creating default 'basic' HTTP authenticator for
realm 'mesos-agent-readonly'
I1002 15:33:41.492151  5811 http.cpp:1045] Creating default 'basic' HTTP authenticator for
realm 'mesos-agent-readwrite'
I1002 15:33:41.493474  5811 slave.cpp:585] Agent resources: [{"name":"cpus","scalar":{"value":2.0},"type":"SCALAR"},{"name":"mem","scalar":{"value":1024.0},"type":"SCALAR"},{"name":"disk","scalar":{"value":1024.0},"type":"SCALAR"},{"name":"ports","ranges":{"range":[{"begin":31000,"end":32000}]},"type":"RANGES"}]
I1002 15:33:41.493701  5811 slave.cpp:593] Agent attributes: [  ]
I1002 15:33:41.493717  5811 slave.cpp:602] Agent hostname: 7ed68760c45d
I1002 15:33:41.493849  5813 status_update_manager.cpp:177] Pausing sending status updates
I1002 15:33:41.495141  5798 state.cpp:64] Recovering state from '/tmp/Endpoint_SlaveEndpointTest_NoAuthorizer_2_Sl8Dsg/meta'
I1002 15:33:41.495476  5806 status_update_manager.cpp:203] Recovering status update manager
I1002 15:33:41.495738  5806 containerizer.cpp:648] Recovering containerizer
I1002 15:33:41.497081  5799 provisioner.cpp:416] Provisioner recovery complete
I1002 15:33:41.497581  5803 slave.cpp:6313] Finished recovery
I1002 15:33:41.498021  5803 slave.cpp:6495] Querying resource estimator for oversubscribable
resources
I1002 15:33:41.498385  5791 slave.cpp:6509] Received oversubscribable resources {} from the
resource estimator
I1002 15:33:41.501030  5805 process.cpp:3929] Handling HTTP event for process 'slave(826)'
with path: '/slave(826)/containers'
I1002 15:33:41.502267  5793 http.cpp:1185] HTTP GET for /slave(826)/containers from 172.17.0.2:43736
I1002 15:33:41.502378  5793 http.cpp:976] Authorizing principal 'test-principal' to GET the
'/containers' endpoint
I1002 15:33:41.507272  5772 slave.cpp:869] Agent terminating
[       OK ] Endpoint/SlaveEndpointTest.NoAuthorizer/2 (33 ms)
[----------] 9 tests from Endpoint/SlaveEndpointTest (311 ms total)

[----------] 2 tests from ContainerizerType/DefaultContainerDNSFlagTest
[ RUN      ] ContainerizerType/DefaultContainerDNSFlagTest.ValidateFlag/0
[       OK ] ContainerizerType/DefaultContainerDNSFlagTest.ValidateFlag/0 (11 ms)
[ RUN      ] ContainerizerType/DefaultContainerDNSFlagTest.ValidateFlag/1
[       OK ] ContainerizerType/DefaultContainerDNSFlagTest.ValidateFlag/1 (10 ms)
[----------] 2 tests from ContainerizerType/DefaultContainerDNSFlagTest (21 ms total)

[----------] Global test environment tear-down
[==========] 1685 tests from 184 test cases ran. (630159 ms total)
[  PASSED  ] 1684 tests.
[  FAILED  ] 1 test, listed below:
[  FAILED  ] ExamplesTest.PythonFramework

 1 FAILED TEST
  YOU HAVE 21 DISABLED TESTS

I1002 15:33:41.594405  5815 process.cpp:1068] Failed to accept socket: future discarded
make[4]: *** [check-local] Error 1
make[4]: Leaving directory `/mesos/mesos-1.5.0/_build/src'
make[3]: *** [check-am] Error 2
make[3]: Leaving directory `/mesos/mesos-1.5.0/_build/src'
make[2]: *** [check] Error 2
make[2]: Leaving directory `/mesos/mesos-1.5.0/_build/src'
make[1]: *** [check-recursive] Error 1
make[1]: Leaving directory `/mesos/mesos-1.5.0/_build'
make: *** [distcheck] Error 1
+ docker rmi mesos-1506954687-1753
Untagged: mesos-1506954687-1753:latest
Deleted: sha256:161dd3d49532c96fa60a942fa799add9be999a83985a028281d64d19cb9ec1ed
Deleted: sha256:27653248f9b656a8065a87efff70e0bb094345785663e665c428d90c004f9654
Deleted: sha256:f14d30dd9fc637097daad5848c45a834105aad3a5c2586f97ca82a94e148ba90
Deleted: sha256:1b15b425ee119940a44f9bd267d5bf906026fd65bcddd8ad9518291664c9e0bc
Deleted: sha256:f1c3764fe61cfb03aeb88f95bb5d3eb0c7bb5b5af0978775fb8364a176ca329a
Deleted: sha256:ac25c44b5d55242efac497988b4db20cfbf14a77b2a93f362c1fc8da2cb25b24
Deleted: sha256:bab099eda3825f97553149ef06ca52ea4dcde20e9aca8548cdffde014e6f6ef5
Deleted: sha256:dd4103d0a69167da255293a405e022341ef133f1fceadc7fb8efcccafc681e55
Deleted: sha256:d5b500860fdcc2b3d70ca8cd8b8e51b5ae42be274f12891357b6789ee1521c8c
Deleted: sha256:7a6f134a9871c11d8eae1b6027202766d73e941503e71d5107bf3b1741b3e115
Deleted: sha256:c2c1fc4977147ea1ccf85f67dee07ca7f9c468d71d2d80c66d1112dff7dccac1
Deleted: sha256:44e46f9f1a8fcd16f9616ad350d5f136065408c216e5ede26cf8853e494a8e5f
Deleted: sha256:a150ed106a10c40b03c371799207aab387496c00c9778d218a6a56e54f33cda1
Deleted: sha256:c132bfadb31b7d19c9f44bf5d17ce3ade3bdabdad133b69cee4a21e1c9754ed0
Deleted: sha256:d8702e07a18ce982cadcbc480a3d11535f523f835fe33a6bda11d34d26a698b2
Deleted: sha256:4d0bfd7c6307ea721cd37f2f92f9d2a9cba4c945bc7f98e69ac4dce94f733665
Deleted: sha256:7b25bee8ac5e7353b4c095abc3bc4acd456b8bf265909604c30ee80d33f14c3e
Deleted: sha256:03b5986b03aa19d47862d9c6a12daadac688e3ff9299812a603a34f2d5a9a4e6
Deleted: sha256:d2fed7b79dc81484f8f755e0e5bdab291179972ad93e78d9d5d565c83ef2fde6
Deleted: sha256:7193013559861442312a7ca1c6d99e65a6ad526067e2ca01aec8b0df94491c1a
Deleted: sha256:1a56f3f0624cf1113491525a9d5592249fcdc592a54fa83de8d04184cb6d76e0
Deleted: sha256:e7b78b9084528a38bf62bec97d042778cc9e443e24d2487b8bba8fac29b5b8a2
Deleted: sha256:d58e4d6a0a7b2b3a605090c37a0d741b39d98ec673a0f7b238917cad0ca98064
Deleted: sha256:1555bd048e5a15078b8c75c5f75ab3c274f05affb1e8aff38c41925c0349f4be
Deleted: sha256:5a3a6b1941aacb999453d01d20d2356f4ef4f5df49db6e67dd9e99545a81b668
Deleted: sha256:997e51e7a252bd3eb1a0975ffb3d80942db36ad606b92ef6d7685b0f2f5f639c
Deleted: sha256:f21a1d2891ff4004ec9021f0cd8ebea2eb59882fd72ea04a38f6c875f3c6c107
Deleted: sha256:84eaa24ce67ab97fe5b0490ad4e71ff598b25f27dbfd8381c788c61dc47a4298
Build step 'Execute shell' marked build as failure

Mime
View raw message