mesos-builds mailing list archives

Site index · List index
Message view « Date » · « Thread »
Top « Date » · « Thread »
From Apache Jenkins Server <jenk...@builds.apache.org>
Subject Build failed in Jenkins: Mesos-Buildbot » autotools,gcc,--verbose,GLOG_v=1 MESOS_VERBOSE=1,centos:7,(ubuntu)&&(!ubuntu-us1)&&(!ubuntu-eu2)&&(!qnode3)&&(!H23) #4280
Date Tue, 03 Oct 2017 07:10:59 GMT
See <https://builds.apache.org/job/Mesos-Buildbot/BUILDTOOL=autotools,COMPILER=gcc,CONFIGURATION=--verbose,ENVIRONMENT=GLOG_v=1%20MESOS_VERBOSE=1,OS=centos%3A7,label_exp=(ubuntu)&&(!ubuntu-us1)&&(!ubuntu-eu2)&&(!qnode3)&&(!H23)/4280/display/redirect>

------------------------------------------
[...truncated 31.89 MB...]
I1003 07:10:51.679080  6812 http.cpp:1045] Creating default 'basic' HTTP authenticator for
realm 'mesos-agent-readonly'
I1003 07:10:51.679260  6812 http.cpp:1045] Creating default 'basic' HTTP authenticator for
realm 'mesos-agent-readwrite'
I1003 07:10:51.680780  6812 slave.cpp:585] Agent resources: [{"name":"cpus","scalar":{"value":2.0},"type":"SCALAR"},{"name":"mem","scalar":{"value":1024.0},"type":"SCALAR"},{"name":"disk","scalar":{"value":1024.0},"type":"SCALAR"},{"name":"ports","ranges":{"range":[{"begin":31000,"end":32000}]},"type":"RANGES"}]
I1003 07:10:51.681085  6812 slave.cpp:593] Agent attributes: [  ]
I1003 07:10:51.681104  6812 slave.cpp:602] Agent hostname: acd45d06a686
I1003 07:10:51.681282  6807 status_update_manager.cpp:177] Pausing sending status updates
I1003 07:10:51.682642  6824 state.cpp:64] Recovering state from '/tmp/Endpoint_SlaveEndpointTest_AuthorizedRequest_2_7omH0C/meta'
I1003 07:10:51.682946  6824 status_update_manager.cpp:203] Recovering status update manager
I1003 07:10:51.683159  6806 containerizer.cpp:648] Recovering containerizer
I1003 07:10:51.684741  6820 provisioner.cpp:416] Provisioner recovery complete
I1003 07:10:51.685261  6807 slave.cpp:6310] Finished recovery
I1003 07:10:51.685711  6807 slave.cpp:6492] Querying resource estimator for oversubscribable
resources
I1003 07:10:51.685956  6818 slave.cpp:6506] Received oversubscribable resources {} from the
resource estimator
I1003 07:10:51.688369  6811 process.cpp:3929] Handling HTTP event for process 'slave(817)'
with path: '/slave(817)/containers'
I1003 07:10:51.689767  6821 http.cpp:1185] HTTP GET for /slave(817)/containers from 172.17.0.8:37078
I1003 07:10:51.689838  6821 http.cpp:976] Authorizing principal 'test-principal' to GET the
'/containers' endpoint
I1003 07:10:51.693812  6783 slave.cpp:869] Agent terminating
[       OK ] Endpoint/SlaveEndpointTest.AuthorizedRequest/2 (35 ms)
[ RUN      ] Endpoint/SlaveEndpointTest.UnauthorizedRequest/0
I1003 07:10:51.706759  6783 containerizer.cpp:292] Using isolation { environment_secret, posix/cpu,
posix/mem, filesystem/posix, network/cni }
W1003 07:10:51.707278  6783 backend.cpp:76] Failed to create 'aufs' backend: AufsBackend requires
root privileges
W1003 07:10:51.707391  6783 backend.cpp:76] Failed to create 'bind' backend: BindBackend requires
root privileges
I1003 07:10:51.707433  6783 provisioner.cpp:255] Using default backend 'copy'
I1003 07:10:51.711024  6804 slave.cpp:254] Mesos agent started on (818)@172.17.0.8:36263
I1003 07:10:51.711050  6804 slave.cpp:255] Flags at startup: --acls="" --appc_simple_discovery_uri_prefix="http://"
--appc_store_dir="/tmp/Endpoint_SlaveEndpointTest_UnauthorizedRequest_0_YzSVM9/store/appc"
--authenticate_http_readonly="true" --authenticate_http_readwrite="true" --authenticatee="crammd5"
--authentication_backoff_factor="1secs" --authorizer="local" --cgroups_cpu_enable_pids_and_tids_count="false"
--cgroups_enable_cfs="false" --cgroups_hierarchy="/sys/fs/cgroup" --cgroups_limit_swap="false"
--cgroups_root="mesos" --container_disk_watch_interval="15secs" --containerizers="mesos" --credential="/tmp/Endpoint_SlaveEndpointTest_UnauthorizedRequest_0_YzSVM9/credential"
--default_role="*" --disallow_sharing_agent_pid_namespace="false" --disk_watch_interval="1mins"
--docker="docker" --docker_kill_orphans="true" --docker_registry="https://registry-1.docker.io"
--docker_remove_delay="6hrs" --docker_socket="/var/run/docker.sock" --docker_stop_timeout="0ns"
--docker_store_dir="/tmp/Endpoint_SlaveEndpointTest_UnauthorizedRequest_0_YzSVM9/store/docker"
--docker_volume_checkpoint_dir="/var/run/mesos/isolators/docker/volume" --enforce_container_disk_quota="false"
--executor_registration_timeout="1mins" --executor_reregistration_timeout="2secs" --executor_shutdown_grace_period="5secs"
--fetcher_cache_dir="/tmp/Endpoint_SlaveEndpointTest_UnauthorizedRequest_0_YzSVM9/fetch" --fetcher_cache_size="2GB"
--frameworks_home="" --gc_delay="1weeks" --gc_disk_headroom="0.1" --hadoop_home="" --help="false"
--hostname_lookup="true" --http_command_executor="false" --http_credentials="/tmp/Endpoint_SlaveEndpointTest_UnauthorizedRequest_0_YzSVM9/http_credentials"
--http_heartbeat_interval="30secs" --initialize_driver_logging="true" --isolation="posix/cpu,posix/mem"
--launcher="posix" --launcher_dir="/mesos/mesos-1.5.0/_build/src" --logbufsecs="0" --logging_level="INFO"
--max_completed_executors_per_framework="150" --oversubscribed_resources_interval="15secs"
--perf_duration="10secs" --perf_interval="1mins" --port="5051" --qos_correction_interval_min="0ns"
--quiet="false" --recover="reconnect" --recovery_timeout="15mins" --registration_backoff_factor="10ms"
--resources="cpus:2;gpus:0;mem:1024;disk:1024;ports:[31000-32000]" --revocable_cpu_low_priority="true"
--runtime_dir="/tmp/Endpoint_SlaveEndpointTest_UnauthorizedRequest_0_YzSVM9" --sandbox_directory="/mnt/mesos/sandbox"
--strict="true" --switch_user="true" --systemd_enable_support="true" --systemd_runtime_directory="/run/systemd/system"
--version="false" --work_dir="/tmp/Endpoint_SlaveEndpointTest_UnauthorizedRequest_0_L6VPc3"
--zk_session_timeout="10secs"
I1003 07:10:51.711427  6804 credentials.hpp:86] Loading credential for authentication from
'/tmp/Endpoint_SlaveEndpointTest_UnauthorizedRequest_0_YzSVM9/credential'
I1003 07:10:51.711575  6804 slave.cpp:287] Agent using credential for: test-principal
I1003 07:10:51.711598  6804 credentials.hpp:37] Loading credentials for authentication from
'/tmp/Endpoint_SlaveEndpointTest_UnauthorizedRequest_0_YzSVM9/http_credentials'
I1003 07:10:51.711832  6804 http.cpp:1045] Creating default 'basic' HTTP authenticator for
realm 'mesos-agent-readonly'
I1003 07:10:51.712224  6804 http.cpp:1045] Creating default 'basic' HTTP authenticator for
realm 'mesos-agent-readwrite'
I1003 07:10:51.714145  6804 slave.cpp:585] Agent resources: [{"name":"cpus","scalar":{"value":2.0},"type":"SCALAR"},{"name":"mem","scalar":{"value":1024.0},"type":"SCALAR"},{"name":"disk","scalar":{"value":1024.0},"type":"SCALAR"},{"name":"ports","ranges":{"range":[{"begin":31000,"end":32000}]},"type":"RANGES"}]
I1003 07:10:51.714448  6804 slave.cpp:593] Agent attributes: [  ]
I1003 07:10:51.714464  6804 slave.cpp:602] Agent hostname: acd45d06a686
I1003 07:10:51.714632  6809 status_update_manager.cpp:177] Pausing sending status updates
I1003 07:10:51.716424  6802 state.cpp:64] Recovering state from '/tmp/Endpoint_SlaveEndpointTest_UnauthorizedRequest_0_L6VPc3/meta'
I1003 07:10:51.716703  6802 status_update_manager.cpp:203] Recovering status update manager
I1003 07:10:51.716882  6806 containerizer.cpp:648] Recovering containerizer
I1003 07:10:51.718614  6807 provisioner.cpp:416] Provisioner recovery complete
I1003 07:10:51.719084  6823 slave.cpp:6310] Finished recovery
I1003 07:10:51.719596  6823 slave.cpp:6492] Querying resource estimator for oversubscribable
resources
I1003 07:10:51.719892  6803 slave.cpp:6506] Received oversubscribable resources {} from the
resource estimator
I1003 07:10:51.723026  6810 process.cpp:3929] Handling HTTP event for process 'slave(818)'
with path: '/slave(818)/monitor/statistics'
I1003 07:10:51.724485  6805 http.cpp:1185] HTTP GET for /slave(818)/monitor/statistics from
172.17.0.8:37080
I1003 07:10:51.724557  6805 http.cpp:976] Authorizing principal 'test-principal' to GET the
'/monitor/statistics' endpoint
I1003 07:10:51.727218  6783 slave.cpp:869] Agent terminating
[       OK ] Endpoint/SlaveEndpointTest.UnauthorizedRequest/0 (33 ms)
[ RUN      ] Endpoint/SlaveEndpointTest.UnauthorizedRequest/1
I1003 07:10:51.740895  6783 containerizer.cpp:292] Using isolation { environment_secret, posix/cpu,
posix/mem, filesystem/posix, network/cni }
W1003 07:10:51.741461  6783 backend.cpp:76] Failed to create 'aufs' backend: AufsBackend requires
root privileges
W1003 07:10:51.741574  6783 backend.cpp:76] Failed to create 'bind' backend: BindBackend requires
root privileges
I1003 07:10:51.741606  6783 provisioner.cpp:255] Using default backend 'copy'
I1003 07:10:51.745470  6808 slave.cpp:254] Mesos agent started on (819)@172.17.0.8:36263
I1003 07:10:51.745496  6808 slave.cpp:255] Flags at startup: --acls="" --appc_simple_discovery_uri_prefix="http://"
--appc_store_dir="/tmp/Endpoint_SlaveEndpointTest_UnauthorizedRequest_1_s5tgoA/store/appc"
--authenticate_http_readonly="true" --authenticate_http_readwrite="true" --authenticatee="crammd5"
--authentication_backoff_factor="1secs" --authorizer="local" --cgroups_cpu_enable_pids_and_tids_count="false"
--cgroups_enable_cfs="false" --cgroups_hierarchy="/sys/fs/cgroup" --cgroups_limit_swap="false"
--cgroups_root="mesos" --container_disk_watch_interval="15secs" --containerizers="mesos" --credential="/tmp/Endpoint_SlaveEndpointTest_UnauthorizedRequest_1_s5tgoA/credential"
--default_role="*" --disallow_sharing_agent_pid_namespace="false" --disk_watch_interval="1mins"
--docker="docker" --docker_kill_orphans="true" --docker_registry="https://registry-1.docker.io"
--docker_remove_delay="6hrs" --docker_socket="/var/run/docker.sock" --docker_stop_timeout="0ns"
--docker_store_dir="/tmp/Endpoint_SlaveEndpointTest_UnauthorizedRequest_1_s5tgoA/store/docker"
--docker_volume_checkpoint_dir="/var/run/mesos/isolators/docker/volume" --enforce_container_disk_quota="false"
--executor_registration_timeout="1mins" --executor_reregistration_timeout="2secs" --executor_shutdown_grace_period="5secs"
--fetcher_cache_dir="/tmp/Endpoint_SlaveEndpointTest_UnauthorizedRequest_1_s5tgoA/fetch" --fetcher_cache_size="2GB"
--frameworks_home="" --gc_delay="1weeks" --gc_disk_headroom="0.1" --hadoop_home="" --help="false"
--hostname_lookup="true" --http_command_executor="false" --http_credentials="/tmp/Endpoint_SlaveEndpointTest_UnauthorizedRequest_1_s5tgoA/http_credentials"
--http_heartbeat_interval="30secs" --initialize_driver_logging="true" --isolation="posix/cpu,posix/mem"
--launcher="posix" --launcher_dir="/mesos/mesos-1.5.0/_build/src" --logbufsecs="0" --logging_level="INFO"
--max_completed_executors_per_framework="150" --oversubscribed_resources_interval="15secs"
--perf_duration="10secs" --perf_interval="1mins" --port="5051" --qos_correction_interval_min="0ns"
--quiet="false" --recover="reconnect" --recovery_timeout="15mins" --registration_backoff_factor="10ms"
--resources="cpus:2;gpus:0;mem:1024;disk:1024;ports:[31000-32000]" --revocable_cpu_low_priority="true"
--runtime_dir="/tmp/Endpoint_SlaveEndpointTest_UnauthorizedRequest_1_s5tgoA" --sandbox_directory="/mnt/mesos/sandbox"
--strict="true" --switch_user="true" --systemd_enable_support="true" --systemd_runtime_directory="/run/systemd/system"
--version="false" --work_dir="/tmp/Endpoint_SlaveEndpointTest_UnauthorizedRequest_1_16J8It"
--zk_session_timeout="10secs"
I1003 07:10:51.745921  6808 credentials.hpp:86] Loading credential for authentication from
'/tmp/Endpoint_SlaveEndpointTest_UnauthorizedRequest_1_s5tgoA/credential'
I1003 07:10:51.746115  6808 slave.cpp:287] Agent using credential for: test-principal
I1003 07:10:51.746141  6808 credentials.hpp:37] Loading credentials for authentication from
'/tmp/Endpoint_SlaveEndpointTest_UnauthorizedRequest_1_s5tgoA/http_credentials'
I1003 07:10:51.746515  6808 http.cpp:1045] Creating default 'basic' HTTP authenticator for
realm 'mesos-agent-readonly'
I1003 07:10:51.746759  6808 http.cpp:1045] Creating default 'basic' HTTP authenticator for
realm 'mesos-agent-readwrite'
I1003 07:10:51.764677  6808 slave.cpp:585] Agent resources: [{"name":"cpus","scalar":{"value":2.0},"type":"SCALAR"},{"name":"mem","scalar":{"value":1024.0},"type":"SCALAR"},{"name":"disk","scalar":{"value":1024.0},"type":"SCALAR"},{"name":"ports","ranges":{"range":[{"begin":31000,"end":32000}]},"type":"RANGES"}]
I1003 07:10:51.764925  6808 slave.cpp:593] Agent attributes: [  ]
I1003 07:10:51.764940  6808 slave.cpp:602] Agent hostname: acd45d06a686
I1003 07:10:51.765105  6825 status_update_manager.cpp:177] Pausing sending status updates
I1003 07:10:51.766995  6813 state.cpp:64] Recovering state from '/tmp/Endpoint_SlaveEndpointTest_UnauthorizedRequest_1_16J8It/meta'
I1003 07:10:51.767473  6813 status_update_manager.cpp:203] Recovering status update manager
I1003 07:10:51.767735  6813 containerizer.cpp:648] Recovering containerizer
I1003 07:10:51.769584  6806 provisioner.cpp:416] Provisioner recovery complete
I1003 07:10:51.770186  6825 slave.cpp:6310] Finished recovery
I1003 07:10:51.770637  6825 slave.cpp:6492] Querying resource estimator for oversubscribable
resources
I1003 07:10:51.770963  6810 slave.cpp:6506] Received oversubscribable resources {} from the
resource estimator
I1003 07:10:51.773543  6821 process.cpp:3929] Handling HTTP event for process 'slave(819)'
with path: '/slave(819)/monitor/statistics.json'
I1003 07:10:51.775202  6819 http.cpp:1185] HTTP GET for /slave(819)/monitor/statistics.json
from 172.17.0.8:37082
I1003 07:10:51.775348  6819 http.cpp:976] Authorizing principal 'test-principal' to GET the
'/monitor/statistics.json' endpoint
I1003 07:10:51.778080  6802 slave.cpp:869] Agent terminating
[       OK ] Endpoint/SlaveEndpointTest.UnauthorizedRequest/1 (51 ms)
[ RUN      ] Endpoint/SlaveEndpointTest.UnauthorizedRequest/2
I1003 07:10:51.794865  6783 containerizer.cpp:292] Using isolation { environment_secret, posix/cpu,
posix/mem, filesystem/posix, network/cni }
W1003 07:10:51.795722  6783 backend.cpp:76] Failed to create 'aufs' backend: AufsBackend requires
root privileges
W1003 07:10:51.795912  6783 backend.cpp:76] Failed to create 'bind' backend: BindBackend requires
root privileges
I1003 07:10:51.795976  6783 provisioner.cpp:255] Using default backend 'copy'
I1003 07:10:51.801514  6805 slave.cpp:254] Mesos agent started on (820)@172.17.0.8:36263
I1003 07:10:51.801543  6805 slave.cpp:255] Flags at startup: --acls="" --appc_simple_discovery_uri_prefix="http://"
--appc_store_dir="/tmp/Endpoint_SlaveEndpointTest_UnauthorizedRequest_2_i9xdu1/store/appc"
--authenticate_http_readonly="true" --authenticate_http_readwrite="true" --authenticatee="crammd5"
--authentication_backoff_factor="1secs" --authorizer="local" --cgroups_cpu_enable_pids_and_tids_count="false"
--cgroups_enable_cfs="false" --cgroups_hierarchy="/sys/fs/cgroup" --cgroups_limit_swap="false"
--cgroups_root="mesos" --container_disk_watch_interval="15secs" --containerizers="mesos" --credential="/tmp/Endpoint_SlaveEndpointTest_UnauthorizedRequest_2_i9xdu1/credential"
--default_role="*" --disallow_sharing_agent_pid_namespace="false" --disk_watch_interval="1mins"
--docker="docker" --docker_kill_orphans="true" --docker_registry="https://registry-1.docker.io"
--docker_remove_delay="6hrs" --docker_socket="/var/run/docker.sock" --docker_stop_timeout="0ns"
--docker_store_dir="/tmp/Endpoint_SlaveEndpointTest_UnauthorizedRequest_2_i9xdu1/store/docker"
--docker_volume_checkpoint_dir="/var/run/mesos/isolators/docker/volume" --enforce_container_disk_quota="false"
--executor_registration_timeout="1mins" --executor_reregistration_timeout="2secs" --executor_shutdown_grace_period="5secs"
--fetcher_cache_dir="/tmp/Endpoint_SlaveEndpointTest_UnauthorizedRequest_2_i9xdu1/fetch" --fetcher_cache_size="2GB"
--frameworks_home="" --gc_delay="1weeks" --gc_disk_headroom="0.1" --hadoop_home="" --help="false"
--hostname_lookup="true" --http_command_executor="false" --http_credentials="/tmp/Endpoint_SlaveEndpointTest_UnauthorizedRequest_2_i9xdu1/http_credentials"
--http_heartbeat_interval="30secs" --initialize_driver_logging="true" --isolation="posix/cpu,posix/mem"
--launcher="posix" --launcher_dir="/mesos/mesos-1.5.0/_build/src" --logbufsecs="0" --logging_level="INFO"
--max_completed_executors_per_framework="150" --oversubscribed_resources_interval="15secs"
--perf_duration="10secs" --perf_interval="1mins" --port="5051" --qos_correction_interval_min="0ns"
--quiet="false" --recover="reconnect" --recovery_timeout="15mins" --registration_backoff_factor="10ms"
--resources="cpus:2;gpus:0;mem:1024;disk:1024;ports:[31000-32000]" --revocable_cpu_low_priority="true"
--runtime_dir="/tmp/Endpoint_SlaveEndpointTest_UnauthorizedRequest_2_i9xdu1" --sandbox_directory="/mnt/mesos/sandbox"
--strict="true" --switch_user="true" --systemd_enable_support="true" --systemd_runtime_directory="/run/systemd/system"
--version="false" --work_dir="/tmp/Endpoint_SlaveEndpointTest_UnauthorizedRequest_2_Z4PmHU"
--zk_session_timeout="10secs"
I1003 07:10:51.802019  6805 credentials.hpp:86] Loading credential for authentication from
'/tmp/Endpoint_SlaveEndpointTest_UnauthorizedRequest_2_i9xdu1/credential'
I1003 07:10:51.802197  6805 slave.cpp:287] Agent using credential for: test-principal
I1003 07:10:51.802227  6805 credentials.hpp:37] Loading credentials for authentication from
'/tmp/Endpoint_SlaveEndpointTest_UnauthorizedRequest_2_i9xdu1/http_credentials'
I1003 07:10:51.802510  6805 http.cpp:1045] Creating default 'basic' HTTP authenticator for
realm 'mesos-agent-readonly'
I1003 07:10:51.802680  6805 http.cpp:1045] Creating default 'basic' HTTP authenticator for
realm 'mesos-agent-readwrite'
I1003 07:10:51.804009  6805 slave.cpp:585] Agent resources: [{"name":"cpus","scalar":{"value":2.0},"type":"SCALAR"},{"name":"mem","scalar":{"value":1024.0},"type":"SCALAR"},{"name":"disk","scalar":{"value":1024.0},"type":"SCALAR"},{"name":"ports","ranges":{"range":[{"begin":31000,"end":32000}]},"type":"RANGES"}]
I1003 07:10:51.804247  6805 slave.cpp:593] Agent attributes: [  ]
I1003 07:10:51.804261  6805 slave.cpp:602] Agent hostname: acd45d06a686
I1003 07:10:51.804409  6814 status_update_manager.cpp:177] Pausing sending status updates
I1003 07:10:51.805992  6816 state.cpp:64] Recovering state from '/tmp/Endpoint_SlaveEndpointTest_UnauthorizedRequest_2_Z4PmHU/meta'
I1003 07:10:51.806438  6816 status_update_manager.cpp:203] Recovering status update manager
I1003 07:10:51.806798  6819 containerizer.cpp:648] Recovering containerizer
I1003 07:10:51.808404  6811 provisioner.cpp:416] Provisioner recovery complete
I1003 07:10:51.808853  6815 slave.cpp:6310] Finished recovery
I1003 07:10:51.809379  6815 slave.cpp:6492] Querying resource estimator for oversubscribable
resources
I1003 07:10:51.809756  6820 slave.cpp:6506] Received oversubscribable resources {} from the
resource estimator
I1003 07:10:51.812127  6803 process.cpp:3929] Handling HTTP event for process 'slave(820)'
with path: '/slave(820)/containers'
I1003 07:10:51.813735  6818 http.cpp:1185] HTTP GET for /slave(820)/containers from 172.17.0.8:37084
I1003 07:10:51.813822  6818 http.cpp:976] Authorizing principal 'test-principal' to GET the
'/containers' endpoint
I1003 07:10:51.816923  6783 slave.cpp:869] Agent terminating
[       OK ] Endpoint/SlaveEndpointTest.UnauthorizedRequest/2 (39 ms)
[ RUN      ] Endpoint/SlaveEndpointTest.NoAuthorizer/0
I1003 07:10:51.830745  6783 containerizer.cpp:292] Using isolation { environment_secret, posix/cpu,
posix/mem, filesystem/posix, network/cni }
W1003 07:10:51.831395  6783 backend.cpp:76] Failed to create 'aufs' backend: AufsBackend requires
root privileges
W1003 07:10:51.831513  6783 backend.cpp:76] Failed to create 'bind' backend: BindBackend requires
root privileges
I1003 07:10:51.831554  6783 provisioner.cpp:255] Using default backend 'copy'
I1003 07:10:51.833580  6783 cluster.cpp:448] Creating default 'local' authorizer
I1003 07:10:51.835872  6823 slave.cpp:254] Mesos agent started on (821)@172.17.0.8:36263
I1003 07:10:51.835903  6823 slave.cpp:255] Flags at startup: --acls="" --appc_simple_discovery_uri_prefix="http://"
--appc_store_dir="/tmp/Endpoint_SlaveEndpointTest_NoAuthorizer_0_EcXVWs/store/appc" --authenticate_http_readonly="true"
--authenticate_http_readwrite="true" --authenticatee="crammd5" --authentication_backoff_factor="1secs"
--authorizer="local" --cgroups_cpu_enable_pids_and_tids_count="false" --cgroups_enable_cfs="false"
--cgroups_hierarchy="/sys/fs/cgroup" --cgroups_limit_swap="false" --cgroups_root="mesos" --container_disk_watch_interval="15secs"
--containerizers="mesos" --credential="/tmp/Endpoint_SlaveEndpointTest_NoAuthorizer_0_EcXVWs/credential"
--default_role="*" --disallow_sharing_agent_pid_namespace="false" --disk_watch_interval="1mins"
--docker="docker" --docker_kill_orphans="true" --docker_registry="https://registry-1.docker.io"
--docker_remove_delay="6hrs" --docker_socket="/var/run/docker.sock" --docker_stop_timeout="0ns"
--docker_store_dir="/tmp/Endpoint_SlaveEndpointTest_NoAuthorizer_0_EcXVWs/store/docker" --docker_volume_checkpoint_dir="/var/run/mesos/isolators/docker/volume"
--enforce_container_disk_quota="false" --executor_registration_timeout="1mins" --executor_reregistration_timeout="2secs"
--executor_shutdown_grace_period="5secs" --fetcher_cache_dir="/tmp/Endpoint_SlaveEndpointTest_NoAuthorizer_0_EcXVWs/fetch"
--fetcher_cache_size="2GB" --frameworks_home="" --gc_delay="1weeks" --gc_disk_headroom="0.1"
--hadoop_home="" --help="false" --hostname_lookup="true" --http_command_executor="false" --http_credentials="/tmp/Endpoint_SlaveEndpointTest_NoAuthorizer_0_EcXVWs/http_credentials"
--http_heartbeat_interval="30secs" --initialize_driver_logging="true" --isolation="posix/cpu,posix/mem"
--launcher="posix" --launcher_dir="/mesos/mesos-1.5.0/_build/src" --logbufsecs="0" --logging_level="INFO"
--max_completed_executors_per_framework="150" --oversubscribed_resources_interval="15secs"
--perf_duration="10secs" --perf_interval="1mins" --port="5051" --qos_correction_interval_min="0ns"
--quiet="false" --recover="reconnect" --recovery_timeout="15mins" --registration_backoff_factor="10ms"
--resources="cpus:2;gpus:0;mem:1024;disk:1024;ports:[31000-32000]" --revocable_cpu_low_priority="true"
--runtime_dir="/tmp/Endpoint_SlaveEndpointTest_NoAuthorizer_0_EcXVWs" --sandbox_directory="/mnt/mesos/sandbox"
--strict="true" --switch_user="true" --systemd_enable_support="true" --systemd_runtime_directory="/run/systemd/system"
--version="false" --work_dir="/tmp/Endpoint_SlaveEndpointTest_NoAuthorizer_0_TiIt4l" --zk_session_timeout="10secs"
I1003 07:10:51.836488  6823 credentials.hpp:86] Loading credential for authentication from
'/tmp/Endpoint_SlaveEndpointTest_NoAuthorizer_0_EcXVWs/credential'
I1003 07:10:51.836670  6823 slave.cpp:287] Agent using credential for: test-principal
I1003 07:10:51.836707  6823 credentials.hpp:37] Loading credentials for authentication from
'/tmp/Endpoint_SlaveEndpointTest_NoAuthorizer_0_EcXVWs/http_credentials'
I1003 07:10:51.837085  6823 http.cpp:1045] Creating default 'basic' HTTP authenticator for
realm 'mesos-agent-readonly'
I1003 07:10:51.837327  6823 http.cpp:1045] Creating default 'basic' HTTP authenticator for
realm 'mesos-agent-readwrite'
I1003 07:10:51.839021  6823 slave.cpp:585] Agent resources: [{"name":"cpus","scalar":{"value":2.0},"type":"SCALAR"},{"name":"mem","scalar":{"value":1024.0},"type":"SCALAR"},{"name":"disk","scalar":{"value":1024.0},"type":"SCALAR"},{"name":"ports","ranges":{"range":[{"begin":31000,"end":32000}]},"type":"RANGES"}]
I1003 07:10:51.839298  6823 slave.cpp:593] Agent attributes: [  ]
I1003 07:10:51.839314  6823 slave.cpp:602] Agent hostname: acd45d06a686
I1003 07:10:51.839582  6805 status_update_manager.cpp:177] Pausing sending status updates
I1003 07:10:51.840975  6817 state.cpp:64] Recovering state from '/tmp/Endpoint_SlaveEndpointTest_NoAuthorizer_0_TiIt4l/meta'
I1003 07:10:51.841348  6818 status_update_manager.cpp:203] Recovering status update manager
I1003 07:10:51.841737  6814 containerizer.cpp:648] Recovering containerizer
I1003 07:10:51.843188  6822 provisioner.cpp:416] Provisioner recovery complete
I1003 07:10:51.843897  6807 slave.cpp:6310] Finished recovery
I1003 07:10:51.844558  6807 slave.cpp:6492] Querying resource estimator for oversubscribable
resources
I1003 07:10:51.844856  6802 slave.cpp:6506] Received oversubscribable resources {} from the
resource estimator
I1003 07:10:51.847249  6806 process.cpp:3929] Handling HTTP event for process 'slave(821)'
with path: '/slave(821)/monitor/statistics'
I1003 07:10:51.848644  6816 http.cpp:1185] HTTP GET for /slave(821)/monitor/statistics from
172.17.0.8:37086
I1003 07:10:51.848721  6816 http.cpp:976] Authorizing principal 'test-principal' to GET the
'/monitor/statistics' endpoint
I1003 07:10:51.852411  6783 slave.cpp:869] Agent terminating
[       OK ] Endpoint/SlaveEndpointTest.NoAuthorizer/0 (36 ms)
[ RUN      ] Endpoint/SlaveEndpointTest.NoAuthorizer/1
I1003 07:10:51.866945  6783 containerizer.cpp:292] Using isolation { environment_secret, posix/cpu,
posix/mem, filesystem/posix, network/cni }
W1003 07:10:51.867535  6783 backend.cpp:76] Failed to create 'aufs' backend: AufsBackend requires
root privileges
W1003 07:10:51.867691  6783 backend.cpp:76] Failed to create 'bind' backend: BindBackend requires
root privileges
I1003 07:10:51.867725  6783 provisioner.cpp:255] Using default backend 'copy'
I1003 07:10:51.869482  6783 cluster.cpp:448] Creating default 'local' authorizer
I1003 07:10:51.871738  6818 slave.cpp:254] Mesos agent started on (822)@172.17.0.8:36263
I1003 07:10:51.871773  6818 slave.cpp:255] Flags at startup: --acls="" --appc_simple_discovery_uri_prefix="http://"
--appc_store_dir="/tmp/Endpoint_SlaveEndpointTest_NoAuthorizer_1_cFM8KU/store/appc" --authenticate_http_readonly="true"
--authenticate_http_readwrite="true" --authenticatee="crammd5" --authentication_backoff_factor="1secs"
--authorizer="local" --cgroups_cpu_enable_pids_and_tids_count="false" --cgroups_enable_cfs="false"
--cgroups_hierarchy="/sys/fs/cgroup" --cgroups_limit_swap="false" --cgroups_root="mesos" --container_disk_watch_interval="15secs"
--containerizers="mesos" --credential="/tmp/Endpoint_SlaveEndpointTest_NoAuthorizer_1_cFM8KU/credential"
--default_role="*" --disallow_sharing_agent_pid_namespace="false" --disk_watch_interval="1mins"
--docker="docker" --docker_kill_orphans="true" --docker_registry="https://registry-1.docker.io"
--docker_remove_delay="6hrs" --docker_socket="/var/run/docker.sock" --docker_stop_timeout="0ns"
--docker_store_dir="/tmp/Endpoint_SlaveEndpointTest_NoAuthorizer_1_cFM8KU/store/docker" --docker_volume_checkpoint_dir="/var/run/mesos/isolators/docker/volume"
--enforce_container_disk_quota="false" --executor_registration_timeout="1mins" --executor_reregistration_timeout="2secs"
--executor_shutdown_grace_period="5secs" --fetcher_cache_dir="/tmp/Endpoint_SlaveEndpointTest_NoAuthorizer_1_cFM8KU/fetch"
--fetcher_cache_size="2GB" --frameworks_home="" --gc_delay="1weeks" --gc_disk_headroom="0.1"
--hadoop_home="" --help="false" --hostname_lookup="true" --http_command_executor="false" --http_credentials="/tmp/Endpoint_SlaveEndpointTest_NoAuthorizer_1_cFM8KU/http_credentials"
--http_heartbeat_interval="30secs" --initialize_driver_logging="true" --isolation="posix/cpu,posix/mem"
--launcher="posix" --launcher_dir="/mesos/mesos-1.5.0/_build/src" --logbufsecs="0" --logging_level="INFO"
--max_completed_executors_per_framework="150" --oversubscribed_resources_interval="15secs"
--perf_duration="10secs" --perf_interval="1mins" --port="5051" --qos_correction_interval_min="0ns"
--quiet="false" --recover="reconnect" --recovery_timeout="15mins" --registration_backoff_factor="10ms"
--resources="cpus:2;gpus:0;mem:1024;disk:1024;ports:[31000-32000]" --revocable_cpu_low_priority="true"
--runtime_dir="/tmp/Endpoint_SlaveEndpointTest_NoAuthorizer_1_cFM8KU" --sandbox_directory="/mnt/mesos/sandbox"
--strict="true" --switch_user="true" --systemd_enable_support="true" --systemd_runtime_directory="/run/systemd/system"
--version="false" --work_dir="/tmp/Endpoint_SlaveEndpointTest_NoAuthorizer_1_RjAhNN" --zk_session_timeout="10secs"
I1003 07:10:51.872233  6818 credentials.hpp:86] Loading credential for authentication from
'/tmp/Endpoint_SlaveEndpointTest_NoAuthorizer_1_cFM8KU/credential'
I1003 07:10:51.872444  6818 slave.cpp:287] Agent using credential for: test-principal
I1003 07:10:51.872481  6818 credentials.hpp:37] Loading credentials for authentication from
'/tmp/Endpoint_SlaveEndpointTest_NoAuthorizer_1_cFM8KU/http_credentials'
I1003 07:10:51.872795  6818 http.cpp:1045] Creating default 'basic' HTTP authenticator for
realm 'mesos-agent-readonly'
I1003 07:10:51.872984  6818 http.cpp:1045] Creating default 'basic' HTTP authenticator for
realm 'mesos-agent-readwrite'
I1003 07:10:51.875285  6818 slave.cpp:585] Agent resources: [{"name":"cpus","scalar":{"value":2.0},"type":"SCALAR"},{"name":"mem","scalar":{"value":1024.0},"type":"SCALAR"},{"name":"disk","scalar":{"value":1024.0},"type":"SCALAR"},{"name":"ports","ranges":{"range":[{"begin":31000,"end":32000}]},"type":"RANGES"}]
I1003 07:10:51.875710  6818 slave.cpp:593] Agent attributes: [  ]
I1003 07:10:51.875741  6818 slave.cpp:602] Agent hostname: acd45d06a686
I1003 07:10:51.875908  6816 status_update_manager.cpp:177] Pausing sending status updates
I1003 07:10:51.878046  6812 state.cpp:64] Recovering state from '/tmp/Endpoint_SlaveEndpointTest_NoAuthorizer_1_RjAhNN/meta'
I1003 07:10:51.878418  6825 status_update_manager.cpp:203] Recovering status update manager
I1003 07:10:51.878640  6810 containerizer.cpp:648] Recovering containerizer
I1003 07:10:51.880273  6809 provisioner.cpp:416] Provisioner recovery complete
I1003 07:10:51.880707  6809 slave.cpp:6310] Finished recovery
I1003 07:10:51.881147  6809 slave.cpp:6492] Querying resource estimator for oversubscribable
resources
I1003 07:10:51.881362  6805 slave.cpp:6506] Received oversubscribable resources {} from the
resource estimator
I1003 07:10:51.884294  6802 process.cpp:3929] Handling HTTP event for process 'slave(822)'
with path: '/slave(822)/monitor/statistics.json'
I1003 07:10:51.885926  6806 http.cpp:1185] HTTP GET for /slave(822)/monitor/statistics.json
from 172.17.0.8:37088
I1003 07:10:51.885993  6806 http.cpp:976] Authorizing principal 'test-principal' to GET the
'/monitor/statistics.json' endpoint
I1003 07:10:51.890552  6783 slave.cpp:869] Agent terminating
[       OK ] Endpoint/SlaveEndpointTest.NoAuthorizer/1 (37 ms)
[ RUN      ] Endpoint/SlaveEndpointTest.NoAuthorizer/2
I1003 07:10:51.908424  6783 containerizer.cpp:292] Using isolation { environment_secret, posix/cpu,
posix/mem, filesystem/posix, network/cni }
W1003 07:10:51.909288  6783 backend.cpp:76] Failed to create 'aufs' backend: AufsBackend requires
root privileges
W1003 07:10:51.909464  6783 backend.cpp:76] Failed to create 'bind' backend: BindBackend requires
root privileges
I1003 07:10:51.909523  6783 provisioner.cpp:255] Using default backend 'copy'
I1003 07:10:51.912169  6783 cluster.cpp:448] Creating default 'local' authorizer
I1003 07:10:51.914990  6808 slave.cpp:254] Mesos agent started on (823)@172.17.0.8:36263
I1003 07:10:51.915035  6808 slave.cpp:255] Flags at startup: --acls="" --appc_simple_discovery_uri_prefix="http://"
--appc_store_dir="/tmp/Endpoint_SlaveEndpointTest_NoAuthorizer_2_kHEhWm/store/appc" --authenticate_http_readonly="true"
--authenticate_http_readwrite="true" --authenticatee="crammd5" --authentication_backoff_factor="1secs"
--authorizer="local" --cgroups_cpu_enable_pids_and_tids_count="false" --cgroups_enable_cfs="false"
--cgroups_hierarchy="/sys/fs/cgroup" --cgroups_limit_swap="false" --cgroups_root="mesos" --container_disk_watch_interval="15secs"
--containerizers="mesos" --credential="/tmp/Endpoint_SlaveEndpointTest_NoAuthorizer_2_kHEhWm/credential"
--default_role="*" --disallow_sharing_agent_pid_namespace="false" --disk_watch_interval="1mins"
--docker="docker" --docker_kill_orphans="true" --docker_registry="https://registry-1.docker.io"
--docker_remove_delay="6hrs" --docker_socket="/var/run/docker.sock" --docker_stop_timeout="0ns"
--docker_store_dir="/tmp/Endpoint_SlaveEndpointTest_NoAuthorizer_2_kHEhWm/store/docker" --docker_volume_checkpoint_dir="/var/run/mesos/isolators/docker/volume"
--enforce_container_disk_quota="false" --executor_registration_timeout="1mins" --executor_reregistration_timeout="2secs"
--executor_shutdown_grace_period="5secs" --fetcher_cache_dir="/tmp/Endpoint_SlaveEndpointTest_NoAuthorizer_2_kHEhWm/fetch"
--fetcher_cache_size="2GB" --frameworks_home="" --gc_delay="1weeks" --gc_disk_headroom="0.1"
--hadoop_home="" --help="false" --hostname_lookup="true" --http_command_executor="false" --http_credentials="/tmp/Endpoint_SlaveEndpointTest_NoAuthorizer_2_kHEhWm/http_credentials"
--http_heartbeat_interval="30secs" --initialize_driver_logging="true" --isolation="posix/cpu,posix/mem"
--launcher="posix" --launcher_dir="/mesos/mesos-1.5.0/_build/src" --logbufsecs="0" --logging_level="INFO"
--max_completed_executors_per_framework="150" --oversubscribed_resources_interval="15secs"
--perf_duration="10secs" --perf_interval="1mins" --port="5051" --qos_correction_interval_min="0ns"
--quiet="false" --recover="reconnect" --recovery_timeout="15mins" --registration_backoff_factor="10ms"
--resources="cpus:2;gpus:0;mem:1024;disk:1024;ports:[31000-32000]" --revocable_cpu_low_priority="true"
--runtime_dir="/tmp/Endpoint_SlaveEndpointTest_NoAuthorizer_2_kHEhWm" --sandbox_directory="/mnt/mesos/sandbox"
--strict="true" --switch_user="true" --systemd_enable_support="true" --systemd_runtime_directory="/run/systemd/system"
--version="false" --work_dir="/tmp/Endpoint_SlaveEndpointTest_NoAuthorizer_2_by6vSf" --zk_session_timeout="10secs"
I1003 07:10:51.915575  6808 credentials.hpp:86] Loading credential for authentication from
'/tmp/Endpoint_SlaveEndpointTest_NoAuthorizer_2_kHEhWm/credential'
I1003 07:10:51.915772  6808 slave.cpp:287] Agent using credential for: test-principal
I1003 07:10:51.915802  6808 credentials.hpp:37] Loading credentials for authentication from
'/tmp/Endpoint_SlaveEndpointTest_NoAuthorizer_2_kHEhWm/http_credentials'
I1003 07:10:51.916090  6808 http.cpp:1045] Creating default 'basic' HTTP authenticator for
realm 'mesos-agent-readonly'
I1003 07:10:51.916278  6808 http.cpp:1045] Creating default 'basic' HTTP authenticator for
realm 'mesos-agent-readwrite'
I1003 07:10:51.918406  6808 slave.cpp:585] Agent resources: [{"name":"cpus","scalar":{"value":2.0},"type":"SCALAR"},{"name":"mem","scalar":{"value":1024.0},"type":"SCALAR"},{"name":"disk","scalar":{"value":1024.0},"type":"SCALAR"},{"name":"ports","ranges":{"range":[{"begin":31000,"end":32000}]},"type":"RANGES"}]
I1003 07:10:51.918836  6808 slave.cpp:593] Agent attributes: [  ]
I1003 07:10:51.918859  6808 slave.cpp:602] Agent hostname: acd45d06a686
I1003 07:10:51.919081  6815 status_update_manager.cpp:177] Pausing sending status updates
I1003 07:10:51.920756  6805 state.cpp:64] Recovering state from '/tmp/Endpoint_SlaveEndpointTest_NoAuthorizer_2_by6vSf/meta'
I1003 07:10:51.921155  6805 status_update_manager.cpp:203] Recovering status update manager
I1003 07:10:51.921375  6805 containerizer.cpp:648] Recovering containerizer
I1003 07:10:51.923028  6814 provisioner.cpp:416] Provisioner recovery complete
I1003 07:10:51.923667  6823 slave.cpp:6310] Finished recovery
I1003 07:10:51.924214  6823 slave.cpp:6492] Querying resource estimator for oversubscribable
resources
I1003 07:10:51.924584  6809 slave.cpp:6506] Received oversubscribable resources {} from the
resource estimator
I1003 07:10:51.927026  6825 process.cpp:3929] Handling HTTP event for process 'slave(823)'
with path: '/slave(823)/containers'
I1003 07:10:51.928447  6813 http.cpp:1185] HTTP GET for /slave(823)/containers from 172.17.0.8:37090
I1003 07:10:51.928513  6813 http.cpp:976] Authorizing principal 'test-principal' to GET the
'/containers' endpoint
I1003 07:10:51.933356  6783 slave.cpp:869] Agent terminating
[       OK ] Endpoint/SlaveEndpointTest.NoAuthorizer/2 (41 ms)
[----------] 9 tests from Endpoint/SlaveEndpointTest (353 ms total)

[----------] 2 tests from ContainerizerType/DefaultContainerDNSFlagTest
[ RUN      ] ContainerizerType/DefaultContainerDNSFlagTest.ValidateFlag/0
[       OK ] ContainerizerType/DefaultContainerDNSFlagTest.ValidateFlag/0 (12 ms)
[ RUN      ] ContainerizerType/DefaultContainerDNSFlagTest.ValidateFlag/1
[       OK ] ContainerizerType/DefaultContainerDNSFlagTest.ValidateFlag/1 (11 ms)
[----------] 2 tests from ContainerizerType/DefaultContainerDNSFlagTest (23 ms total)

[----------] Global test environment tear-down
[==========] 1682 tests from 184 test cases ran. (564310 ms total)
[  PASSED  ] 1681 tests.
[  FAILED  ] 1 test, listed below:
[  FAILED  ] CommandExecutorCheckTest.CommandCheckDeliveredAndReconciled

 1 FAILED TEST
  YOU HAVE 21 DISABLED TESTS

I1003 07:10:52.030164  6826 process.cpp:1068] Failed to accept socket: future discarded
make[4]: *** [check-local] Error 1
make[4]: Leaving directory `/mesos/mesos-1.5.0/_build/src'
make[3]: *** [check-am] Error 2
make[3]: Leaving directory `/mesos/mesos-1.5.0/_build/src'
make[2]: *** [check] Error 2
make[2]: Leaving directory `/mesos/mesos-1.5.0/_build/src'
make[1]: *** [check-recursive] Error 1
make[1]: Leaving directory `/mesos/mesos-1.5.0/_build'
make: *** [distcheck] Error 1
+ docker rmi mesos-1507011981-20321
Untagged: mesos-1507011981-20321:latest
Deleted: sha256:3d84b8e318f4c702dbc7e984a9eae5b55d1f21535b9b128bcb5cf130383a5239
Deleted: sha256:2e063692684c1d572911c1f72b42c1abce7dc45a9792236c73236a040299b520
Deleted: sha256:95b30185966f66a2195576e31754943d03ca8898d3788be44aeaf551af1e8568
Deleted: sha256:38e9cc605195ba9a82dd97981dbb755a6563bf2b0fb0216760782e0356ea613e
Deleted: sha256:f51cf78f9390746b45643842200ac5d7d8f00ae5bba98105cc12c07484d49c54
Deleted: sha256:515c8dcd8afe3aafb15a11e408d9a9c672f1518eeae3fbd21f3c12c0b8db6c06
Deleted: sha256:43d665b29f7cb325aa0eb00866bbd0c55893a75d45d9f7dc8c30fd40e76f371a
Deleted: sha256:140a0c104b56d39d54668bfb6d883e5e19bb9510c157d887c24d29e91aa311a7
Deleted: sha256:aaa86a58502a7a14cc6cb81cba3fa3eb815f8bf5023662baa771a59e9ce97f75
Deleted: sha256:234a59836410dea616ddd47a8023c93df8e72fddc46d5424913e5a1b2742f804
Deleted: sha256:7229b5bcc12d42a6fb70db2c3f02e3953198f99da4441207dbc4f18a964e0dd0
Deleted: sha256:894e29057644774b1c37934d4cda7be211f3c434a5345535ec3da537954efee2
Deleted: sha256:41414d53d34485dfaa3f499a15579cff95a33b60055d8e134e79ee5d05764cb8
Deleted: sha256:7e7a66794b8cfe3777e463995dcc32080adab54ee34cca4159f87eadea7444d0
Deleted: sha256:0728c15889fde136676298c2ff6104c5c1088cfcfb0ec89f6d8cdb9db4ed2ab2
Deleted: sha256:b01075ee846c1cee0deac9fc4de15aec6fe8083d4e66d6115fad17edaa948e6c
Deleted: sha256:e221f5178bd384413dd6da85565487354da42f361dc350bcdf34e6eacb398763
Deleted: sha256:40696529ff0c2a49599421247c0f5695d523095a55e84e19c0becb126476c3cd
Deleted: sha256:251ce2a053f2c5a4983d8f8eebfe4696830b07a47f18421aa9c1dbd3db2efe3c
Deleted: sha256:6d0507f2c0a76a3a303fd81dc57e2a1b4a31b0c483b4ab35d635077f069cdf69
Deleted: sha256:7bb8b889b9767ef83f5cc77b1271e1f690c4e3c589845e6f175256147a5e2f93
Deleted: sha256:0c4100f48fd0c98f028e234574592c2d32b413d236ab882005cd9ae32c193367
Deleted: sha256:b9e6419d80a76ea3a891d95d417187c2318b54898c2d4f2a251869ceac2c5548
Deleted: sha256:f997779a0b8c2c3908d41bd5b31f0c1e3438c2a289af6dad529051bb65268756
Deleted: sha256:f8b18a6863fee0ae3e7561d4483bd5d155afe22139c9ebfee91734a605ed7d2d
Deleted: sha256:be5ab246297e51e30de349b46da08b8669e4a34ec4dbfd32723586f210ab7801
Deleted: sha256:fc855c3efa9acfdd7216760cd502e457773a7f6e394eb1f42d224882c7ccf7e1
Deleted: sha256:eb19d2d495c4ed76242ff5087f04612db12fca577c3ce76baaf53008b2d8e970
Deleted: sha256:12457447f809065fba8986193011c3c04fce64c79385b45047c3f4a5bfda4539
Build step 'Execute shell' marked build as failure

Mime
View raw message