mesos-builds mailing list archives

Site index · List index
Message view « Date » · « Thread »
Top « Date » · « Thread »
From James Peach <jpe...@apache.org>
Subject Re: Build failed in Jenkins: Mesos-Reviewbot #19818
Date Tue, 17 Oct 2017 23:17:43 GMT

> On Oct 17, 2017, at 1:16 PM, Alex Rukletsov <alex@mesosphere.com> wrote:
> 
> James, could you please have a look at DefaultExecutorTest.ResourceLimitation?

It looks like build #19818 rolled off the Jenkins history and this test didn't fail in the
subsequent runs. Have you noticed that test being flaky?

> 
> On Tue, Oct 17, 2017 at 5:38 AM, Apache Jenkins Server <jenkins@builds.apache.org>
wrote:
> See <https://builds.apache.org/job/Mesos-Reviewbot/19818/display/redirect>
> 
> ------------------------------------------
> [...truncated 32.03 MB...]
> I1017 12:37:25.264365  5674 http.cpp:1045] Creating default 'basic' HTTP authenticator
for realm 'mesos-agent-readonly'
> I1017 12:37:25.264506  5674 http.cpp:1045] Creating default 'basic' HTTP authenticator
for realm 'mesos-agent-readwrite'
> I1017 12:37:25.266592  5674 slave.cpp:585] Agent resources: [{"name":"cpus","scalar":{"value":2.0},"type":"SCALAR"},{"name":"mem","scalar":{"value":1024.0},"type":"SCALAR"},{"name":"disk","scalar":{"value":1024.0},"type":"SCALAR"},{"name":"ports","ranges":{"range":[{"begin":31000,"end":32000}]},"type":"RANGES"}]
> I1017 12:37:25.266810  5674 slave.cpp:593] Agent attributes: [  ]
> I1017 12:37:25.266825  5674 slave.cpp:602] Agent hostname: 0507f65a29af
> I1017 12:37:25.266970  5677 status_update_manager.cpp:177] Pausing sending status updates
> I1017 12:37:25.268124  5682 state.cpp:64] Recovering state from '/tmp/Endpoint_SlaveEndpointTest_AuthorizedRequest_2_rkBg0B/meta'
> I1017 12:37:25.268435  5676 status_update_manager.cpp:203] Recovering status update manager
> I1017 12:37:25.268626  5671 containerizer.cpp:649] Recovering containerizer
> I1017 12:37:25.270164  5689 provisioner.cpp:416] Provisioner recovery complete
> I1017 12:37:25.270474  5670 slave.cpp:6310] Finished recovery
> I1017 12:37:25.270828  5670 slave.cpp:6492] Querying resource estimator for oversubscribable
resources
> I1017 12:37:25.271061  5675 slave.cpp:6506] Received oversubscribable resources {} from
the resource estimator
> I1017 12:37:25.273231  5687 process.cpp:3929] Handling HTTP event for process 'slave(822)'
with path: '/slave(822)/containers'
> I1017 12:37:25.274312  5672 http.cpp:1185] HTTP GET for /slave(822)/containers from 172.17.0.4:50570
> I1017 12:37:25.274451  5672 http.cpp:976] Authorizing principal 'test-principal' to GET
the '/containers' endpoint
> I1017 12:37:25.277704  5670 slave.cpp:869] Agent terminating
> [       OK ] Endpoint/SlaveEndpointTest.AuthorizedRequest/2 (27 ms)
> [ RUN      ] Endpoint/SlaveEndpointTest.UnauthorizedRequest/0
> I1017 12:37:25.287848  5668 containerizer.cpp:292] Using isolation { environment_secret,
posix/cpu, posix/mem, filesystem/posix, network/cni }
> W1017 12:37:25.288316  5668 backend.cpp:76] Failed to create 'aufs' backend: AufsBackend
requires root privileges
> W1017 12:37:25.288419  5668 backend.cpp:76] Failed to create 'bind' backend: BindBackend
requires root privileges
> I1017 12:37:25.288449  5668 provisioner.cpp:255] Using default backend 'copy'
> I1017 12:37:25.291791  5671 slave.cpp:254] Mesos agent started on (823)@172.17.0.4:33017
> I1017 12:37:25.291813  5671 slave.cpp:255] Flags at startup: --acls="" --appc_simple_discovery_uri_prefix="http://"
--appc_store_dir="/tmp/Endpoint_SlaveEndpointTest_UnauthorizedRequest_0_peJzK0/store/appc"
--authenticate_http_readonly="true" --authenticate_http_readwrite="true" --authenticatee="crammd5"
--authentication_backoff_factor="1secs" --authorizer="local" --cgroups_cpu_enable_pids_and_tids_count="false"
--cgroups_enable_cfs="false" --cgroups_hierarchy="/sys/fs/cgroup" --cgroups_limit_swap="false"
--cgroups_root="mesos" --container_disk_watch_interval="15secs" --containerizers="mesos" --credential="/tmp/Endpoint_SlaveEndpointTest_UnauthorizedRequest_0_peJzK0/credential"
--default_role="*" --disallow_sharing_agent_pid_namespace="false" --disk_watch_interval="1mins"
--docker="docker" --docker_kill_orphans="true" --docker_registry="https://registry-1.docker.io"
--docker_remove_delay="6hrs" --docker_socket="/var/run/docker.sock" --docker_stop_timeout="0ns"
--docker_store_dir="/tmp/Endpoint_SlaveEndpointTest_UnauthorizedRequest_0_peJzK0/store/docker"
--docker_volume_checkpoint_dir="/var/run/mesos/isolators/docker/volume" --enforce_container_disk_quota="false"
--executor_registration_timeout="1mins" --executor_reregistration_timeout="2secs" --executor_shutdown_grace_period="5secs"
--fetcher_cache_dir="/tmp/Endpoint_SlaveEndpointTest_UnauthorizedRequest_0_peJzK0/fetch" --fetcher_cache_size="2GB"
--frameworks_home="" --gc_delay="1weeks" --gc_disk_headroom="0.1" --hadoop_home="" --help="false"
--hostname_lookup="true" --http_command_executor="false" --http_credentials="/tmp/Endpoint_SlaveEndpointTest_UnauthorizedRequest_0_peJzK0/http_credentials"
--http_heartbeat_interval="30secs" --initialize_driver_logging="true" --isolation="posix/cpu,posix/mem"
--launcher="posix" --launcher_dir="/mesos/mesos-1.5.0/_build/src" --logbufsecs="0" --logging_level="INFO"
--max_completed_executors_per_framework="150" --oversubscribed_resources_interval="15secs"
--perf_duration="10secs" --perf_interval="1mins" --port="5051" --qos_correction_interval_min="0ns"
--quiet="false" --recover="reconnect" --recovery_timeout="15mins" --registration_backoff_factor="10ms"
--resources="cpus:2;gpus:0;mem:1024;disk:1024;ports:[31000-32000]" --revocable_cpu_low_priority="true"
--runtime_dir="/tmp/Endpoint_SlaveEndpointTest_UnauthorizedRequest_0_peJzK0" --sandbox_directory="/mnt/mesos/sandbox"
--strict="true" --switch_user="true" --systemd_enable_support="true" --systemd_runtime_directory="/run/systemd/system"
--version="false" --work_dir="/tmp/Endpoint_SlaveEndpointTest_UnauthorizedRequest_0_5JqMYw"
--zk_session_timeout="10secs"
> I1017 12:37:25.292171  5671 credentials.hpp:86] Loading credential for authentication
from '/tmp/Endpoint_SlaveEndpointTest_UnauthorizedRequest_0_peJzK0/credential'
> I1017 12:37:25.292300  5671 slave.cpp:287] Agent using credential for: test-principal
> I1017 12:37:25.292330  5671 credentials.hpp:37] Loading credentials for authentication
from '/tmp/Endpoint_SlaveEndpointTest_UnauthorizedRequest_0_peJzK0/http_credentials'
> I1017 12:37:25.292560  5671 http.cpp:1045] Creating default 'basic' HTTP authenticator
for realm 'mesos-agent-readonly'
> I1017 12:37:25.292707  5671 http.cpp:1045] Creating default 'basic' HTTP authenticator
for realm 'mesos-agent-readwrite'
> I1017 12:37:25.294077  5671 slave.cpp:585] Agent resources: [{"name":"cpus","scalar":{"value":2.0},"type":"SCALAR"},{"name":"mem","scalar":{"value":1024.0},"type":"SCALAR"},{"name":"disk","scalar":{"value":1024.0},"type":"SCALAR"},{"name":"ports","ranges":{"range":[{"begin":31000,"end":32000}]},"type":"RANGES"}]
> I1017 12:37:25.294296  5671 slave.cpp:593] Agent attributes: [  ]
> I1017 12:37:25.294308  5671 slave.cpp:602] Agent hostname: 0507f65a29af
> I1017 12:37:25.294432  5677 status_update_manager.cpp:177] Pausing sending status updates
> I1017 12:37:25.296056  5675 state.cpp:64] Recovering state from '/tmp/Endpoint_SlaveEndpointTest_UnauthorizedRequest_0_5JqMYw/meta'
> I1017 12:37:25.296332  5670 status_update_manager.cpp:203] Recovering status update manager
> I1017 12:37:25.296512  5669 containerizer.cpp:649] Recovering containerizer
> I1017 12:37:25.297602  5684 provisioner.cpp:416] Provisioner recovery complete
> I1017 12:37:25.297909  5683 slave.cpp:6310] Finished recovery
> I1017 12:37:25.298377  5683 slave.cpp:6492] Querying resource estimator for oversubscribable
resources
> I1017 12:37:25.298619  5682 slave.cpp:6506] Received oversubscribable resources {} from
the resource estimator
> I1017 12:37:25.300652  5681 process.cpp:3929] Handling HTTP event for process 'slave(823)'
with path: '/slave(823)/monitor/statistics'
> I1017 12:37:25.301818  5674 http.cpp:1185] HTTP GET for /slave(823)/monitor/statistics
from 172.17.0.4:50572
> I1017 12:37:25.301882 5674 http.cpp:976] Authorizing principal 'test-principal' to GET
the '/monitor/statistics' endpoint
> I1017 12:37:25.303724  5687 slave.cpp:869] Agent terminating
> [       OK ] Endpoint/SlaveEndpointTest.UnauthorizedRequest/0 (25 ms)
> [ RUN      ] Endpoint/SlaveEndpointTest.UnauthorizedRequest/1
> I1017 12:37:25.314155  5668 containerizer.cpp:292] Using isolation { environment_secret,
posix/cpu, posix/mem, filesystem/posix, network/cni }
> W1017 12:37:25.314687  5668 backend.cpp:76] Failed to create 'aufs' backend: AufsBackend
requires root privileges
> W1017 12:37:25.314791  5668 backend.cpp:76] Failed to create 'bind' backend: BindBackend
requires root privileges
> I1017 12:37:25.314821  5668 provisioner.cpp:255] Using default backend 'copy'
> I1017 12:37:25.318209  5681 slave.cpp:254] Mesos agent started on (824)@172.17.0.4:33017
> I1017 12:37:25.318234 5681 slave.cpp:255] Flags at startup: --acls="" --appc_simple_discovery_uri_prefix="http://"
--appc_store_dir="/tmp/Endpoint_SlaveEndpointTest_UnauthorizedRequest_1_hWX02V/store/appc"
--authenticate_http_readonly="true" --authenticate_http_readwrite="true" --authenticatee="crammd5"
--authentication_backoff_factor="1secs" --authorizer="local" --cgroups_cpu_enable_pids_and_tids_count="false"
--cgroups_enable_cfs="false" --cgroups_hierarchy="/sys/fs/cgroup" --cgroups_limit_swap="false"
--cgroups_root="mesos" --container_disk_watch_interval="15secs" --containerizers="mesos" --credential="/tmp/Endpoint_SlaveEndpointTest_UnauthorizedRequest_1_hWX02V/credential"
--default_role="*" --disallow_sharing_agent_pid_namespace="false" --disk_watch_interval="1mins"
--docker="docker" --docker_kill_orphans="true" --docker_registry="https://registry-1.docker.io"
--docker_remove_delay="6hrs" --docker_socket="/var/run/docker.sock" --docker_stop_timeout="0ns"
--docker_store_dir="/tmp/Endpoint_SlaveEndpointTest_UnauthorizedRequest_1_hWX02V/store/docker"
--docker_volume_checkpoint_dir="/var/run/mesos/isolators/docker/volume" --enforce_container_disk_quota="false"
--executor_registration_timeout="1mins" --executor_reregistration_timeout="2secs" --executor_shutdown_grace_period="5secs"
--fetcher_cache_dir="/tmp/Endpoint_SlaveEndpointTest_UnauthorizedRequest_1_hWX02V/fetch" --fetcher_cache_size="2GB"
--frameworks_home="" --gc_delay="1weeks" --gc_disk_headroom="0.1" --hadoop_home="" --help="false"
--hostname_lookup="true" --http_command_executor="false" --http_credentials="/tmp/Endpoint_SlaveEndpointTest_UnauthorizedRequest_1_hWX02V/http_credentials"
--http_heartbeat_interval="30secs" --initialize_driver_logging="true" --isolation="posix/cpu,posix/mem"
--launcher="posix" --launcher_dir="/mesos/mesos-1.5.0/_build/src" --logbufsecs="0" --logging_level="INFO"
--max_completed_executors_per_framework="150" --oversubscribed_resources_interval="15secs"
--perf_duration="10secs" --perf_interval="1mins" --port="5051" --qos_correction_interval_min="0ns"
--quiet="false" --recover="reconnect" --recovery_timeout="15mins" --registration_backoff_factor="10ms"
--resources="cpus:2;gpus:0;mem:1024;disk:1024;ports:[31000-32000]" --revocable_cpu_low_priority="true"
--runtime_dir="/tmp/Endpoint_SlaveEndpointTest_UnauthorizedRequest_1_hWX02V" --sandbox_directory="/mnt/mesos/sandbox"
--strict="true" --switch_user="true" --systemd_enable_support="true" --systemd_runtime_directory="/run/systemd/system"
--version="false" --work_dir="/tmp/Endpoint_SlaveEndpointTest_UnauthorizedRequest_1_3j4kds"
--zk_session_timeout="10secs"
> I1017 12:37:25.318603  5681 credentials.hpp:86] Loading credential for authentication
from '/tmp/Endpoint_SlaveEndpointTest_UnauthorizedRequest_1_hWX02V/credential'
> I1017 12:37:25.318737  5681 slave.cpp:287] Agent using credential for: test-principal
> I1017 12:37:25.318759  5681 credentials.hpp:37] Loading credentials for authentication
from '/tmp/Endpoint_SlaveEndpointTest_UnauthorizedRequest_1_hWX02V/http_credentials'
> I1017 12:37:25.318976  5681 http.cpp:1045] Creating default 'basic' HTTP authenticator
for realm 'mesos-agent-readonly'
> I1017 12:37:25.319118  5681 http.cpp:1045] Creating default 'basic' HTTP authenticator
for realm 'mesos-agent-readwrite'
> I1017 12:37:25.320461  5681 slave.cpp:585] Agent resources: [{"name":"cpus","scalar":{"value":2.0},"type":"SCALAR"},{"name":"mem","scalar":{"value":1024.0},"type":"SCALAR"},{"name":"disk","scalar":{"value":1024.0},"type":"SCALAR"},{"name":"ports","ranges":{"range":[{"begin":31000,"end":32000}]},"type":"RANGES"}]
> I1017 12:37:25.320678  5681 slave.cpp:593] Agent attributes: [  ]
> I1017 12:37:25.320690  5681 slave.cpp:602] Agent hostname: 0507f65a29af
> I1017 12:37:25.320830  5673 status_update_manager.cpp:177] Pausing sending status updates
> I1017 12:37:25.322044  5684 state.cpp:64] Recovering state from '/tmp/Endpoint_SlaveEndpointTest_UnauthorizedRequest_1_3j4kds/meta'
> I1017 12:37:25.322271  5677 status_update_manager.cpp:203] Recovering status update manager
> I1017 12:37:25.322460  5680 containerizer.cpp:649] Recovering containerizer
> I1017 12:37:25.323921  5679 provisioner.cpp:416] Provisioner recovery complete
> I1017 12:37:25.324308  5673 slave.cpp:6310] Finished recovery
> I1017 12:37:25.324682  5673 slave.cpp:6492] Querying resource estimator for oversubscribable
resources
> I1017 12:37:25.324913  5692 slave.cpp:6506] Received oversubscribable resources {} from
the resource estimator
> I1017 12:37:25.326906  5685 process.cpp:3929] Handling HTTP event for process 'slave(824)'
with path: '/slave(824)/monitor/statistics.json'
> I1017 12:37:25.328148  5686 http.cpp:1185] HTTP GET for /slave(824)/monitor/statistics.json
from 172.17.0.4:50574
> I1017 12:37:25.328210  5686 http.cpp:976] Authorizing principal 'test-principal' to GET
the '/monitor/statistics.json' endpoint
> I1017 12:37:25.329874  5680 slave.cpp:869] Agent terminating
> [       OK ] Endpoint/SlaveEndpointTest.UnauthorizedRequest/1 (26 ms)
> [ RUN      ] Endpoint/SlaveEndpointTest.UnauthorizedRequest/2
> I1017 12:37:25.340582  5668 containerizer.cpp:292] Using isolation { environment_secret,
posix/cpu, posix/mem, filesystem/posix, network/cni }
> W1017 12:37:25.341065  5668 backend.cpp:76] Failed to create 'aufs' backend: AufsBackend
requires root privileges
> W1017 12:37:25.341171  5668 backend.cpp:76] Failed to create 'bind' backend: BindBackend
requires root privileges
> I1017 12:37:25.341202  5668 provisioner.cpp:255] Using default backend 'copy'
> I1017 12:37:25.344593  5669 slave.cpp:254] Mesos agent started on (825)@172.17.0.4:33017
> I1017 12:37:25.344612  5669 slave.cpp:255] Flags at startup: --acls="" --appc_simple_discovery_uri_prefix="http://"
--appc_store_dir="/tmp/Endpoint_SlaveEndpointTest_UnauthorizedRequest_2_5G9gBR/store/appc"
--authenticate_http_readonly="true" --authenticate_http_readwrite="true" --authenticatee="crammd5"
--authentication_backoff_factor="1secs" --authorizer="local" --cgroups_cpu_enable_pids_and_tids_count="false"
--cgroups_enable_cfs="false" --cgroups_hierarchy="/sys/fs/cgroup" --cgroups_limit_swap="false"
--cgroups_root="mesos" --container_disk_watch_interval="15secs" --containerizers="mesos" --credential="/tmp/Endpoint_SlaveEndpointTest_UnauthorizedRequest_2_5G9gBR/credential"
--default_role="*" --disallow_sharing_agent_pid_namespace="false" --disk_watch_interval="1mins"
--docker="docker" --docker_kill_orphans="true" --docker_registry="https://registry-1.docker.io"
--docker_remove_delay="6hrs" --docker_socket="/var/run/docker.sock" --docker_stop_timeout="0ns"
--docker_store_dir="/tmp/Endpoint_SlaveEndpointTest_UnauthorizedRequest_2_5G9gBR/store/docker"
--docker_volume_checkpoint_dir="/var/run/mesos/isolators/docker/volume" --enforce_container_disk_quota="false"
--executor_registration_timeout="1mins" --executor_reregistration_timeout="2secs" --executor_shutdown_grace_period="5secs"
--fetcher_cache_dir="/tmp/Endpoint_SlaveEndpointTest_UnauthorizedRequest_2_5G9gBR/fetch" --fetcher_cache_size="2GB"
--frameworks_home="" --gc_delay="1weeks" --gc_disk_headroom="0.1" --hadoop_home="" --help="false"
--hostname_lookup="true" --http_command_executor="false" --http_credentials="/tmp/Endpoint_SlaveEndpointTest_UnauthorizedRequest_2_5G9gBR/http_credentials"
--http_heartbeat_interval="30secs" --initialize_driver_logging="true" --isolation="posix/cpu,posix/mem"
--launcher="posix" --launcher_dir="/mesos/mesos-1.5.0/_build/src" --logbufsecs="0" --logging_level="INFO"
--max_completed_executors_per_framework="150" --oversubscribed_resources_interval="15secs"
--perf_duration="10secs" --perf_interval="1mins" --port="5051" --qos_correction_interval_min="0ns"
--quiet="false" --recover="reconnect" --recovery_timeout="15mins" --registration_backoff_factor="10ms"
--resources="cpus:2;gpus:0;mem:1024;disk:1024;ports:[31000-32000]" --revocable_cpu_low_priority="true"
--runtime_dir="/tmp/Endpoint_SlaveEndpointTest_UnauthorizedRequest_2_5G9gBR" --sandbox_directory="/mnt/mesos/sandbox"
--strict="true" --switch_user="true" --systemd_enable_support="true" --systemd_runtime_directory="/run/systemd/system"
--version="false" --work_dir="/tmp/Endpoint_SlaveEndpointTest_UnauthorizedRequest_2_VJuDHn"
--zk_session_timeout="10secs"
> I1017 12:37:25.344961  5669 credentials.hpp:86] Loading credential for authentication
from '/tmp/Endpoint_SlaveEndpointTest_UnauthorizedRequest_2_5G9gBR/credential'
> I1017 12:37:25.345094  5669 slave.cpp:287] Agent using credential for: test-principal
> I1017 12:37:25.345116  5669 credentials.hpp:37] Loading credentials for authentication
from '/tmp/Endpoint_SlaveEndpointTest_UnauthorizedRequest_2_5G9gBR/http_credentials'
> I1017 12:37:25.345335  5669 http.cpp:1045] Creating default 'basic' HTTP authenticator
for realm 'mesos-agent-readonly'
> I1017 12:37:25.345474  5669 http.cpp:1045] Creating default 'basic' HTTP authenticator
for realm 'mesos-agent-readwrite'
> I1017 12:37:25.347177  5669 slave.cpp:585] Agent resources: [{"name":"cpus","scalar":{"value":2.0},"type":"SCALAR"},{"name":"mem","scalar":{"value":1024.0},"type":"SCALAR"},{"name":"disk","scalar":{"value":1024.0},"type":"SCALAR"},{"name":"ports","ranges":{"range":[{"begin":31000,"end":32000}]},"type":"RANGES"}]
> I1017 12:37:25.347573  5669 slave.cpp:593] Agent attributes: [  ]
> I1017 12:37:25.347610  5669 slave.cpp:602] Agent hostname: 0507f65a29af
> I1017 12:37:25.347765  5671 status_update_manager.cpp:177] Pausing sending status updates
> I1017 12:37:25.349082  5676 state.cpp:64] Recovering state from '/tmp/Endpoint_SlaveEndpointTest_UnauthorizedRequest_2_VJuDHn/meta'
> I1017 12:37:25.349381  5686 status_update_manager.cpp:203] Recovering status update manager
> I1017 12:37:25.349563  5691 containerizer.cpp:649] Recovering containerizer
> I1017 12:37:25.350831  5688 provisioner.cpp:416] Provisioner recovery complete
> I1017 12:37:25.351132  5671 slave.cpp:6310] Finished recovery
> I1017 12:37:25.351521  5671 slave.cpp:6492] Querying resource estimator for oversubscribable
resources
> I1017 12:37:25.351727  5680 slave.cpp:6506] Received oversubscribable resources {} from
the resource estimator
> I1017 12:37:25.353787  5678 process.cpp:3929] Handling HTTP event for process 'slave(825)'
with path: '/slave(825)/containers'
> I1017 12:37:25.355080  5670 http.cpp:1185] HTTP GET for /slave(825)/containers from 172.17.0.4:50576
> I1017 12:37:25.355145  5670 http.cpp:976] Authorizing principal 'test-principal' to GET
the '/containers' endpoint
> I1017 12:37:25.357631  5672 slave.cpp:869] Agent terminating
> [       OK ] Endpoint/SlaveEndpointTest.UnauthorizedRequest/2 (28 ms)
> [ RUN      ] Endpoint/SlaveEndpointTest.NoAuthorizer/0
> I1017 12:37:25.368463  5668 containerizer.cpp:292] Using isolation { environment_secret,
posix/cpu, posix/mem, filesystem/posix, network/cni }
> W1017 12:37:25.368939  5668 backend.cpp:76] Failed to create 'aufs' backend: AufsBackend
requires root privileges
> W1017 12:37:25.369045  5668 backend.cpp:76] Failed to create 'bind' backend: BindBackend
requires root privileges
> I1017 12:37:25.369076  5668 provisioner.cpp:255] Using default backend 'copy'
> I1017 12:37:25.370709  5668 cluster.cpp:448] Creating default 'local' authorizer
> I1017 12:37:25.372656  5673 slave.cpp:254] Mesos agent started on (826)@172.17.0.4:33017
> I1017 12:37:25.372679  5673 slave.cpp:255] Flags at startup: --acls="" --appc_simple_discovery_uri_prefix="http://"
--appc_store_dir="/tmp/Endpoint_SlaveEndpointTest_NoAuthorizer_0_xhCQpN/store/appc" --authenticate_http_readonly="true"
--authenticate_http_readwrite="true" --authenticatee="crammd5" --authentication_backoff_factor="1secs"
--authorizer="local" --cgroups_cpu_enable_pids_and_tids_count="false" --cgroups_enable_cfs="false"
--cgroups_hierarchy="/sys/fs/cgroup" --cgroups_limit_swap="false" --cgroups_root="mesos" --container_disk_watch_interval="15secs"
--containerizers="mesos" --credential="/tmp/Endpoint_SlaveEndpointTest_NoAuthorizer_0_xhCQpN/credential"
--default_role="*" --disallow_sharing_agent_pid_namespace="false" --disk_watch_interval="1mins"
--docker="docker" --docker_kill_orphans="true" --docker_registry="https://registry-1.docker.io"
--docker_remove_delay="6hrs" --docker_socket="/var/run/docker.sock" --docker_stop_timeout="0ns"
--docker_store_dir="/tmp/Endpoint_SlaveEndpointTest_NoAuthorizer_0_xhCQpN/store/docker" --docker_volume_checkpoint_dir="/var/run/mesos/isolators/docker/volume"
--enforce_container_disk_quota="false" --executor_registration_timeout="1mins" --executor_reregistration_timeout="2secs"
--executor_shutdown_grace_period="5secs" --fetcher_cache_dir="/tmp/Endpoint_SlaveEndpointTest_NoAuthorizer_0_xhCQpN/fetch"
--fetcher_cache_size="2GB" --frameworks_home="" --gc_delay="1weeks" --gc_disk_headroom="0.1"
--hadoop_home="" --help="false" --hostname_lookup="true" --http_command_executor="false" --http_credentials="/tmp/Endpoint_SlaveEndpointTest_NoAuthorizer_0_xhCQpN/http_credentials"
--http_heartbeat_interval="30secs" --initialize_driver_logging="true" --isolation="posix/cpu,posix/mem"
--launcher="posix" --launcher_dir="/mesos/mesos-1.5.0/_build/src" --logbufsecs="0" --logging_level="INFO"
--max_completed_executors_per_framework="150" --oversubscribed_resources_interval="15secs"
--perf_duration="10secs" --perf_interval="1mins" --port="5051" --qos_correction_interval_min="0ns"
--quiet="false" --recover="reconnect" --recovery_timeout="15mins" --registration_backoff_factor="10ms"
--resources="cpus:2;gpus:0;mem:1024;disk:1024;ports:[31000-32000]" --revocable_cpu_low_priority="true"
--runtime_dir="/tmp/Endpoint_SlaveEndpointTest_NoAuthorizer_0_xhCQpN" --sandbox_directory="/mnt/mesos/sandbox"
--strict="true" --switch_user="true" --systemd_enable_support="true" --systemd_runtime_directory="/run/systemd/system"
--version="false" --work_dir="/tmp/Endpoint_SlaveEndpointTest_NoAuthorizer_0_rru6rj" --zk_session_timeout="10secs"
> I1017 12:37:25.373039  5673 credentials.hpp:86] Loading credential for authentication
from '/tmp/Endpoint_SlaveEndpointTest_NoAuthorizer_0_xhCQpN/credential'
> I1017 12:37:25.373183  5673 slave.cpp:287] Agent using credential for: test-principal
> I1017 12:37:25.373206  5673 credentials.hpp:37] Loading credentials for authentication
from '/tmp/Endpoint_SlaveEndpointTest_NoAuthorizer_0_xhCQpN/http_credentials'
> I1017 12:37:25.373428  5673 http.cpp:1045] Creating default 'basic' HTTP authenticator
for realm 'mesos-agent-readonly'
> I1017 12:37:25.373574  5673 http.cpp:1045] Creating default 'basic' HTTP authenticator
for realm 'mesos-agent-readwrite'
> I1017 12:37:25.374971  5673 slave.cpp:585] Agent resources: [{"name":"cpus","scalar":{"value":2.0},"type":"SCALAR"},{"name":"mem","scalar":{"value":1024.0},"type":"SCALAR"},{"name":"disk","scalar":{"value":1024.0},"type":"SCALAR"},{"name":"ports","ranges":{"range":[{"begin":31000,"end":32000}]},"type":"RANGES"}]
> I1017 12:37:25.375195  5673 slave.cpp:593] Agent attributes: [  ]
> I1017 12:37:25.375208  5673 slave.cpp:602] Agent hostname: 0507f65a29af
> I1017 12:37:25.375334  5670 status_update_manager.cpp:177] Pausing sending status updates
> I1017 12:37:25.376569  5675 state.cpp:64] Recovering state from '/tmp/Endpoint_SlaveEndpointTest_NoAuthorizer_0_rru6rj/meta'
> I1017 12:37:25.376916  5686 status_update_manager.cpp:203] Recovering status update manager
> I1017 12:37:25.377104  5671 containerizer.cpp:649] Recovering containerizer
> I1017 12:37:25.378257  5681 provisioner.cpp:416] Provisioner recovery complete
> I1017 12:37:25.378587  5670 slave.cpp:6310] Finished recovery
> I1017 12:37:25.378989  5670 slave.cpp:6492] Querying resource estimator for oversubscribable
resources
> I1017 12:37:25.379223  5683 slave.cpp:6506] Received oversubscribable resources {} from
the resource estimator
> I1017 12:37:25.381279  5690 process.cpp:3929] Handling HTTP event for process 'slave(826)'
with path: '/slave(826)/monitor/statistics'
> I1017 12:37:25.382603  5674 http.cpp:1185] HTTP GET for /slave(826)/monitor/statistics
from 172.17.0.4:50578
> I1017 12:37:25.382664  5674 http.cpp:976] Authorizing principal 'test-principal' to GET
the '/monitor/statistics' endpoint
> I1017 12:37:25.385686  5668 slave.cpp:869] Agent terminating
> [       OK ] Endpoint/SlaveEndpointTest.NoAuthorizer/0 (28 ms)
> [ RUN      ] Endpoint/SlaveEndpointTest.NoAuthorizer/1
> I1017 12:37:25.396421  5668 containerizer.cpp:292] Using isolation { environment_secret,
posix/cpu, posix/mem, filesystem/posix, network/cni }
> W1017 12:37:25.396891  5668 backend.cpp:76] Failed to create 'aufs' backend: AufsBackend
requires root privileges
> W1017 12:37:25.396994  5668 backend.cpp:76] Failed to create 'bind' backend: BindBackend
requires root privileges
> I1017 12:37:25.397025  5668 provisioner.cpp:255] Using default backend 'copy'
> I1017 12:37:25.398622  5668 cluster.cpp:448] Creating default 'local' authorizer
> I1017 12:37:25.400461  5680 slave.cpp:254] Mesos agent started on (827)@172.17.0.4:33017
> I1017 12:37:25.400487  5680 slave.cpp:255] Flags at startup: --acls="" --appc_simple_discovery_uri_prefix="http://"
--appc_store_dir="/tmp/Endpoint_SlaveEndpointTest_NoAuthorizer_1_jnr1uJ/store/appc" --authenticate_http_readonly="true"
--authenticate_http_readwrite="true" --authenticatee="crammd5" --authentication_backoff_factor="1secs"
--authorizer="local" --cgroups_cpu_enable_pids_and_tids_count="false" --cgroups_enable_cfs="false"
--cgroups_hierarchy="/sys/fs/cgroup" --cgroups_limit_swap="false" --cgroups_root="mesos" --container_disk_watch_interval="15secs"
--containerizers="mesos" --credential="/tmp/Endpoint_SlaveEndpointTest_NoAuthorizer_1_jnr1uJ/credential"
--default_role="*" --disallow_sharing_agent_pid_namespace="false" --disk_watch_interval="1mins"
--docker="docker" --docker_kill_orphans="true" --docker_registry="https://registry-1.docker.io"
--docker_remove_delay="6hrs" --docker_socket="/var/run/docker.sock" --docker_stop_timeout="0ns"
--docker_store_dir="/tmp/Endpoint_SlaveEndpointTest_NoAuthorizer_1_jnr1uJ/store/docker" --docker_volume_checkpoint_dir="/var/run/mesos/isolators/docker/volume"
--enforce_container_disk_quota="false" --executor_registration_timeout="1mins" --executor_reregistration_timeout="2secs"
--executor_shutdown_grace_period="5secs" --fetcher_cache_dir="/tmp/Endpoint_SlaveEndpointTest_NoAuthorizer_1_jnr1uJ/fetch"
--fetcher_cache_size="2GB" --frameworks_home="" --gc_delay="1weeks" --gc_disk_headroom="0.1"
--hadoop_home="" --help="false" --hostname_lookup="true" --http_command_executor="false" --http_credentials="/tmp/Endpoint_SlaveEndpointTest_NoAuthorizer_1_jnr1uJ/http_credentials"
--http_heartbeat_interval="30secs" --initialize_driver_logging="true" --isolation="posix/cpu,posix/mem"
--launcher="posix" --launcher_dir="/mesos/mesos-1.5.0/_build/src" --logbufsecs="0" --logging_level="INFO"
--max_completed_executors_per_framework="150" --oversubscribed_resources_interval="15secs"
--perf_duration="10secs" --perf_interval="1mins" --port="5051" --qos_correction_interval_min="0ns"
--quiet="false" --recover="reconnect" --recovery_timeout="15mins" --registration_backoff_factor="10ms"
--resources="cpus:2;gpus:0;mem:1024;disk:1024;ports:[31000-32000]" --revocable_cpu_low_priority="true"
--runtime_dir="/tmp/Endpoint_SlaveEndpointTest_NoAuthorizer_1_jnr1uJ" --sandbox_directory="/mnt/mesos/sandbox"
--strict="true" --switch_user="true" --systemd_enable_support="true" --systemd_runtime_directory="/run/systemd/system"
--version="false" --work_dir="/tmp/Endpoint_SlaveEndpointTest_NoAuthorizer_1_pmN6sf" --zk_session_timeout="10secs"
> I1017 12:37:25.400835  5680 credentials.hpp:86] Loading credential for authentication
from '/tmp/Endpoint_SlaveEndpointTest_NoAuthorizer_1_jnr1uJ/credential'
> I1017 12:37:25.400974  5680 slave.cpp:287] Agent using credential for: test-principal
> I1017 12:37:25.400997  5680 credentials.hpp:37] Loading credentials for authentication
from '/tmp/Endpoint_SlaveEndpointTest_NoAuthorizer_1_jnr1uJ/http_credentials'
> I1017 12:37:25.401216  5680 http.cpp:1045] Creating default 'basic' HTTP authenticator
for realm 'mesos-agent-readonly'
> I1017 12:37:25.401355  5680 http.cpp:1045] Creating default 'basic' HTTP authenticator
for realm 'mesos-agent-readwrite'
> I1017 12:37:25.402703  5680 slave.cpp:585] Agent resources: [{"name":"cpus","scalar":{"value":2.0},"type":"SCALAR"},{"name":"mem","scalar":{"value":1024.0},"type":"SCALAR"},{"name":"disk","scalar":{"value":1024.0},"type":"SCALAR"},{"name":"ports","ranges":{"range":[{"begin":31000,"end":32000}]},"type":"RANGES"}]
> I1017 12:37:25.402921  5680 slave.cpp:593] Agent attributes: [  ]
> I1017 12:37:25.402936  5680 slave.cpp:602] Agent hostname: 0507f65a29af
> I1017 12:37:25.403062  5673 status_update_manager.cpp:177] Pausing sending status updates
> I1017 12:37:25.404268  5683 state.cpp:64] Recovering state from '/tmp/Endpoint_SlaveEndpointTest_NoAuthorizer_1_pmN6sf/meta'
> I1017 12:37:25.404541  5689 status_update_manager.cpp:203] Recovering status update manager
> I1017 12:37:25.404713  5690 containerizer.cpp:649] Recovering containerizer
> I1017 12:37:25.405972  5681 provisioner.cpp:416] Provisioner recovery complete
> I1017 12:37:25.406234  5673 slave.cpp:6310] Finished recovery
> I1017 12:37:25.406622  5673 slave.cpp:6492] Querying resource estimator for oversubscribable
resources
> I1017 12:37:25.406829  5677 slave.cpp:6506] Received oversubscribable resources {} from
the resource estimator
> I1017 12:37:25.408850  5685 process.cpp:3929] Handling HTTP event for process 'slave(827)'
with path: '/slave(827)/monitor/statistics.json'
> I1017 12:37:25.409939  5692 http.cpp:1185] HTTP GET for /slave(827)/monitor/statistics.json
from 172.17.0.4:50580
> I1017 12:37:25.410060  5692 http.cpp:976] Authorizing principal 'test-principal' to GET
the '/monitor/statistics.json' endpoint
> I1017 12:37:25.412683  5668 slave.cpp:869] Agent terminating
> [       OK ] Endpoint/SlaveEndpointTest.NoAuthorizer/1 (27 ms)
> [ RUN      ] Endpoint/SlaveEndpointTest.NoAuthorizer/2
> I1017 12:37:25.424173  5668 containerizer.cpp:292] Using isolation { environment_secret,
posix/cpu, posix/mem, filesystem/posix, network/cni }
> W1017 12:37:25.424643  5668 backend.cpp:76] Failed to create 'aufs' backend: AufsBackend
requires root privileges
> W1017 12:37:25.424746  5668 backend.cpp:76] Failed to create 'bind' backend: BindBackend
requires root privileges
> I1017 12:37:25.424775  5668 provisioner.cpp:255] Using default backend 'copy'
> I1017 12:37:25.426383  5668 cluster.cpp:448] Creating default 'local' authorizer
> I1017 12:37:25.428221  5691 slave.cpp:254] Mesos agent started on (828)@172.17.0.4:33017
> I1017 12:37:25.428251  5691 slave.cpp:255] Flags at startup: --acls="" --appc_simple_discovery_uri_prefix="http://"
--appc_store_dir="/tmp/Endpoint_SlaveEndpointTest_NoAuthorizer_2_LqQHQF/store/appc" --authenticate_http_readonly="true"
--authenticate_http_readwrite="true" --authenticatee="crammd5" --authentication_backoff_factor="1secs"
--authorizer="local" --cgroups_cpu_enable_pids_and_tids_count="false" --cgroups_enable_cfs="false"
--cgroups_hierarchy="/sys/fs/cgroup" --cgroups_limit_swap="false" --cgroups_root="mesos" --container_disk_watch_interval="15secs"
--containerizers="mesos" --credential="/tmp/Endpoint_SlaveEndpointTest_NoAuthorizer_2_LqQHQF/credential"
--default_role="*" --disallow_sharing_agent_pid_namespace="false" --disk_watch_interval="1mins"
--docker="docker" --docker_kill_orphans="true" --docker_registry="https://registry-1.docker.io"
--docker_remove_delay="6hrs" --docker_socket="/var/run/docker.sock" --docker_stop_timeout="0ns"
--docker_store_dir="/tmp/Endpoint_SlaveEndpointTest_NoAuthorizer_2_LqQHQF/store/docker" --docker_volume_checkpoint_dir="/var/run/mesos/isolators/docker/volume"
--enforce_container_disk_quota="false" --executor_registration_timeout="1mins" --executor_reregistration_timeout="2secs"
--executor_shutdown_grace_period="5secs" --fetcher_cache_dir="/tmp/Endpoint_SlaveEndpointTest_NoAuthorizer_2_LqQHQF/fetch"
--fetcher_cache_size="2GB" --frameworks_home="" --gc_delay="1weeks" --gc_disk_headroom="0.1"
--hadoop_home="" --help="false" --hostname_lookup="true" --http_command_executor="false" --http_credentials="/tmp/Endpoint_SlaveEndpointTest_NoAuthorizer_2_LqQHQF/http_credentials"
--http_heartbeat_interval="30secs" --initialize_driver_logging="true" --isolation="posix/cpu,posix/mem"
--launcher="posix" --launcher_dir="/mesos/mesos-1.5.0/_build/src" --logbufsecs="0" --logging_level="INFO"
--max_completed_executors_per_framework="150" --oversubscribed_resources_interval="15secs"
--perf_duration="10secs" --perf_interval="1mins" --port="5051" --qos_correction_interval_min="0ns"
--quiet="false" --recover="reconnect" --recovery_timeout="15mins" --registration_backoff_factor="10ms"
--resources="cpus:2;gpus:0;mem:1024;disk:1024;ports:[31000-32000]" --revocable_cpu_low_priority="true"
--runtime_dir="/tmp/Endpoint_SlaveEndpointTest_NoAuthorizer_2_LqQHQF" --sandbox_directory="/mnt/mesos/sandbox"
--strict="true" --switch_user="true" --systemd_enable_support="true" --systemd_runtime_directory="/run/systemd/system"
--version="false" --work_dir="/tmp/Endpoint_SlaveEndpointTest_NoAuthorizer_2_Rw2EKb" --zk_session_timeout="10secs"
> I1017 12:37:25.428602  5691 credentials.hpp:86] Loading credential for authentication
from '/tmp/Endpoint_SlaveEndpointTest_NoAuthorizer_2_LqQHQF/credential'
> I1017 12:37:25.428735  5691 slave.cpp:287] Agent using credential for: test-principal
> I1017 12:37:25.428756  5691 credentials.hpp:37] Loading credentials for authentication
from '/tmp/Endpoint_SlaveEndpointTest_NoAuthorizer_2_LqQHQF/http_credentials'
> I1017 12:37:25.428977  5691 http.cpp:1045] Creating default 'basic' HTTP authenticator
for realm 'mesos-agent-readonly'
> I1017 12:37:25.429121  5691 http.cpp:1045] Creating default 'basic' HTTP authenticator
for realm 'mesos-agent-readwrite'
> I1017 12:37:25.430472  5691 slave.cpp:585] Agent resources: [{"name":"cpus","scalar":{"value":2.0},"type":"SCALAR"},{"name":"mem","scalar":{"value":1024.0},"type":"SCALAR"},{"name":"disk","scalar":{"value":1024.0},"type":"SCALAR"},{"name":"ports","ranges":{"range":[{"begin":31000,"end":32000}]},"type":"RANGES"}]
> I1017 12:37:25.430693  5691 slave.cpp:593] Agent attributes: [  ]
> I1017 12:37:25.430706  5691 slave.cpp:602] Agent hostname: 0507f65a29af
> I1017 12:37:25.430836  5685 status_update_manager.cpp:177] Pausing sending status updates
> I1017 12:37:25.432086  5674 state.cpp:64] Recovering state from '/tmp/Endpoint_SlaveEndpointTest_NoAuthorizer_2_Rw2EKb/meta'
> I1017 12:37:25.432334  5673 status_update_manager.cpp:203] Recovering status update manager
> I1017 12:37:25.432500  5673 containerizer.cpp:649] Recovering containerizer
> I1017 12:37:25.433723  5679 provisioner.cpp:416] Provisioner recovery complete
> I1017 12:37:25.434074  5685 slave.cpp:6310] Finished recovery
> I1017 12:37:25.434456  5685 slave.cpp:6492] Querying resource estimator for oversubscribable
resources
> I1017 12:37:25.434662  5683 slave.cpp:6506] Received oversubscribable resources {} from
the resource estimator
> I1017 12:37:25.436630  5684 process.cpp:3929] Handling HTTP event for process 'slave(828)'
with path: '/slave(828)/containers'
> I1017 12:37:25.437674  5676 http.cpp:1185] HTTP GET for /slave(828)/containers from 172.17.0.4:50582
> I1017 12:37:25.437739  5676 http.cpp:976] Authorizing principal 'test-principal' to GET
the '/containers' endpoint
> I1017 12:37:25.440986  5668 slave.cpp:869] Agent terminating
> [       OK ] Endpoint/SlaveEndpointTest.NoAuthorizer/2 (27 ms)
> [----------] 9 tests from Endpoint/SlaveEndpointTest (261 ms total)
> 
> [----------] 2 tests from ContainerizerType/DefaultContainerDNSFlagTest
> [ RUN      ] ContainerizerType/DefaultContainerDNSFlagTest.ValidateFlag/0
> [       OK ] ContainerizerType/DefaultContainerDNSFlagTest.ValidateFlag/0 (10 ms)
> [ RUN      ] ContainerizerType/DefaultContainerDNSFlagTest.ValidateFlag/1
> [       OK ] ContainerizerType/DefaultContainerDNSFlagTest.ValidateFlag/1 (9 ms)
> [----------] 2 tests from ContainerizerType/DefaultContainerDNSFlagTest (19 ms total)
> 
> [----------] Global test environment tear-down
> [==========] 1696 tests from 185 test cases ran. (633965 ms total)
> [  PASSED  ] 1694 tests.
> [  FAILED  ] 2 tests, listed below:
> [  FAILED  ] MesosContainerizer/DefaultExecutorTest.ResourceLimitation/0, where GetParam()
= "mesos"
> [  FAILED  ] ContentType/SchedulerTest.ShutdownExecutor/0, where GetParam() = application/x-protobuf
> 
>  2 FAILED TESTS
>   YOU HAVE 21 DISABLED TESTS
> 
> I1017 12:37:25.530431  5693 process.cpp:1068] Failed to accept socket: future discarded
> make[4]: *** [check-local] Error 1
> make[4]: Leaving directory `/mesos/mesos-1.5.0/_build/src'
> make[3]: *** [check-am] Error 2
> make[3]: Leaving directory `/mesos/mesos-1.5.0/_build/src'
> make[2]: *** [check] Error 2
> make[2]: Leaving directory `/mesos/mesos-1.5.0/_build/src'
> make[1]: *** [check-recursive] Error 1
> make[1]: Leaving directory `/mesos/mesos-1.5.0/_build'
> make: *** [distcheck] Error 1
> + docker rmi mesos-1508240492-11059
> Untagged: mesos-1508240492-11059:latest
> Deleted: sha256:60711e1be62b3bd5ac190c5b5b50e7a6a60c1de6a39d88701dae7a8f3c8e8ce7
> Deleted: sha256:95910b167fe123790285873050343449ae9b02b22caeb770e27d9950e4d4e5ff
> Deleted: sha256:76c129d500804e8093741f66f3fa425c152993ae6736e82ad73b2395b745cac1
> Deleted: sha256:7298315d7e1d087f2d4f10895b893f95bbeb74704aa2feeea77989c41dec4812
> Deleted: sha256:b5fdee9574c835851c692df47c239bd55a6f33e6c1c9ed78cc899b000476db16
> Deleted: sha256:82b563423ec3dbb66a77252efe3fbae46691e51f841f7ee4f3a74778a0a7af4c
> Deleted: sha256:137c6ddbbb1efda8c3d43220190af28f0e32b9fe1e1f50fa6c51b6fabe2010e5
> Deleted: sha256:985961deb535bc12d444126ace8f2732bae5f9855bef0b7920dd06053bd095a9
> Deleted: sha256:138c65940819afbc66b4b3e2237b7c46ac5a3683105ac192428efccae63641b7
> Deleted: sha256:beefc88b11af26908de835d633c23d501b2ca736937141884b21278037525ada
> Deleted: sha256:ebb23a8d4be931c512cbde2b450c1a3509598dadd8f1a957e86bf54ba87aa2bb
> Deleted: sha256:d697a5ed8b5721e3e57712978e9268330d5757436863dbc3a0736a65f608ebec
> Deleted: sha256:0ad15a989917e951efef0e13b3b273b0a1592a5764d8c80c58179ce913240459
> Deleted: sha256:579f0a6babce35e375d2ad552924336372efb21aae35dace57e2f4a0636130f6
> Deleted: sha256:b75205bde21bab695cddfadb9c1c04edf58f8e1f5739b0185163765b33198f16
> Deleted: sha256:05182ee18a1d1681b530e69bb7ebcb8d990956431b8284a7a9098e24df5ad755
> Deleted: sha256:8b8953075b05c0b5950fcc4caef33dcb8192b07beb84434239cc5b76073a5f1b
> Deleted: sha256:c5f8c2a7229382eeb41e778b3c8835b3ef2d92279825480fe4948e9c261c7eb4
> Deleted: sha256:7645bf03864da7175bb65987cb6fecde7d2f3ba505f5bacc8220dab88f2a73ef
> Deleted: sha256:9f73150e71c42281b6a657361bbe53f694d2253dd1a5e73d092e85dc852d9254
> Deleted: sha256:fe71035fa6f34818d41eed57023aa87c115b8cd3f4cdb61c476e32727f41a4e2
> Deleted: sha256:20cb5bf2c16039c0dc3dd7c905a079bd7c12209739cd46ab5f9cc43df40b2c5b
> Deleted: sha256:271f900d8147645e42f5bf131d8a28cc136442caa294464ffc2fe9a5452296f7
> Deleted: sha256:8219be84e062dcd25e9b14e2f3ec9ade6a817703736a46bc8dcb1f5112e88093
> Deleted: sha256:a2c8e630933d8a5d713d56f283067f851a068eb51f5032506153be7d5b811204
> Deleted: sha256:2a4f398c08f906a98dfae9a1ed415b6ae7cb29afdaf6579efc8afc518ee82000
> Deleted: sha256:dc403d18e8d455dbedde4df2fc24d43cb0ea816dab35bd64b1e17e0a47833b26
> Deleted: sha256:7273fa419c205e546074a52d17cd640b8ec70b2f8c387af15c3c64dc4952f255
> Build step 'Execute shell' marked build as failure
> 
> 


Mime
View raw message