mesos-builds mailing list archives

Site index · List index
Message view « Date » · « Thread »
Top « Date » · « Thread »
From Apache Jenkins Server <jenk...@builds.apache.org>
Subject Build failed in Jenkins: Mesos-Reviewbot #19520
Date Sat, 23 Sep 2017 04:58:28 GMT
See <https://builds.apache.org/job/Mesos-Reviewbot/19520/display/redirect>

------------------------------------------
[...truncated 31.68 MB...]
I0923 04:58:22.628572  5813 credentials.hpp:37] Loading credentials for authentication from
'/tmp/Endpoint_SlaveEndpointTest_AuthorizedRequest_2_o2u5MV/http_credentials'
I0923 04:58:22.628792  5813 http.cpp:1045] Creating default 'basic' HTTP authenticator for
realm 'mesos-agent-readonly'
I0923 04:58:22.628957  5813 http.cpp:1045] Creating default 'basic' HTTP authenticator for
realm 'mesos-agent-readwrite'
I0923 04:58:22.630269  5813 slave.cpp:585] Agent resources: [{"name":"cpus","scalar":{"value":2.0},"type":"SCALAR"},{"name":"mem","scalar":{"value":1024.0},"type":"SCALAR"},{"name":"disk","scalar":{"value":1024.0},"type":"SCALAR"},{"name":"ports","ranges":{"range":[{"begin":31000,"end":32000}]},"type":"RANGES"}]
I0923 04:58:22.630509  5813 slave.cpp:593] Agent attributes: [  ]
I0923 04:58:22.630522  5813 slave.cpp:602] Agent hostname: 603651d6340e
I0923 04:58:22.630673  5805 status_update_manager.cpp:177] Pausing sending status updates
I0923 04:58:22.631968  5799 state.cpp:64] Recovering state from '/tmp/Endpoint_SlaveEndpointTest_AuthorizedRequest_2_pM7B6u/meta'
I0923 04:58:22.632261  5803 status_update_manager.cpp:203] Recovering status update manager
I0923 04:58:22.632441  5801 containerizer.cpp:648] Recovering containerizer
I0923 04:58:22.633956  5809 provisioner.cpp:416] Provisioner recovery complete
I0923 04:58:22.634317  5805 slave.cpp:6322] Finished recovery
I0923 04:58:22.634798  5805 slave.cpp:6504] Querying resource estimator for oversubscribable
resources
I0923 04:58:22.635048  5800 slave.cpp:6518] Received oversubscribable resources {} from the
resource estimator
I0923 04:58:22.637181  5795 process.cpp:3929] Handling HTTP event for process 'slave(811)'
with path: '/slave(811)/containers'
I0923 04:58:22.638454  5817 http.cpp:1185] HTTP GET for /slave(811)/containers from 172.17.0.2:47182
I0923 04:58:22.638582  5817 http.cpp:976] Authorizing principal 'test-principal' to GET the
'/containers' endpoint
I0923 04:58:22.642184  5808 slave.cpp:869] Agent terminating
[       OK ] Endpoint/SlaveEndpointTest.AuthorizedRequest/2 (28 ms)
[ RUN      ] Endpoint/SlaveEndpointTest.UnauthorizedRequest/0
I0923 04:58:22.652889  5775 containerizer.cpp:292] Using isolation { environment_secret, posix/cpu,
posix/mem, filesystem/posix, network/cni }
W0923 04:58:22.653352  5775 backend.cpp:76] Failed to create 'aufs' backend: AufsBackend requires
root privileges
W0923 04:58:22.653458  5775 backend.cpp:76] Failed to create 'bind' backend: BindBackend requires
root privileges
I0923 04:58:22.653487  5775 provisioner.cpp:255] Using default backend 'copy'
I0923 04:58:22.656766  5796 slave.cpp:254] Mesos agent started on (812)@172.17.0.2:37074
I0923 04:58:22.656791  5796 slave.cpp:255] Flags at startup: --acls="" --appc_simple_discovery_uri_prefix="http://"
--appc_store_dir="/tmp/Endpoint_SlaveEndpointTest_UnauthorizedRequest_0_6ihqLE/store/appc"
--authenticate_http_readonly="true" --authenticate_http_readwrite="true" --authenticatee="crammd5"
--authentication_backoff_factor="1secs" --authorizer="local" --cgroups_cpu_enable_pids_and_tids_count="false"
--cgroups_enable_cfs="false" --cgroups_hierarchy="/sys/fs/cgroup" --cgroups_limit_swap="false"
--cgroups_root="mesos" --container_disk_watch_interval="15secs" --containerizers="mesos" --credential="/tmp/Endpoint_SlaveEndpointTest_UnauthorizedRequest_0_6ihqLE/credential"
--default_role="*" --disallow_sharing_agent_pid_namespace="false" --disk_watch_interval="1mins"
--docker="docker" --docker_kill_orphans="true" --docker_registry="https://registry-1.docker.io"
--docker_remove_delay="6hrs" --docker_socket="/var/run/docker.sock" --docker_stop_timeout="0ns"
--docker_store_dir="/tmp/Endpoint_SlaveEndpointTest_UnauthorizedRequest_0_6ihqLE/store/docker"
--docker_volume_checkpoint_dir="/var/run/mesos/isolators/docker/volume" --enforce_container_disk_quota="false"
--executor_registration_timeout="1mins" --executor_reregistration_timeout="2secs" --executor_shutdown_grace_period="5secs"
--fetcher_cache_dir="/tmp/Endpoint_SlaveEndpointTest_UnauthorizedRequest_0_6ihqLE/fetch" --fetcher_cache_size="2GB"
--frameworks_home="" --gc_delay="1weeks" --gc_disk_headroom="0.1" --hadoop_home="" --help="false"
--hostname_lookup="true" --http_command_executor="false" --http_credentials="/tmp/Endpoint_SlaveEndpointTest_UnauthorizedRequest_0_6ihqLE/http_credentials"
--http_heartbeat_interval="30secs" --initialize_driver_logging="true" --isolation="posix/cpu,posix/mem"
--launcher="posix" --launcher_dir="/mesos/mesos-1.5.0/_build/src" --logbufsecs="0" --logging_level="INFO"
--max_completed_executors_per_framework="150" --oversubscribed_resources_interval="15secs"
--perf_duration="10secs" --perf_interval="1mins" --port="5051" --qos_correction_interval_min="0ns"
--quiet="false" --recover="reconnect" --recovery_timeout="15mins" --registration_backoff_factor="10ms"
--resources="cpus:2;gpus:0;mem:1024;disk:1024;ports:[31000-32000]" --revocable_cpu_low_priority="true"
--runtime_dir="/tmp/Endpoint_SlaveEndpointTest_UnauthorizedRequest_0_6ihqLE" --sandbox_directory="/mnt/mesos/sandbox"
--strict="true" --switch_user="true" --systemd_enable_support="true" --systemd_runtime_directory="/run/systemd/system"
--version="false" --work_dir="/tmp/Endpoint_SlaveEndpointTest_UnauthorizedRequest_0_JfeG0d"
--zk_session_timeout="10secs"
I0923 04:58:22.657151  5796 credentials.hpp:86] Loading credential for authentication from
'/tmp/Endpoint_SlaveEndpointTest_UnauthorizedRequest_0_6ihqLE/credential'
I0923 04:58:22.657312  5796 slave.cpp:287] Agent using credential for: test-principal
I0923 04:58:22.657333  5796 credentials.hpp:37] Loading credentials for authentication from
'/tmp/Endpoint_SlaveEndpointTest_UnauthorizedRequest_0_6ihqLE/http_credentials'
I0923 04:58:22.657557  5796 http.cpp:1045] Creating default 'basic' HTTP authenticator for
realm 'mesos-agent-readonly'
I0923 04:58:22.657699  5796 http.cpp:1045] Creating default 'basic' HTTP authenticator for
realm 'mesos-agent-readwrite'
I0923 04:58:22.659018  5796 slave.cpp:585] Agent resources: [{"name":"cpus","scalar":{"value":2.0},"type":"SCALAR"},{"name":"mem","scalar":{"value":1024.0},"type":"SCALAR"},{"name":"disk","scalar":{"value":1024.0},"type":"SCALAR"},{"name":"ports","ranges":{"range":[{"begin":31000,"end":32000}]},"type":"RANGES"}]
I0923 04:58:22.659238  5796 slave.cpp:593] Agent attributes: [  ]
I0923 04:58:22.659250  5796 slave.cpp:602] Agent hostname: 603651d6340e
I0923 04:58:22.659401  5809 status_update_manager.cpp:177] Pausing sending status updates
I0923 04:58:22.660688  5813 state.cpp:64] Recovering state from '/tmp/Endpoint_SlaveEndpointTest_UnauthorizedRequest_0_JfeG0d/meta'
I0923 04:58:22.660959  5802 status_update_manager.cpp:203] Recovering status update manager
I0923 04:58:22.661157  5800 containerizer.cpp:648] Recovering containerizer
I0923 04:58:22.662606  5804 provisioner.cpp:416] Provisioner recovery complete
I0923 04:58:22.663028  5804 slave.cpp:6322] Finished recovery
I0923 04:58:22.663548  5804 slave.cpp:6504] Querying resource estimator for oversubscribable
resources
I0923 04:58:22.663795  5801 slave.cpp:6518] Received oversubscribable resources {} from the
resource estimator
I0923 04:58:22.665884  5810 process.cpp:3929] Handling HTTP event for process 'slave(812)'
with path: '/slave(812)/monitor/statistics'
I0923 04:58:22.667078  5798 http.cpp:1185] HTTP GET for /slave(812)/monitor/statistics from
172.17.0.2:47184
I0923 04:58:22.667148  5798 http.cpp:976] Authorizing principal 'test-principal' to GET the
'/monitor/statistics' endpoint
I0923 04:58:22.669656  5817 slave.cpp:869] Agent terminating
[       OK ] Endpoint/SlaveEndpointTest.UnauthorizedRequest/0 (26 ms)
[ RUN      ] Endpoint/SlaveEndpointTest.UnauthorizedRequest/1
I0923 04:58:22.679857  5775 containerizer.cpp:292] Using isolation { environment_secret, posix/cpu,
posix/mem, filesystem/posix, network/cni }
W0923 04:58:22.680299  5775 backend.cpp:76] Failed to create 'aufs' backend: AufsBackend requires
root privileges
W0923 04:58:22.680399  5775 backend.cpp:76] Failed to create 'bind' backend: BindBackend requires
root privileges
I0923 04:58:22.680429  5775 provisioner.cpp:255] Using default backend 'copy'
I0923 04:58:22.683698  5796 slave.cpp:254] Mesos agent started on (813)@172.17.0.2:37074
I0923 04:58:22.683722  5796 slave.cpp:255] Flags at startup: --acls="" --appc_simple_discovery_uri_prefix="http://"
--appc_store_dir="/tmp/Endpoint_SlaveEndpointTest_UnauthorizedRequest_1_WrG6Zn/store/appc"
--authenticate_http_readonly="true" --authenticate_http_readwrite="true" --authenticatee="crammd5"
--authentication_backoff_factor="1secs" --authorizer="local" --cgroups_cpu_enable_pids_and_tids_count="false"
--cgroups_enable_cfs="false" --cgroups_hierarchy="/sys/fs/cgroup" --cgroups_limit_swap="false"
--cgroups_root="mesos" --container_disk_watch_interval="15secs" --containerizers="mesos" --credential="/tmp/Endpoint_SlaveEndpointTest_UnauthorizedRequest_1_WrG6Zn/credential"
--default_role="*" --disallow_sharing_agent_pid_namespace="false" --disk_watch_interval="1mins"
--docker="docker" --docker_kill_orphans="true" --docker_registry="https://registry-1.docker.io"
--docker_remove_delay="6hrs" --docker_socket="/var/run/docker.sock" --docker_stop_timeout="0ns"
--docker_store_dir="/tmp/Endpoint_SlaveEndpointTest_UnauthorizedRequest_1_WrG6Zn/store/docker"
--docker_volume_checkpoint_dir="/var/run/mesos/isolators/docker/volume" --enforce_container_disk_quota="false"
--executor_registration_timeout="1mins" --executor_reregistration_timeout="2secs" --executor_shutdown_grace_period="5secs"
--fetcher_cache_dir="/tmp/Endpoint_SlaveEndpointTest_UnauthorizedRequest_1_WrG6Zn/fetch" --fetcher_cache_size="2GB"
--frameworks_home="" --gc_delay="1weeks" --gc_disk_headroom="0.1" --hadoop_home="" --help="false"
--hostname_lookup="true" --http_command_executor="false" --http_credentials="/tmp/Endpoint_SlaveEndpointTest_UnauthorizedRequest_1_WrG6Zn/http_credentials"
--http_heartbeat_interval="30secs" --initialize_driver_logging="true" --isolation="posix/cpu,posix/mem"
--launcher="posix" --launcher_dir="/mesos/mesos-1.5.0/_build/src" --logbufsecs="0" --logging_level="INFO"
--max_completed_executors_per_framework="150" --oversubscribed_resources_interval="15secs"
--perf_duration="10secs" --perf_interval="1mins" --port="5051" --qos_correction_interval_min="0ns"
--quiet="false" --recover="reconnect" --recovery_timeout="15mins" --registration_backoff_factor="10ms"
--resources="cpus:2;gpus:0;mem:1024;disk:1024;ports:[31000-32000]" --revocable_cpu_low_priority="true"
--runtime_dir="/tmp/Endpoint_SlaveEndpointTest_UnauthorizedRequest_1_WrG6Zn" --sandbox_directory="/mnt/mesos/sandbox"
--strict="true" --switch_user="true" --systemd_enable_support="true" --systemd_runtime_directory="/run/systemd/system"
--version="false" --work_dir="/tmp/Endpoint_SlaveEndpointTest_UnauthorizedRequest_1_xSolbX"
--zk_session_timeout="10secs"
I0923 04:58:22.684056  5796 credentials.hpp:86] Loading credential for authentication from
'/tmp/Endpoint_SlaveEndpointTest_UnauthorizedRequest_1_WrG6Zn/credential'
I0923 04:58:22.684198  5796 slave.cpp:287] Agent using credential for: test-principal
I0923 04:58:22.684219  5796 credentials.hpp:37] Loading credentials for authentication from
'/tmp/Endpoint_SlaveEndpointTest_UnauthorizedRequest_1_WrG6Zn/http_credentials'
I0923 04:58:22.684440  5796 http.cpp:1045] Creating default 'basic' HTTP authenticator for
realm 'mesos-agent-readonly'
I0923 04:58:22.684587  5796 http.cpp:1045] Creating default 'basic' HTTP authenticator for
realm 'mesos-agent-readwrite'
I0923 04:58:22.685835  5796 slave.cpp:585] Agent resources: [{"name":"cpus","scalar":{"value":2.0},"type":"SCALAR"},{"name":"mem","scalar":{"value":1024.0},"type":"SCALAR"},{"name":"disk","scalar":{"value":1024.0},"type":"SCALAR"},{"name":"ports","ranges":{"range":[{"begin":31000,"end":32000}]},"type":"RANGES"}]
I0923 04:58:22.686056  5796 slave.cpp:593] Agent attributes: [  ]
I0923 04:58:22.686067  5796 slave.cpp:602] Agent hostname: 603651d6340e
I0923 04:58:22.686210  5800 status_update_manager.cpp:177] Pausing sending status updates
I0923 04:58:22.687441  5805 state.cpp:64] Recovering state from '/tmp/Endpoint_SlaveEndpointTest_UnauthorizedRequest_1_xSolbX/meta'
I0923 04:58:22.687707  5816 status_update_manager.cpp:203] Recovering status update manager
I0923 04:58:22.687877  5816 containerizer.cpp:648] Recovering containerizer
I0923 04:58:22.689102  5810 provisioner.cpp:416] Provisioner recovery complete
I0923 04:58:22.689457  5804 slave.cpp:6322] Finished recovery
I0923 04:58:22.689884  5804 slave.cpp:6504] Querying resource estimator for oversubscribable
resources
I0923 04:58:22.690143  5807 slave.cpp:6518] Received oversubscribable resources {} from the
resource estimator
I0923 04:58:22.692251  5814 process.cpp:3929] Handling HTTP event for process 'slave(813)'
with path: '/slave(813)/monitor/statistics.json'
I0923 04:58:22.693364  5803 http.cpp:1185] HTTP GET for /slave(813)/monitor/statistics.json
from 172.17.0.2:47186
I0923 04:58:22.693495  5803 http.cpp:976] Authorizing principal 'test-principal' to GET the
'/monitor/statistics.json' endpoint
I0923 04:58:22.695854  5775 slave.cpp:869] Agent terminating
[       OK ] Endpoint/SlaveEndpointTest.UnauthorizedRequest/1 (25 ms)
[ RUN      ] Endpoint/SlaveEndpointTest.UnauthorizedRequest/2
I0923 04:58:22.705960  5775 containerizer.cpp:292] Using isolation { environment_secret, posix/cpu,
posix/mem, filesystem/posix, network/cni }
W0923 04:58:22.706436  5775 backend.cpp:76] Failed to create 'aufs' backend: AufsBackend requires
root privileges
W0923 04:58:22.706538  5775 backend.cpp:76] Failed to create 'bind' backend: BindBackend requires
root privileges
I0923 04:58:22.706569  5775 provisioner.cpp:255] Using default backend 'copy'
I0923 04:58:22.709872  5817 slave.cpp:254] Mesos agent started on (814)@172.17.0.2:37074
I0923 04:58:22.709894  5817 slave.cpp:255] Flags at startup: --acls="" --appc_simple_discovery_uri_prefix="http://"
--appc_store_dir="/tmp/Endpoint_SlaveEndpointTest_UnauthorizedRequest_2_aUUpu7/store/appc"
--authenticate_http_readonly="true" --authenticate_http_readwrite="true" --authenticatee="crammd5"
--authentication_backoff_factor="1secs" --authorizer="local" --cgroups_cpu_enable_pids_and_tids_count="false"
--cgroups_enable_cfs="false" --cgroups_hierarchy="/sys/fs/cgroup" --cgroups_limit_swap="false"
--cgroups_root="mesos" --container_disk_watch_interval="15secs" --containerizers="mesos" --credential="/tmp/Endpoint_SlaveEndpointTest_UnauthorizedRequest_2_aUUpu7/credential"
--default_role="*" --disallow_sharing_agent_pid_namespace="false" --disk_watch_interval="1mins"
--docker="docker" --docker_kill_orphans="true" --docker_registry="https://registry-1.docker.io"
--docker_remove_delay="6hrs" --docker_socket="/var/run/docker.sock" --docker_stop_timeout="0ns"
--docker_store_dir="/tmp/Endpoint_SlaveEndpointTest_UnauthorizedRequest_2_aUUpu7/store/docker"
--docker_volume_checkpoint_dir="/var/run/mesos/isolators/docker/volume" --enforce_container_disk_quota="false"
--executor_registration_timeout="1mins" --executor_reregistration_timeout="2secs" --executor_shutdown_grace_period="5secs"
--fetcher_cache_dir="/tmp/Endpoint_SlaveEndpointTest_UnauthorizedRequest_2_aUUpu7/fetch" --fetcher_cache_size="2GB"
--frameworks_home="" --gc_delay="1weeks" --gc_disk_headroom="0.1" --hadoop_home="" --help="false"
--hostname_lookup="true" --http_command_executor="false" --http_credentials="/tmp/Endpoint_SlaveEndpointTest_UnauthorizedRequest_2_aUUpu7/http_credentials"
--http_heartbeat_interval="30secs" --initialize_driver_logging="true" --isolation="posix/cpu,posix/mem"
--launcher="posix" --launcher_dir="/mesos/mesos-1.5.0/_build/src" --logbufsecs="0" --logging_level="INFO"
--max_completed_executors_per_framework="150" --oversubscribed_resources_interval="15secs"
--perf_duration="10secs" --perf_interval="1mins" --port="5051" --qos_correction_interval_min="0ns"
--quiet="false" --recover="reconnect" --recovery_timeout="15mins" --registration_backoff_factor="10ms"
--resources="cpus:2;gpus:0;mem:1024;disk:1024;ports:[31000-32000]" --revocable_cpu_low_priority="true"
--runtime_dir="/tmp/Endpoint_SlaveEndpointTest_UnauthorizedRequest_2_aUUpu7" --sandbox_directory="/mnt/mesos/sandbox"
--strict="true" --switch_user="true" --systemd_enable_support="true" --systemd_runtime_directory="/run/systemd/system"
--version="false" --work_dir="/tmp/Endpoint_SlaveEndpointTest_UnauthorizedRequest_2_l7MKBG"
--zk_session_timeout="10secs"
I0923 04:58:22.710234  5817 credentials.hpp:86] Loading credential for authentication from
'/tmp/Endpoint_SlaveEndpointTest_UnauthorizedRequest_2_aUUpu7/credential'
I0923 04:58:22.710422  5817 slave.cpp:287] Agent using credential for: test-principal
I0923 04:58:22.710453  5817 credentials.hpp:37] Loading credentials for authentication from
'/tmp/Endpoint_SlaveEndpointTest_UnauthorizedRequest_2_aUUpu7/http_credentials'
I0923 04:58:22.710672  5817 http.cpp:1045] Creating default 'basic' HTTP authenticator for
realm 'mesos-agent-readonly'
I0923 04:58:22.710825  5817 http.cpp:1045] Creating default 'basic' HTTP authenticator for
realm 'mesos-agent-readwrite'
I0923 04:58:22.712123  5817 slave.cpp:585] Agent resources: [{"name":"cpus","scalar":{"value":2.0},"type":"SCALAR"},{"name":"mem","scalar":{"value":1024.0},"type":"SCALAR"},{"name":"disk","scalar":{"value":1024.0},"type":"SCALAR"},{"name":"ports","ranges":{"range":[{"begin":31000,"end":32000}]},"type":"RANGES"}]
I0923 04:58:22.712347  5817 slave.cpp:593] Agent attributes: [  ]
I0923 04:58:22.712358  5817 slave.cpp:602] Agent hostname: 603651d6340e
I0923 04:58:22.712479  5804 status_update_manager.cpp:177] Pausing sending status updates
I0923 04:58:22.713822  5811 state.cpp:64] Recovering state from '/tmp/Endpoint_SlaveEndpointTest_UnauthorizedRequest_2_l7MKBG/meta'
I0923 04:58:22.714223  5811 status_update_manager.cpp:203] Recovering status update manager
I0923 04:58:22.714530  5802 containerizer.cpp:648] Recovering containerizer
I0923 04:58:22.715714  5808 provisioner.cpp:416] Provisioner recovery complete
I0923 04:58:22.716089  5808 slave.cpp:6322] Finished recovery
I0923 04:58:22.716511  5808 slave.cpp:6504] Querying resource estimator for oversubscribable
resources
I0923 04:58:22.716727  5803 slave.cpp:6518] Received oversubscribable resources {} from the
resource estimator
I0923 04:58:22.718931  5809 process.cpp:3929] Handling HTTP event for process 'slave(814)'
with path: '/slave(814)/containers'
I0923 04:58:22.720226  5798 http.cpp:1185] HTTP GET for /slave(814)/containers from 172.17.0.2:47188
I0923 04:58:22.720291  5798 http.cpp:976] Authorizing principal 'test-principal' to GET the
'/containers' endpoint
I0923 04:58:22.722549  5775 slave.cpp:869] Agent terminating
[       OK ] Endpoint/SlaveEndpointTest.UnauthorizedRequest/2 (27 ms)
[ RUN      ] Endpoint/SlaveEndpointTest.NoAuthorizer/0
I0923 04:58:22.733512  5775 containerizer.cpp:292] Using isolation { environment_secret, posix/cpu,
posix/mem, filesystem/posix, network/cni }
W0923 04:58:22.733963  5775 backend.cpp:76] Failed to create 'aufs' backend: AufsBackend requires
root privileges
W0923 04:58:22.734062  5775 backend.cpp:76] Failed to create 'bind' backend: BindBackend requires
root privileges
I0923 04:58:22.734091  5775 provisioner.cpp:255] Using default backend 'copy'
I0923 04:58:22.735659  5775 cluster.cpp:448] Creating default 'local' authorizer
I0923 04:58:22.737530  5805 slave.cpp:254] Mesos agent started on (815)@172.17.0.2:37074
I0923 04:58:22.737556  5805 slave.cpp:255] Flags at startup: --acls="" --appc_simple_discovery_uri_prefix="http://"
--appc_store_dir="/tmp/Endpoint_SlaveEndpointTest_NoAuthorizer_0_irJSeR/store/appc" --authenticate_http_readonly="true"
--authenticate_http_readwrite="true" --authenticatee="crammd5" --authentication_backoff_factor="1secs"
--authorizer="local" --cgroups_cpu_enable_pids_and_tids_count="false" --cgroups_enable_cfs="false"
--cgroups_hierarchy="/sys/fs/cgroup" --cgroups_limit_swap="false" --cgroups_root="mesos" --container_disk_watch_interval="15secs"
--containerizers="mesos" --credential="/tmp/Endpoint_SlaveEndpointTest_NoAuthorizer_0_irJSeR/credential"
--default_role="*" --disallow_sharing_agent_pid_namespace="false" --disk_watch_interval="1mins"
--docker="docker" --docker_kill_orphans="true" --docker_registry="https://registry-1.docker.io"
--docker_remove_delay="6hrs" --docker_socket="/var/run/docker.sock" --docker_stop_timeout="0ns"
--docker_store_dir="/tmp/Endpoint_SlaveEndpointTest_NoAuthorizer_0_irJSeR/store/docker" --docker_volume_checkpoint_dir="/var/run/mesos/isolators/docker/volume"
--enforce_container_disk_quota="false" --executor_registration_timeout="1mins" --executor_reregistration_timeout="2secs"
--executor_shutdown_grace_period="5secs" --fetcher_cache_dir="/tmp/Endpoint_SlaveEndpointTest_NoAuthorizer_0_irJSeR/fetch"
--fetcher_cache_size="2GB" --frameworks_home="" --gc_delay="1weeks" --gc_disk_headroom="0.1"
--hadoop_home="" --help="false" --hostname_lookup="true" --http_command_executor="false" --http_credentials="/tmp/Endpoint_SlaveEndpointTest_NoAuthorizer_0_irJSeR/http_credentials"
--http_heartbeat_interval="30secs" --initialize_driver_logging="true" --isolation="posix/cpu,posix/mem"
--launcher="posix" --launcher_dir="/mesos/mesos-1.5.0/_build/src" --logbufsecs="0" --logging_level="INFO"
--max_completed_executors_per_framework="150" --oversubscribed_resources_interval="15secs"
--perf_duration="10secs" --perf_interval="1mins" --port="5051" --qos_correction_interval_min="0ns"
--quiet="false" --recover="reconnect" --recovery_timeout="15mins" --registration_backoff_factor="10ms"
--resources="cpus:2;gpus:0;mem:1024;disk:1024;ports:[31000-32000]" --revocable_cpu_low_priority="true"
--runtime_dir="/tmp/Endpoint_SlaveEndpointTest_NoAuthorizer_0_irJSeR" --sandbox_directory="/mnt/mesos/sandbox"
--strict="true" --switch_user="true" --systemd_enable_support="true" --systemd_runtime_directory="/run/systemd/system"
--version="false" --work_dir="/tmp/Endpoint_SlaveEndpointTest_NoAuthorizer_0_DtM9hq" --zk_session_timeout="10secs"
I0923 04:58:22.737915  5805 credentials.hpp:86] Loading credential for authentication from
'/tmp/Endpoint_SlaveEndpointTest_NoAuthorizer_0_irJSeR/credential'
I0923 04:58:22.738070  5805 slave.cpp:287] Agent using credential for: test-principal
I0923 04:58:22.738091  5805 credentials.hpp:37] Loading credentials for authentication from
'/tmp/Endpoint_SlaveEndpointTest_NoAuthorizer_0_irJSeR/http_credentials'
I0923 04:58:22.738312  5805 http.cpp:1045] Creating default 'basic' HTTP authenticator for
realm 'mesos-agent-readonly'
I0923 04:58:22.738471  5805 http.cpp:1045] Creating default 'basic' HTTP authenticator for
realm 'mesos-agent-readwrite'
I0923 04:58:22.739761  5805 slave.cpp:585] Agent resources: [{"name":"cpus","scalar":{"value":2.0},"type":"SCALAR"},{"name":"mem","scalar":{"value":1024.0},"type":"SCALAR"},{"name":"disk","scalar":{"value":1024.0},"type":"SCALAR"},{"name":"ports","ranges":{"range":[{"begin":31000,"end":32000}]},"type":"RANGES"}]
I0923 04:58:22.739982  5805 slave.cpp:593] Agent attributes: [  ]
I0923 04:58:22.739995  5805 slave.cpp:602] Agent hostname: 603651d6340e
I0923 04:58:22.740140  5809 status_update_manager.cpp:177] Pausing sending status updates
I0923 04:58:22.741451  5806 state.cpp:64] Recovering state from '/tmp/Endpoint_SlaveEndpointTest_NoAuthorizer_0_DtM9hq/meta'
I0923 04:58:22.741755  5804 status_update_manager.cpp:203] Recovering status update manager
I0923 04:58:22.741931  5794 containerizer.cpp:648] Recovering containerizer
I0923 04:58:22.743237  5796 provisioner.cpp:416] Provisioner recovery complete
I0923 04:58:22.743604  5796 slave.cpp:6322] Finished recovery
I0923 04:58:22.744029  5796 slave.cpp:6504] Querying resource estimator for oversubscribable
resources
I0923 04:58:22.744273  5806 slave.cpp:6518] Received oversubscribable resources {} from the
resource estimator
I0923 04:58:22.746376  5797 process.cpp:3929] Handling HTTP event for process 'slave(815)'
with path: '/slave(815)/monitor/statistics'
I0923 04:58:22.747519  5801 http.cpp:1185] HTTP GET for /slave(815)/monitor/statistics from
172.17.0.2:47190
I0923 04:58:22.747584  5801 http.cpp:976] Authorizing principal 'test-principal' to GET the
'/monitor/statistics' endpoint
I0923 04:58:22.751269  5805 slave.cpp:869] Agent terminating
[       OK ] Endpoint/SlaveEndpointTest.NoAuthorizer/0 (28 ms)
[ RUN      ] Endpoint/SlaveEndpointTest.NoAuthorizer/1
I0923 04:58:22.761502  5775 containerizer.cpp:292] Using isolation { environment_secret, posix/cpu,
posix/mem, filesystem/posix, network/cni }
W0923 04:58:22.761953  5775 backend.cpp:76] Failed to create 'aufs' backend: AufsBackend requires
root privileges
W0923 04:58:22.762055  5775 backend.cpp:76] Failed to create 'bind' backend: BindBackend requires
root privileges
I0923 04:58:22.762085  5775 provisioner.cpp:255] Using default backend 'copy'
I0923 04:58:22.763664  5775 cluster.cpp:448] Creating default 'local' authorizer
I0923 04:58:22.765488  5817 slave.cpp:254] Mesos agent started on (816)@172.17.0.2:37074
I0923 04:58:22.765513  5817 slave.cpp:255] Flags at startup: --acls="" --appc_simple_discovery_uri_prefix="http://"
--appc_store_dir="/tmp/Endpoint_SlaveEndpointTest_NoAuthorizer_1_aIAXfB/store/appc" --authenticate_http_readonly="true"
--authenticate_http_readwrite="true" --authenticatee="crammd5" --authentication_backoff_factor="1secs"
--authorizer="local" --cgroups_cpu_enable_pids_and_tids_count="false" --cgroups_enable_cfs="false"
--cgroups_hierarchy="/sys/fs/cgroup" --cgroups_limit_swap="false" --cgroups_root="mesos" --container_disk_watch_interval="15secs"
--containerizers="mesos" --credential="/tmp/Endpoint_SlaveEndpointTest_NoAuthorizer_1_aIAXfB/credential"
--default_role="*" --disallow_sharing_agent_pid_namespace="false" --disk_watch_interval="1mins"
--docker="docker" --docker_kill_orphans="true" --docker_registry="https://registry-1.docker.io"
--docker_remove_delay="6hrs" --docker_socket="/var/run/docker.sock" --docker_stop_timeout="0ns"
--docker_store_dir="/tmp/Endpoint_SlaveEndpointTest_NoAuthorizer_1_aIAXfB/store/docker" --docker_volume_checkpoint_dir="/var/run/mesos/isolators/docker/volume"
--enforce_container_disk_quota="false" --executor_registration_timeout="1mins" --executor_reregistration_timeout="2secs"
--executor_shutdown_grace_period="5secs" --fetcher_cache_dir="/tmp/Endpoint_SlaveEndpointTest_NoAuthorizer_1_aIAXfB/fetch"
--fetcher_cache_size="2GB" --frameworks_home="" --gc_delay="1weeks" --gc_disk_headroom="0.1"
--hadoop_home="" --help="false" --hostname_lookup="true" --http_command_executor="false" --http_credentials="/tmp/Endpoint_SlaveEndpointTest_NoAuthorizer_1_aIAXfB/http_credentials"
--http_heartbeat_interval="30secs" --initialize_driver_logging="true" --isolation="posix/cpu,posix/mem"
--launcher="posix" --launcher_dir="/mesos/mesos-1.5.0/_build/src" --logbufsecs="0" --logging_level="INFO"
--max_completed_executors_per_framework="150" --oversubscribed_resources_interval="15secs"
--perf_duration="10secs" --perf_interval="1mins" --port="5051" --qos_correction_interval_min="0ns"
--quiet="false" --recover="reconnect" --recovery_timeout="15mins" --registration_backoff_factor="10ms"
--resources="cpus:2;gpus:0;mem:1024;disk:1024;ports:[31000-32000]" --revocable_cpu_low_priority="true"
--runtime_dir="/tmp/Endpoint_SlaveEndpointTest_NoAuthorizer_1_aIAXfB" --sandbox_directory="/mnt/mesos/sandbox"
--strict="true" --switch_user="true" --systemd_enable_support="true" --systemd_runtime_directory="/run/systemd/system"
--version="false" --work_dir="/tmp/Endpoint_SlaveEndpointTest_NoAuthorizer_1_vY23ea" --zk_session_timeout="10secs"
I0923 04:58:22.765856  5817 credentials.hpp:86] Loading credential for authentication from
'/tmp/Endpoint_SlaveEndpointTest_NoAuthorizer_1_aIAXfB/credential'
I0923 04:58:22.766005  5817 slave.cpp:287] Agent using credential for: test-principal
I0923 04:58:22.766031  5817 credentials.hpp:37] Loading credentials for authentication from
'/tmp/Endpoint_SlaveEndpointTest_NoAuthorizer_1_aIAXfB/http_credentials'
I0923 04:58:22.766258  5817 http.cpp:1045] Creating default 'basic' HTTP authenticator for
realm 'mesos-agent-readonly'
I0923 04:58:22.766428  5817 http.cpp:1045] Creating default 'basic' HTTP authenticator for
realm 'mesos-agent-readwrite'
I0923 04:58:22.767699  5817 slave.cpp:585] Agent resources: [{"name":"cpus","scalar":{"value":2.0},"type":"SCALAR"},{"name":"mem","scalar":{"value":1024.0},"type":"SCALAR"},{"name":"disk","scalar":{"value":1024.0},"type":"SCALAR"},{"name":"ports","ranges":{"range":[{"begin":31000,"end":32000}]},"type":"RANGES"}]
I0923 04:58:22.767922  5817 slave.cpp:593] Agent attributes: [  ]
I0923 04:58:22.767935  5817 slave.cpp:602] Agent hostname: 603651d6340e
I0923 04:58:22.768065  5809 status_update_manager.cpp:177] Pausing sending status updates
I0923 04:58:22.769341  5805 state.cpp:64] Recovering state from '/tmp/Endpoint_SlaveEndpointTest_NoAuthorizer_1_vY23ea/meta'
I0923 04:58:22.769609  5795 status_update_manager.cpp:203] Recovering status update manager
I0923 04:58:22.769776  5795 containerizer.cpp:648] Recovering containerizer
I0923 04:58:22.771023  5804 provisioner.cpp:416] Provisioner recovery complete
I0923 04:58:22.771468  5806 slave.cpp:6322] Finished recovery
I0923 04:58:22.771930  5806 slave.cpp:6504] Querying resource estimator for oversubscribable
resources
I0923 04:58:22.772220  5802 slave.cpp:6518] Received oversubscribable resources {} from the
resource estimator
I0923 04:58:22.774278  5797 process.cpp:3929] Handling HTTP event for process 'slave(816)'
with path: '/slave(816)/monitor/statistics.json'
I0923 04:58:22.776082  5794 http.cpp:1185] HTTP GET for /slave(816)/monitor/statistics.json
from 172.17.0.2:47192
I0923 04:58:22.776206  5794 http.cpp:976] Authorizing principal 'test-principal' to GET the
'/monitor/statistics.json' endpoint
I0923 04:58:22.779211  5775 slave.cpp:869] Agent terminating
[       OK ] Endpoint/SlaveEndpointTest.NoAuthorizer/1 (28 ms)
[ RUN      ] Endpoint/SlaveEndpointTest.NoAuthorizer/2
I0923 04:58:22.789758  5775 containerizer.cpp:292] Using isolation { environment_secret, posix/cpu,
posix/mem, filesystem/posix, network/cni }
W0923 04:58:22.790237  5775 backend.cpp:76] Failed to create 'aufs' backend: AufsBackend requires
root privileges
W0923 04:58:22.790356  5775 backend.cpp:76] Failed to create 'bind' backend: BindBackend requires
root privileges
I0923 04:58:22.790402  5775 provisioner.cpp:255] Using default backend 'copy'
I0923 04:58:22.791972  5775 cluster.cpp:448] Creating default 'local' authorizer
I0923 04:58:22.793779  5805 slave.cpp:254] Mesos agent started on (817)@172.17.0.2:37074
I0923 04:58:22.793804  5805 slave.cpp:255] Flags at startup: --acls="" --appc_simple_discovery_uri_prefix="http://"
--appc_store_dir="/tmp/Endpoint_SlaveEndpointTest_NoAuthorizer_2_scuNxl/store/appc" --authenticate_http_readonly="true"
--authenticate_http_readwrite="true" --authenticatee="crammd5" --authentication_backoff_factor="1secs"
--authorizer="local" --cgroups_cpu_enable_pids_and_tids_count="false" --cgroups_enable_cfs="false"
--cgroups_hierarchy="/sys/fs/cgroup" --cgroups_limit_swap="false" --cgroups_root="mesos" --container_disk_watch_interval="15secs"
--containerizers="mesos" --credential="/tmp/Endpoint_SlaveEndpointTest_NoAuthorizer_2_scuNxl/credential"
--default_role="*" --disallow_sharing_agent_pid_namespace="false" --disk_watch_interval="1mins"
--docker="docker" --docker_kill_orphans="true" --docker_registry="https://registry-1.docker.io"
--docker_remove_delay="6hrs" --docker_socket="/var/run/docker.sock" --docker_stop_timeout="0ns"
--docker_store_dir="/tmp/Endpoint_SlaveEndpointTest_NoAuthorizer_2_scuNxl/store/docker" --docker_volume_checkpoint_dir="/var/run/mesos/isolators/docker/volume"
--enforce_container_disk_quota="false" --executor_registration_timeout="1mins" --executor_reregistration_timeout="2secs"
--executor_shutdown_grace_period="5secs" --fetcher_cache_dir="/tmp/Endpoint_SlaveEndpointTest_NoAuthorizer_2_scuNxl/fetch"
--fetcher_cache_size="2GB" --frameworks_home="" --gc_delay="1weeks" --gc_disk_headroom="0.1"
--hadoop_home="" --help="false" --hostname_lookup="true" --http_command_executor="false" --http_credentials="/tmp/Endpoint_SlaveEndpointTest_NoAuthorizer_2_scuNxl/http_credentials"
--http_heartbeat_interval="30secs" --initialize_driver_logging="true" --isolation="posix/cpu,posix/mem"
--launcher="posix" --launcher_dir="/mesos/mesos-1.5.0/_build/src" --logbufsecs="0" --logging_level="INFO"
--max_completed_executors_per_framework="150" --oversubscribed_resources_interval="15secs"
--perf_duration="10secs" --perf_interval="1mins" --port="5051" --qos_correction_interval_min="0ns"
--quiet="false" --recover="reconnect" --recovery_timeout="15mins" --registration_backoff_factor="10ms"
--resources="cpus:2;gpus:0;mem:1024;disk:1024;ports:[31000-32000]" --revocable_cpu_low_priority="true"
--runtime_dir="/tmp/Endpoint_SlaveEndpointTest_NoAuthorizer_2_scuNxl" --sandbox_directory="/mnt/mesos/sandbox"
--strict="true" --switch_user="true" --systemd_enable_support="true" --systemd_runtime_directory="/run/systemd/system"
--version="false" --work_dir="/tmp/Endpoint_SlaveEndpointTest_NoAuthorizer_2_xqjHsU" --zk_session_timeout="10secs"
I0923 04:58:22.794154  5805 credentials.hpp:86] Loading credential for authentication from
'/tmp/Endpoint_SlaveEndpointTest_NoAuthorizer_2_scuNxl/credential'
I0923 04:58:22.794298  5805 slave.cpp:287] Agent using credential for: test-principal
I0923 04:58:22.794320  5805 credentials.hpp:37] Loading credentials for authentication from
'/tmp/Endpoint_SlaveEndpointTest_NoAuthorizer_2_scuNxl/http_credentials'
I0923 04:58:22.794555  5805 http.cpp:1045] Creating default 'basic' HTTP authenticator for
realm 'mesos-agent-readonly'
I0923 04:58:22.794705  5805 http.cpp:1045] Creating default 'basic' HTTP authenticator for
realm 'mesos-agent-readwrite'
I0923 04:58:22.796001  5805 slave.cpp:585] Agent resources: [{"name":"cpus","scalar":{"value":2.0},"type":"SCALAR"},{"name":"mem","scalar":{"value":1024.0},"type":"SCALAR"},{"name":"disk","scalar":{"value":1024.0},"type":"SCALAR"},{"name":"ports","ranges":{"range":[{"begin":31000,"end":32000}]},"type":"RANGES"}]
I0923 04:58:22.796223  5805 slave.cpp:593] Agent attributes: [  ]
I0923 04:58:22.796237  5805 slave.cpp:602] Agent hostname: 603651d6340e
I0923 04:58:22.796363  5817 status_update_manager.cpp:177] Pausing sending status updates
I0923 04:58:22.797590  5807 state.cpp:64] Recovering state from '/tmp/Endpoint_SlaveEndpointTest_NoAuthorizer_2_xqjHsU/meta'
I0923 04:58:22.797844  5807 status_update_manager.cpp:203] Recovering status update manager
I0923 04:58:22.798008  5801 containerizer.cpp:648] Recovering containerizer
I0923 04:58:22.799185  5816 provisioner.cpp:416] Provisioner recovery complete
I0923 04:58:22.799515  5817 slave.cpp:6322] Finished recovery
I0923 04:58:22.799931  5817 slave.cpp:6504] Querying resource estimator for oversubscribable
resources
I0923 04:58:22.800176  5812 slave.cpp:6518] Received oversubscribable resources {} from the
resource estimator
I0923 04:58:22.802273  5796 process.cpp:3929] Handling HTTP event for process 'slave(817)'
with path: '/slave(817)/containers'
I0923 04:58:22.803380  5800 http.cpp:1185] HTTP GET for /slave(817)/containers from 172.17.0.2:47194
I0923 04:58:22.803442  5800 http.cpp:976] Authorizing principal 'test-principal' to GET the
'/containers' endpoint
I0923 04:58:22.806963  5775 slave.cpp:869] Agent terminating
[       OK ] Endpoint/SlaveEndpointTest.NoAuthorizer/2 (28 ms)
[----------] 9 tests from Endpoint/SlaveEndpointTest (254 ms total)

[----------] 2 tests from ContainerizerType/DefaultContainerDNSFlagTest
[ RUN      ] ContainerizerType/DefaultContainerDNSFlagTest.ValidateFlag/0
[       OK ] ContainerizerType/DefaultContainerDNSFlagTest.ValidateFlag/0 (10 ms)
[ RUN      ] ContainerizerType/DefaultContainerDNSFlagTest.ValidateFlag/1
[       OK ] ContainerizerType/DefaultContainerDNSFlagTest.ValidateFlag/1 (9 ms)
[----------] 2 tests from ContainerizerType/DefaultContainerDNSFlagTest (19 ms total)

[----------] Global test environment tear-down
[==========] 1676 tests from 184 test cases ran. (635151 ms total)
[  PASSED  ] 1675 tests.
[  FAILED  ] 1 test, listed below:
[  FAILED  ] ExamplesTest.PythonFramework

 1 FAILED TEST
  YOU HAVE 20 DISABLED TESTS

I0923 04:58:22.890699  5818 process.cpp:1068] Failed to accept socket: future discarded
make[4]: *** [check-local] Error 1
make[4]: Leaving directory `/mesos/mesos-1.5.0/_build/src'
make[3]: *** [check-am] Error 2
make[3]: Leaving directory `/mesos/mesos-1.5.0/_build/src'
make[2]: *** [check] Error 2
make[2]: Leaving directory `/mesos/mesos-1.5.0/_build/src'
make[1]: *** [check-recursive] Error 1
make[1]: Leaving directory `/mesos/mesos-1.5.0/_build'
make: *** [distcheck] Error 1
+ docker rmi mesos-1506139288-14608
Untagged: mesos-1506139288-14608:latest
Deleted: sha256:d78d50e82b1cb282c812bd613daaf80ff40c2c3f9d4ac94589fbe27fcbbf4e71
Deleted: sha256:9783538b74622455b8048a313522850ba1d7bf832bd18f4e82089af29f046e23
Deleted: sha256:7fe88dba690ab51e9a29e1d3cc70d40b15288011017a05c6bede618671ecb73d
Deleted: sha256:e01bd1f983a976d2ad0c02d848f888d091168d8a8c1321ae62cebb5baf64319e
Deleted: sha256:1b4ee6b197c5f484e971aa988abf4e803bb910762db4df2b8e07e35f816470a5
Deleted: sha256:922f0132aa09878a38f9cccbe2503a062022bc13ad11632d71a9edcc6952a3e3
Deleted: sha256:7589c914fb56a6612c18626208f0733eb984252c0321c9ae7ef717889f224cda
Deleted: sha256:9026c1ce4cf6b803096c059e17f6f1371ed03a4664d93bcdc4a8b43887aa3569
Deleted: sha256:168501a7b65b48826e7ad4b62ab328d26a76561cf0dfbaf2f2ef8b3dcac9f707
Deleted: sha256:f6faa359be2a826433cefb1e7cbe2054874f275d040df755baa7e50030ea09ce
Deleted: sha256:29bb10f38a50d9147ccd4eabc0a03fef16072e0b2ff3bb2ee36d8e19ec37e8ac
Deleted: sha256:5b21fd6e219fbebe459b196de9d75f4a591e59c3ada40d9c57fa49e8eae5c7ef
Deleted: sha256:26c6901326f249712fb72585219d08fa9d04f6945beeddeef6d1c7cf044c62b3
Deleted: sha256:a317196645b60dd72c0b3f9c440d95be0bb3de8b55ada4b4810ace9b81b6092e
Deleted: sha256:212483de6df85bcb89ab98049b302ff9369479d45b488ebdf77ccd63d40d2f59
Deleted: sha256:e76d6c10113b00631ef57c830a2a3bab184fcddc6ac4b758e327993756ca319c
Deleted: sha256:df379aa5ff0d61bfd972b2f93fce07e5b73caf95d9e570483707bff3cafff829
Deleted: sha256:7ed4dd74596e52a82e307bbf8a5197f7d8f77c1706bffd49028c8ffe17bd1cec
Deleted: sha256:ae6d3355b89d1f28a9165550dc63705174f07a224a1f87301bf7ec3222e36ba7
Deleted: sha256:095c570358ffa6d28eb6a8e4c3dbf205272761efbf31d0b01308c9c139bf6dd8
Deleted: sha256:29b62e03ab291098117d4e1ea6c493906bb26d71b28b0ac2dbc155cbb94bec4b
Deleted: sha256:d6c89bea345e81bc395a043795e4aee039689f036c9e3dc2e7688544c08e9b62
Deleted: sha256:d5fadbfb915bcbb9d57f5809196ac4ec58310cadafcfd5a0882a4db931ee635a
Deleted: sha256:f599924c8aff2193985f4cc59b3daab5e6c98875bd9dc4209b262d57177062b0
Deleted: sha256:b77d8d47432560d936546d6ff6a2837abf96fdc183867b2aee883117d208dd0f
Deleted: sha256:e23daf4e8f5f4df145e89372ddcf3532d7fcba2ae7a458b1291561822f39f4a6
Deleted: sha256:70e7651cf4b085ac0dd9bfcad86ea3b5f2f0cb5dfdb3cf9a2bee176ae05b6569
Deleted: sha256:d0a79f15323170622359e9d360dba3e8cd4e7e82a4536e9297ae86e1205f85d6
Build step 'Execute shell' marked build as failure

Mime
View raw message