mesos-builds mailing list archives

Site index · List index
Message view « Date » · « Thread »
Top « Date » · « Thread »
From Apache Jenkins Server <jenk...@builds.apache.org>
Subject Build failed in Jenkins: Mesos-Reviewbot #19151
Date Fri, 01 Sep 2017 01:42:02 GMT
See <https://builds.apache.org/job/Mesos-Reviewbot/19151/display/redirect?page=changes>

Changes:

[benjamin.hindman] Added an undiscardable() helper that blocks discards from propagating.

------------------------------------------
[...truncated 31.16 MB...]
I0901 01:41:57.358713  5817 slave.cpp:252] Mesos agent started on (809)@172.17.0.7:39843
I0901 01:41:57.358748  5817 slave.cpp:253] Flags at startup: --acls="" --appc_simple_discovery_uri_prefix="http://"
--appc_store_dir="/tmp/Endpoint_SlaveEndpointTest_AuthorizedRequest_2_CO0yLc/store/appc" --authenticate_http_readonly="true"
--authenticate_http_readwrite="true" --authenticatee="crammd5" --authentication_backoff_factor="1secs"
--authorizer="local" --cgroups_cpu_enable_pids_and_tids_count="false" --cgroups_enable_cfs="false"
--cgroups_hierarchy="/sys/fs/cgroup" --cgroups_limit_swap="false" --cgroups_root="mesos" --container_disk_watch_interval="15secs"
--containerizers="mesos" --credential="/tmp/Endpoint_SlaveEndpointTest_AuthorizedRequest_2_CO0yLc/credential"
--default_role="*" --disallow_sharing_agent_pid_namespace="false" --disk_watch_interval="1mins"
--docker="docker" --docker_kill_orphans="true" --docker_registry="https://registry-1.docker.io"
--docker_remove_delay="6hrs" --docker_socket="/var/run/docker.sock" --docker_stop_timeout="0ns"
--docker_store_dir="/tmp/Endpoint_SlaveEndpointTest_AuthorizedRequest_2_CO0yLc/store/docker"
--docker_volume_checkpoint_dir="/var/run/mesos/isolators/docker/volume" --enforce_container_disk_quota="false"
--executor_registration_timeout="1mins" --executor_reregistration_timeout="2secs" --executor_shutdown_grace_period="5secs"
--fetcher_cache_dir="/tmp/Endpoint_SlaveEndpointTest_AuthorizedRequest_2_CO0yLc/fetch" --fetcher_cache_size="2GB"
--frameworks_home="" --gc_delay="1weeks" --gc_disk_headroom="0.1" --hadoop_home="" --help="false"
--hostname_lookup="true" --http_command_executor="false" --http_credentials="/tmp/Endpoint_SlaveEndpointTest_AuthorizedRequest_2_CO0yLc/http_credentials"
--http_heartbeat_interval="30secs" --initialize_driver_logging="true" --isolation="posix/cpu,posix/mem"
--launcher="posix" --launcher_dir="/mesos/mesos-1.5.0/_build/src" --logbufsecs="0" --logging_level="INFO"
--max_completed_executors_per_framework="150" --oversubscribed_resources_interval="15secs"
--perf_duration="10secs" --perf_interval="1mins" --port="5051" --qos_correction_interval_min="0ns"
--quiet="false" --recover="reconnect" --recovery_timeout="15mins" --registration_backoff_factor="10ms"
--resources="cpus:2;gpus:0;mem:1024;disk:1024;ports:[31000-32000]" --revocable_cpu_low_priority="true"
--runtime_dir="/tmp/Endpoint_SlaveEndpointTest_AuthorizedRequest_2_CO0yLc" --sandbox_directory="/mnt/mesos/sandbox"
--strict="true" --switch_user="true" --systemd_enable_support="true" --systemd_runtime_directory="/run/systemd/system"
--version="false" --work_dir="/tmp/Endpoint_SlaveEndpointTest_AuthorizedRequest_2_ZN26rO"
--zk_session_timeout="10secs"
I0901 01:41:57.359231  5817 credentials.hpp:86] Loading credential for authentication from
'/tmp/Endpoint_SlaveEndpointTest_AuthorizedRequest_2_CO0yLc/credential'
I0901 01:41:57.359382  5817 slave.cpp:285] Agent using credential for: test-principal
I0901 01:41:57.359407  5817 credentials.hpp:37] Loading credentials for authentication from
'/tmp/Endpoint_SlaveEndpointTest_AuthorizedRequest_2_CO0yLc/http_credentials'
I0901 01:41:57.359686  5817 http.cpp:1045] Creating default 'basic' HTTP authenticator for
realm 'mesos-agent-readonly'
I0901 01:41:57.359874  5817 http.cpp:1045] Creating default 'basic' HTTP authenticator for
realm 'mesos-agent-readwrite'
I0901 01:41:57.361475  5817 slave.cpp:581] Agent resources: [{"name":"cpus","scalar":{"value":2.0},"type":"SCALAR"},{"name":"mem","scalar":{"value":1024.0},"type":"SCALAR"},{"name":"disk","scalar":{"value":1024.0},"type":"SCALAR"},{"name":"ports","ranges":{"range":[{"begin":31000,"end":32000}]},"type":"RANGES"}]
I0901 01:41:57.361717  5817 slave.cpp:589] Agent attributes: [  ]
I0901 01:41:57.361733  5817 slave.cpp:598] Agent hostname: 4a1b31812cb8
I0901 01:41:57.361958  5800 status_update_manager.cpp:177] Pausing sending status updates
I0901 01:41:57.363502  5815 state.cpp:64] Recovering state from '/tmp/Endpoint_SlaveEndpointTest_AuthorizedRequest_2_ZN26rO/meta'
I0901 01:41:57.364060  5813 status_update_manager.cpp:203] Recovering status update manager
I0901 01:41:57.364403  5805 containerizer.cpp:646] Recovering containerizer
I0901 01:41:57.366370  5800 provisioner.cpp:416] Provisioner recovery complete
I0901 01:41:57.366931  5800 slave.cpp:6296] Finished recovery
I0901 01:41:57.367568  5800 slave.cpp:6478] Querying resource estimator for oversubscribable
resources
I0901 01:41:57.367825  5807 slave.cpp:6492] Received oversubscribable resources {} from the
resource estimator
I0901 01:41:57.370959  5808 process.cpp:3956] Handling HTTP event for process 'slave(809)'
with path: '/slave(809)/containers'
I0901 01:41:57.372539  5821 http.cpp:1185] HTTP GET for /slave(809)/containers from 172.17.0.7:52748
I0901 01:41:57.372623  5821 http.cpp:976] Authorizing principal 'test-principal' to GET the
'/containers' endpoint
I0901 01:41:57.376269  5815 slave.cpp:859] Agent terminating
[       OK ] Endpoint/SlaveEndpointTest.AuthorizedRequest/2 (38 ms)
[ RUN      ] Endpoint/SlaveEndpointTest.UnauthorizedRequest/0
I0901 01:41:57.394155  5779 containerizer.cpp:290] Using isolation { environment_secret, posix/cpu,
posix/mem, filesystem/posix, network/cni }
W0901 01:41:57.394870  5779 backend.cpp:76] Failed to create 'aufs' backend: AufsBackend requires
root privileges
W0901 01:41:57.395027  5779 backend.cpp:76] Failed to create 'bind' backend: BindBackend requires
root privileges
I0901 01:41:57.395082  5779 provisioner.cpp:255] Using default backend 'copy'
I0901 01:41:57.400326  5805 slave.cpp:252] Mesos agent started on (810)@172.17.0.7:39843
I0901 01:41:57.400382  5805 slave.cpp:253] Flags at startup: --acls="" --appc_simple_discovery_uri_prefix="http://"
--appc_store_dir="/tmp/Endpoint_SlaveEndpointTest_UnauthorizedRequest_0_4SPblM/store/appc"
--authenticate_http_readonly="true" --authenticate_http_readwrite="true" --authenticatee="crammd5"
--authentication_backoff_factor="1secs" --authorizer="local" --cgroups_cpu_enable_pids_and_tids_count="false"
--cgroups_enable_cfs="false" --cgroups_hierarchy="/sys/fs/cgroup" --cgroups_limit_swap="false"
--cgroups_root="mesos" --container_disk_watch_interval="15secs" --containerizers="mesos" --credential="/tmp/Endpoint_SlaveEndpointTest_UnauthorizedRequest_0_4SPblM/credential"
--default_role="*" --disallow_sharing_agent_pid_namespace="false" --disk_watch_interval="1mins"
--docker="docker" --docker_kill_orphans="true" --docker_registry="https://registry-1.docker.io"
--docker_remove_delay="6hrs" --docker_socket="/var/run/docker.sock" --docker_stop_timeout="0ns"
--docker_store_dir="/tmp/Endpoint_SlaveEndpointTest_UnauthorizedRequest_0_4SPblM/store/docker"
--docker_volume_checkpoint_dir="/var/run/mesos/isolators/docker/volume" --enforce_container_disk_quota="false"
--executor_registration_timeout="1mins" --executor_reregistration_timeout="2secs" --executor_shutdown_grace_period="5secs"
--fetcher_cache_dir="/tmp/Endpoint_SlaveEndpointTest_UnauthorizedRequest_0_4SPblM/fetch" --fetcher_cache_size="2GB"
--frameworks_home="" --gc_delay="1weeks" --gc_disk_headroom="0.1" --hadoop_home="" --help="false"
--hostname_lookup="true" --http_command_executor="false" --http_credentials="/tmp/Endpoint_SlaveEndpointTest_UnauthorizedRequest_0_4SPblM/http_credentials"
--http_heartbeat_interval="30secs" --initialize_driver_logging="true" --isolation="posix/cpu,posix/mem"
--launcher="posix" --launcher_dir="/mesos/mesos-1.5.0/_build/src" --logbufsecs="0" --logging_level="INFO"
--max_completed_executors_per_framework="150" --oversubscribed_resources_interval="15secs"
--perf_duration="10secs" --perf_interval="1mins" --port="5051" --qos_correction_interval_min="0ns"
--quiet="false" --recover="reconnect" --recovery_timeout="15mins" --registration_backoff_factor="10ms"
--resources="cpus:2;gpus:0;mem:1024;disk:1024;ports:[31000-32000]" --revocable_cpu_low_priority="true"
--runtime_dir="/tmp/Endpoint_SlaveEndpointTest_UnauthorizedRequest_0_4SPblM" --sandbox_directory="/mnt/mesos/sandbox"
--strict="true" --switch_user="true" --systemd_enable_support="true" --systemd_runtime_directory="/run/systemd/system"
--version="false" --work_dir="/tmp/Endpoint_SlaveEndpointTest_UnauthorizedRequest_0_VltNVn"
--zk_session_timeout="10secs"
I0901 01:41:57.401036  5805 credentials.hpp:86] Loading credential for authentication from
'/tmp/Endpoint_SlaveEndpointTest_UnauthorizedRequest_0_4SPblM/credential'
I0901 01:41:57.401291  5805 slave.cpp:285] Agent using credential for: test-principal
I0901 01:41:57.401319  5805 credentials.hpp:37] Loading credentials for authentication from
'/tmp/Endpoint_SlaveEndpointTest_UnauthorizedRequest_0_4SPblM/http_credentials'
I0901 01:41:57.401644  5805 http.cpp:1045] Creating default 'basic' HTTP authenticator for
realm 'mesos-agent-readonly'
I0901 01:41:57.401914  5805 http.cpp:1045] Creating default 'basic' HTTP authenticator for
realm 'mesos-agent-readwrite'
I0901 01:41:57.404136  5805 slave.cpp:581] Agent resources: [{"name":"cpus","scalar":{"value":2.0},"type":"SCALAR"},{"name":"mem","scalar":{"value":1024.0},"type":"SCALAR"},{"name":"disk","scalar":{"value":1024.0},"type":"SCALAR"},{"name":"ports","ranges":{"range":[{"begin":31000,"end":32000}]},"type":"RANGES"}]
I0901 01:41:57.404460  5805 slave.cpp:589] Agent attributes: [  ]
I0901 01:41:57.404476  5805 slave.cpp:598] Agent hostname: 4a1b31812cb8
I0901 01:41:57.404651  5816 status_update_manager.cpp:177] Pausing sending status updates
I0901 01:41:57.406430  5811 state.cpp:64] Recovering state from '/tmp/Endpoint_SlaveEndpointTest_UnauthorizedRequest_0_VltNVn/meta'
I0901 01:41:57.406908  5811 status_update_manager.cpp:203] Recovering status update manager
I0901 01:41:57.407233  5811 containerizer.cpp:646] Recovering containerizer
I0901 01:41:57.409204  5818 provisioner.cpp:416] Provisioner recovery complete
I0901 01:41:57.409747  5819 slave.cpp:6296] Finished recovery
I0901 01:41:57.410238  5819 slave.cpp:6478] Querying resource estimator for oversubscribable
resources
I0901 01:41:57.410576  5809 slave.cpp:6492] Received oversubscribable resources {} from the
resource estimator
I0901 01:41:57.413398  5813 process.cpp:3956] Handling HTTP event for process 'slave(810)'
with path: '/slave(810)/monitor/statistics'
I0901 01:41:57.414960  5818 http.cpp:1185] HTTP GET for /slave(810)/monitor/statistics from
172.17.0.7:52750
I0901 01:41:57.415055  5818 http.cpp:976] Authorizing principal 'test-principal' to GET the
'/monitor/statistics' endpoint
I0901 01:41:57.417421  5803 slave.cpp:859] Agent terminating
[       OK ] Endpoint/SlaveEndpointTest.UnauthorizedRequest/0 (39 ms)
[ RUN      ] Endpoint/SlaveEndpointTest.UnauthorizedRequest/1
I0901 01:41:57.431567  5779 containerizer.cpp:290] Using isolation { environment_secret, posix/cpu,
posix/mem, filesystem/posix, network/cni }
W0901 01:41:57.432130  5779 backend.cpp:76] Failed to create 'aufs' backend: AufsBackend requires
root privileges
W0901 01:41:57.432247  5779 backend.cpp:76] Failed to create 'bind' backend: BindBackend requires
root privileges
I0901 01:41:57.432279  5779 provisioner.cpp:255] Using default backend 'copy'
I0901 01:41:57.437306  5811 slave.cpp:252] Mesos agent started on (811)@172.17.0.7:39843
I0901 01:41:57.437355  5811 slave.cpp:253] Flags at startup: --acls="" --appc_simple_discovery_uri_prefix="http://"
--appc_store_dir="/tmp/Endpoint_SlaveEndpointTest_UnauthorizedRequest_1_MuIeim/store/appc"
--authenticate_http_readonly="true" --authenticate_http_readwrite="true" --authenticatee="crammd5"
--authentication_backoff_factor="1secs" --authorizer="local" --cgroups_cpu_enable_pids_and_tids_count="false"
--cgroups_enable_cfs="false" --cgroups_hierarchy="/sys/fs/cgroup" --cgroups_limit_swap="false"
--cgroups_root="mesos" --container_disk_watch_interval="15secs" --containerizers="mesos" --credential="/tmp/Endpoint_SlaveEndpointTest_UnauthorizedRequest_1_MuIeim/credential"
--default_role="*" --disallow_sharing_agent_pid_namespace="false" --disk_watch_interval="1mins"
--docker="docker" --docker_kill_orphans="true" --docker_registry="https://registry-1.docker.io"
--docker_remove_delay="6hrs" --docker_socket="/var/run/docker.sock" --docker_stop_timeout="0ns"
--docker_store_dir="/tmp/Endpoint_SlaveEndpointTest_UnauthorizedRequest_1_MuIeim/store/docker"
--docker_volume_checkpoint_dir="/var/run/mesos/isolators/docker/volume" --enforce_container_disk_quota="false"
--executor_registration_timeout="1mins" --executor_reregistration_timeout="2secs" --executor_shutdown_grace_period="5secs"
--fetcher_cache_dir="/tmp/Endpoint_SlaveEndpointTest_UnauthorizedRequest_1_MuIeim/fetch" --fetcher_cache_size="2GB"
--frameworks_home="" --gc_delay="1weeks" --gc_disk_headroom="0.1" --hadoop_home="" --help="false"
--hostname_lookup="true" --http_command_executor="false" --http_credentials="/tmp/Endpoint_SlaveEndpointTest_UnauthorizedRequest_1_MuIeim/http_credentials"
--http_heartbeat_interval="30secs" --initialize_driver_logging="true" --isolation="posix/cpu,posix/mem"
--launcher="posix" --launcher_dir="/mesos/mesos-1.5.0/_build/src" --logbufsecs="0" --logging_level="INFO"
--max_completed_executors_per_framework="150" --oversubscribed_resources_interval="15secs"
--perf_duration="10secs" --perf_interval="1mins" --port="5051" --qos_correction_interval_min="0ns"
--quiet="false" --recover="reconnect" --recovery_timeout="15mins" --registration_backoff_factor="10ms"
--resources="cpus:2;gpus:0;mem:1024;disk:1024;ports:[31000-32000]" --revocable_cpu_low_priority="true"
--runtime_dir="/tmp/Endpoint_SlaveEndpointTest_UnauthorizedRequest_1_MuIeim" --sandbox_directory="/mnt/mesos/sandbox"
--strict="true" --switch_user="true" --systemd_enable_support="true" --systemd_runtime_directory="/run/systemd/system"
--version="false" --work_dir="/tmp/Endpoint_SlaveEndpointTest_UnauthorizedRequest_1_1k5cNX"
--zk_session_timeout="10secs"
I0901 01:41:57.437862  5811 credentials.hpp:86] Loading credential for authentication from
'/tmp/Endpoint_SlaveEndpointTest_UnauthorizedRequest_1_MuIeim/credential'
I0901 01:41:57.438060  5811 slave.cpp:285] Agent using credential for: test-principal
I0901 01:41:57.438086  5811 credentials.hpp:37] Loading credentials for authentication from
'/tmp/Endpoint_SlaveEndpointTest_UnauthorizedRequest_1_MuIeim/http_credentials'
I0901 01:41:57.438405  5811 http.cpp:1045] Creating default 'basic' HTTP authenticator for
realm 'mesos-agent-readonly'
I0901 01:41:57.438583  5811 http.cpp:1045] Creating default 'basic' HTTP authenticator for
realm 'mesos-agent-readwrite'
I0901 01:41:57.440137  5811 slave.cpp:581] Agent resources: [{"name":"cpus","scalar":{"value":2.0},"type":"SCALAR"},{"name":"mem","scalar":{"value":1024.0},"type":"SCALAR"},{"name":"disk","scalar":{"value":1024.0},"type":"SCALAR"},{"name":"ports","ranges":{"range":[{"begin":31000,"end":32000}]},"type":"RANGES"}]
I0901 01:41:57.440408  5811 slave.cpp:589] Agent attributes: [  ]
I0901 01:41:57.440424  5811 slave.cpp:598] Agent hostname: 4a1b31812cb8
I0901 01:41:57.440614  5816 status_update_manager.cpp:177] Pausing sending status updates
I0901 01:41:57.442215  5818 state.cpp:64] Recovering state from '/tmp/Endpoint_SlaveEndpointTest_UnauthorizedRequest_1_1k5cNX/meta'
I0901 01:41:57.442498  5809 status_update_manager.cpp:203] Recovering status update manager
I0901 01:41:57.442737  5819 containerizer.cpp:646] Recovering containerizer
I0901 01:41:57.444321  5816 provisioner.cpp:416] Provisioner recovery complete
I0901 01:41:57.444862  5804 slave.cpp:6296] Finished recovery
I0901 01:41:57.445399  5804 slave.cpp:6478] Querying resource estimator for oversubscribable
resources
I0901 01:41:57.445807  5805 slave.cpp:6492] Received oversubscribable resources {} from the
resource estimator
I0901 01:41:57.448752  5799 process.cpp:3956] Handling HTTP event for process 'slave(811)'
with path: '/slave(811)/monitor/statistics.json'
I0901 01:41:57.450314  5820 http.cpp:1185] HTTP GET for /slave(811)/monitor/statistics.json
from 172.17.0.7:52752
I0901 01:41:57.450388  5820 http.cpp:976] Authorizing principal 'test-principal' to GET the
'/monitor/statistics.json' endpoint
I0901 01:41:57.453781  5779 slave.cpp:859] Agent terminating
[       OK ] Endpoint/SlaveEndpointTest.UnauthorizedRequest/1 (36 ms)
[ RUN      ] Endpoint/SlaveEndpointTest.UnauthorizedRequest/2
I0901 01:41:57.467768  5779 containerizer.cpp:290] Using isolation { environment_secret, posix/cpu,
posix/mem, filesystem/posix, network/cni }
W0901 01:41:57.468415  5779 backend.cpp:76] Failed to create 'aufs' backend: AufsBackend requires
root privileges
W0901 01:41:57.468550  5779 backend.cpp:76] Failed to create 'bind' backend: BindBackend requires
root privileges
I0901 01:41:57.468585  5779 provisioner.cpp:255] Using default backend 'copy'
I0901 01:41:57.472877  5812 slave.cpp:252] Mesos agent started on (812)@172.17.0.7:39843
I0901 01:41:57.472903  5812 slave.cpp:253] Flags at startup: --acls="" --appc_simple_discovery_uri_prefix="http://"
--appc_store_dir="/tmp/Endpoint_SlaveEndpointTest_UnauthorizedRequest_2_SSzOAW/store/appc"
--authenticate_http_readonly="true" --authenticate_http_readwrite="true" --authenticatee="crammd5"
--authentication_backoff_factor="1secs" --authorizer="local" --cgroups_cpu_enable_pids_and_tids_count="false"
--cgroups_enable_cfs="false" --cgroups_hierarchy="/sys/fs/cgroup" --cgroups_limit_swap="false"
--cgroups_root="mesos" --container_disk_watch_interval="15secs" --containerizers="mesos" --credential="/tmp/Endpoint_SlaveEndpointTest_UnauthorizedRequest_2_SSzOAW/credential"
--default_role="*" --disallow_sharing_agent_pid_namespace="false" --disk_watch_interval="1mins"
--docker="docker" --docker_kill_orphans="true" --docker_registry="https://registry-1.docker.io"
--docker_remove_delay="6hrs" --docker_socket="/var/run/docker.sock" --docker_stop_timeout="0ns"
--docker_store_dir="/tmp/Endpoint_SlaveEndpointTest_UnauthorizedRequest_2_SSzOAW/store/docker"
--docker_volume_checkpoint_dir="/var/run/mesos/isolators/docker/volume" --enforce_container_disk_quota="false"
--executor_registration_timeout="1mins" --executor_reregistration_timeout="2secs" --executor_shutdown_grace_period="5secs"
--fetcher_cache_dir="/tmp/Endpoint_SlaveEndpointTest_UnauthorizedRequest_2_SSzOAW/fetch" --fetcher_cache_size="2GB"
--frameworks_home="" --gc_delay="1weeks" --gc_disk_headroom="0.1" --hadoop_home="" --help="false"
--hostname_lookup="true" --http_command_executor="false" --http_credentials="/tmp/Endpoint_SlaveEndpointTest_UnauthorizedRequest_2_SSzOAW/http_credentials"
--http_heartbeat_interval="30secs" --initialize_driver_logging="true" --isolation="posix/cpu,posix/mem"
--launcher="posix" --launcher_dir="/mesos/mesos-1.5.0/_build/src" --logbufsecs="0" --logging_level="INFO"
--max_completed_executors_per_framework="150" --oversubscribed_resources_interval="15secs"
--perf_duration="10secs" --perf_interval="1mins" --port="5051" --qos_correction_interval_min="0ns"
--quiet="false" --recover="reconnect" --recovery_timeout="15mins" --registration_backoff_factor="10ms"
--resources="cpus:2;gpus:0;mem:1024;disk:1024;ports:[31000-32000]" --revocable_cpu_low_priority="true"
--runtime_dir="/tmp/Endpoint_SlaveEndpointTest_UnauthorizedRequest_2_SSzOAW" --sandbox_directory="/mnt/mesos/sandbox"
--strict="true" --switch_user="true" --systemd_enable_support="true" --systemd_runtime_directory="/run/systemd/system"
--version="false" --work_dir="/tmp/Endpoint_SlaveEndpointTest_UnauthorizedRequest_2_7WSl0x"
--zk_session_timeout="10secs"
I0901 01:41:57.473495  5812 credentials.hpp:86] Loading credential for authentication from
'/tmp/Endpoint_SlaveEndpointTest_UnauthorizedRequest_2_SSzOAW/credential'
I0901 01:41:57.473731  5812 slave.cpp:285] Agent using credential for: test-principal
I0901 01:41:57.473753  5812 credentials.hpp:37] Loading credentials for authentication from
'/tmp/Endpoint_SlaveEndpointTest_UnauthorizedRequest_2_SSzOAW/http_credentials'
I0901 01:41:57.474071  5812 http.cpp:1045] Creating default 'basic' HTTP authenticator for
realm 'mesos-agent-readonly'
I0901 01:41:57.474284  5812 http.cpp:1045] Creating default 'basic' HTTP authenticator for
realm 'mesos-agent-readwrite'
I0901 01:41:57.475811  5812 slave.cpp:581] Agent resources: [{"name":"cpus","scalar":{"value":2.0},"type":"SCALAR"},{"name":"mem","scalar":{"value":1024.0},"type":"SCALAR"},{"name":"disk","scalar":{"value":1024.0},"type":"SCALAR"},{"name":"ports","ranges":{"range":[{"begin":31000,"end":32000}]},"type":"RANGES"}]
I0901 01:41:57.476068  5812 slave.cpp:589] Agent attributes: [  ]
I0901 01:41:57.476085  5812 slave.cpp:598] Agent hostname: 4a1b31812cb8
I0901 01:41:57.476294  5818 status_update_manager.cpp:177] Pausing sending status updates
I0901 01:41:57.478088  5808 state.cpp:64] Recovering state from '/tmp/Endpoint_SlaveEndpointTest_UnauthorizedRequest_2_7WSl0x/meta'
I0901 01:41:57.478523  5805 status_update_manager.cpp:203] Recovering status update manager
I0901 01:41:57.478719  5807 containerizer.cpp:646] Recovering containerizer
I0901 01:41:57.480526  5810 provisioner.cpp:416] Provisioner recovery complete
I0901 01:41:57.481170  5802 slave.cpp:6296] Finished recovery
I0901 01:41:57.481771  5802 slave.cpp:6478] Querying resource estimator for oversubscribable
resources
I0901 01:41:57.482085  5801 slave.cpp:6492] Received oversubscribable resources {} from the
resource estimator
I0901 01:41:57.484922  5806 process.cpp:3956] Handling HTTP event for process 'slave(812)'
with path: '/slave(812)/containers'
I0901 01:41:57.486465  5808 http.cpp:1185] HTTP GET for /slave(812)/containers from 172.17.0.7:52756
I0901 01:41:57.486585  5808 http.cpp:976] Authorizing principal 'test-principal' to GET the
'/containers' endpoint
I0901 01:41:57.489347  5800 slave.cpp:859] Agent terminating
[       OK ] Endpoint/SlaveEndpointTest.UnauthorizedRequest/2 (37 ms)
[ RUN      ] Endpoint/SlaveEndpointTest.NoAuthorizer/0
I0901 01:41:57.508610  5779 containerizer.cpp:290] Using isolation { environment_secret, posix/cpu,
posix/mem, filesystem/posix, network/cni }
W0901 01:41:57.509351  5779 backend.cpp:76] Failed to create 'aufs' backend: AufsBackend requires
root privileges
W0901 01:41:57.509534  5779 backend.cpp:76] Failed to create 'bind' backend: BindBackend requires
root privileges
I0901 01:41:57.509588  5779 provisioner.cpp:255] Using default backend 'copy'
I0901 01:41:57.512102  5779 cluster.cpp:448] Creating default 'local' authorizer
I0901 01:41:57.514829  5812 slave.cpp:252] Mesos agent started on (813)@172.17.0.7:39843
I0901 01:41:57.514861  5812 slave.cpp:253] Flags at startup: --acls="" --appc_simple_discovery_uri_prefix="http://"
--appc_store_dir="/tmp/Endpoint_SlaveEndpointTest_NoAuthorizer_0_z4PZfx/store/appc" --authenticate_http_readonly="true"
--authenticate_http_readwrite="true" --authenticatee="crammd5" --authentication_backoff_factor="1secs"
--authorizer="local" --cgroups_cpu_enable_pids_and_tids_count="false" --cgroups_enable_cfs="false"
--cgroups_hierarchy="/sys/fs/cgroup" --cgroups_limit_swap="false" --cgroups_root="mesos" --container_disk_watch_interval="15secs"
--containerizers="mesos" --credential="/tmp/Endpoint_SlaveEndpointTest_NoAuthorizer_0_z4PZfx/credential"
--default_role="*" --disallow_sharing_agent_pid_namespace="false" --disk_watch_interval="1mins"
--docker="docker" --docker_kill_orphans="true" --docker_registry="https://registry-1.docker.io"
--docker_remove_delay="6hrs" --docker_socket="/var/run/docker.sock" --docker_stop_timeout="0ns"
--docker_store_dir="/tmp/Endpoint_SlaveEndpointTest_NoAuthorizer_0_z4PZfx/store/docker" --docker_volume_checkpoint_dir="/var/run/mesos/isolators/docker/volume"
--enforce_container_disk_quota="false" --executor_registration_timeout="1mins" --executor_reregistration_timeout="2secs"
--executor_shutdown_grace_period="5secs" --fetcher_cache_dir="/tmp/Endpoint_SlaveEndpointTest_NoAuthorizer_0_z4PZfx/fetch"
--fetcher_cache_size="2GB" --frameworks_home="" --gc_delay="1weeks" --gc_disk_headroom="0.1"
--hadoop_home="" --help="false" --hostname_lookup="true" --http_command_executor="false" --http_credentials="/tmp/Endpoint_SlaveEndpointTest_NoAuthorizer_0_z4PZfx/http_credentials"
--http_heartbeat_interval="30secs" --initialize_driver_logging="true" --isolation="posix/cpu,posix/mem"
--launcher="posix" --launcher_dir="/mesos/mesos-1.5.0/_build/src" --logbufsecs="0" --logging_level="INFO"
--max_completed_executors_per_framework="150" --oversubscribed_resources_interval="15secs"
--perf_duration="10secs" --perf_interval="1mins" --port="5051" --qos_correction_interval_min="0ns"
--quiet="false" --recover="reconnect" --recovery_timeout="15mins" --registration_backoff_factor="10ms"
--resources="cpus:2;gpus:0;mem:1024;disk:1024;ports:[31000-32000]" --revocable_cpu_low_priority="true"
--runtime_dir="/tmp/Endpoint_SlaveEndpointTest_NoAuthorizer_0_z4PZfx" --sandbox_directory="/mnt/mesos/sandbox"
--strict="true" --switch_user="true" --systemd_enable_support="true" --systemd_runtime_directory="/run/systemd/system"
--version="false" --work_dir="/tmp/Endpoint_SlaveEndpointTest_NoAuthorizer_0_sBfLz8" --zk_session_timeout="10secs"
I0901 01:41:57.515338  5812 credentials.hpp:86] Loading credential for authentication from
'/tmp/Endpoint_SlaveEndpointTest_NoAuthorizer_0_z4PZfx/credential'
I0901 01:41:57.515502  5812 slave.cpp:285] Agent using credential for: test-principal
I0901 01:41:57.515527  5812 credentials.hpp:37] Loading credentials for authentication from
'/tmp/Endpoint_SlaveEndpointTest_NoAuthorizer_0_z4PZfx/http_credentials'
I0901 01:41:57.515799  5812 http.cpp:1045] Creating default 'basic' HTTP authenticator for
realm 'mesos-agent-readonly'
I0901 01:41:57.515969  5812 http.cpp:1045] Creating default 'basic' HTTP authenticator for
realm 'mesos-agent-readwrite'
I0901 01:41:57.517458  5812 slave.cpp:581] Agent resources: [{"name":"cpus","scalar":{"value":2.0},"type":"SCALAR"},{"name":"mem","scalar":{"value":1024.0},"type":"SCALAR"},{"name":"disk","scalar":{"value":1024.0},"type":"SCALAR"},{"name":"ports","ranges":{"range":[{"begin":31000,"end":32000}]},"type":"RANGES"}]
I0901 01:41:57.517716  5812 slave.cpp:589] Agent attributes: [  ]
I0901 01:41:57.517732  5812 slave.cpp:598] Agent hostname: 4a1b31812cb8
I0901 01:41:57.517902  5817 status_update_manager.cpp:177] Pausing sending status updates
I0901 01:41:57.519259  5814 state.cpp:64] Recovering state from '/tmp/Endpoint_SlaveEndpointTest_NoAuthorizer_0_sBfLz8/meta'
I0901 01:41:57.519598  5820 status_update_manager.cpp:203] Recovering status update manager
I0901 01:41:57.519861  5811 containerizer.cpp:646] Recovering containerizer
I0901 01:41:57.521754  5817 provisioner.cpp:416] Provisioner recovery complete
I0901 01:41:57.522342  5809 slave.cpp:6296] Finished recovery
I0901 01:41:57.522840  5809 slave.cpp:6478] Querying resource estimator for oversubscribable
resources
I0901 01:41:57.523164  5798 slave.cpp:6492] Received oversubscribable resources {} from the
resource estimator
I0901 01:41:57.526623  5805 process.cpp:3956] Handling HTTP event for process 'slave(813)'
with path: '/slave(813)/monitor/statistics'
I0901 01:41:57.528204  5816 http.cpp:1185] HTTP GET for /slave(813)/monitor/statistics from
172.17.0.7:52758
I0901 01:41:57.528309  5816 http.cpp:976] Authorizing principal 'test-principal' to GET the
'/monitor/statistics' endpoint
I0901 01:41:57.532447  5779 slave.cpp:859] Agent terminating
[       OK ] Endpoint/SlaveEndpointTest.NoAuthorizer/0 (39 ms)
[ RUN      ] Endpoint/SlaveEndpointTest.NoAuthorizer/1
I0901 01:41:57.545610  5779 containerizer.cpp:290] Using isolation { environment_secret, posix/cpu,
posix/mem, filesystem/posix, network/cni }
W0901 01:41:57.546113  5779 backend.cpp:76] Failed to create 'aufs' backend: AufsBackend requires
root privileges
W0901 01:41:57.546223  5779 backend.cpp:76] Failed to create 'bind' backend: BindBackend requires
root privileges
I0901 01:41:57.546254  5779 provisioner.cpp:255] Using default backend 'copy'
I0901 01:41:57.548072  5779 cluster.cpp:448] Creating default 'local' authorizer
I0901 01:41:57.550258  5815 slave.cpp:252] Mesos agent started on (814)@172.17.0.7:39843
I0901 01:41:57.550287  5815 slave.cpp:253] Flags at startup: --acls="" --appc_simple_discovery_uri_prefix="http://"
--appc_store_dir="/tmp/Endpoint_SlaveEndpointTest_NoAuthorizer_1_NmySi8/store/appc" --authenticate_http_readonly="true"
--authenticate_http_readwrite="true" --authenticatee="crammd5" --authentication_backoff_factor="1secs"
--authorizer="local" --cgroups_cpu_enable_pids_and_tids_count="false" --cgroups_enable_cfs="false"
--cgroups_hierarchy="/sys/fs/cgroup" --cgroups_limit_swap="false" --cgroups_root="mesos" --container_disk_watch_interval="15secs"
--containerizers="mesos" --credential="/tmp/Endpoint_SlaveEndpointTest_NoAuthorizer_1_NmySi8/credential"
--default_role="*" --disallow_sharing_agent_pid_namespace="false" --disk_watch_interval="1mins"
--docker="docker" --docker_kill_orphans="true" --docker_registry="https://registry-1.docker.io"
--docker_remove_delay="6hrs" --docker_socket="/var/run/docker.sock" --docker_stop_timeout="0ns"
--docker_store_dir="/tmp/Endpoint_SlaveEndpointTest_NoAuthorizer_1_NmySi8/store/docker" --docker_volume_checkpoint_dir="/var/run/mesos/isolators/docker/volume"
--enforce_container_disk_quota="false" --executor_registration_timeout="1mins" --executor_reregistration_timeout="2secs"
--executor_shutdown_grace_period="5secs" --fetcher_cache_dir="/tmp/Endpoint_SlaveEndpointTest_NoAuthorizer_1_NmySi8/fetch"
--fetcher_cache_size="2GB" --frameworks_home="" --gc_delay="1weeks" --gc_disk_headroom="0.1"
--hadoop_home="" --help="false" --hostname_lookup="true" --http_command_executor="false" --http_credentials="/tmp/Endpoint_SlaveEndpointTest_NoAuthorizer_1_NmySi8/http_credentials"
--http_heartbeat_interval="30secs" --initialize_driver_logging="true" --isolation="posix/cpu,posix/mem"
--launcher="posix" --launcher_dir="/mesos/mesos-1.5.0/_build/src" --logbufsecs="0" --logging_level="INFO"
--max_completed_executors_per_framework="150" --oversubscribed_resources_interval="15secs"
--perf_duration="10secs" --perf_interval="1mins" --port="5051" --qos_correction_interval_min="0ns"
--quiet="false" --recover="reconnect" --recovery_timeout="15mins" --registration_backoff_factor="10ms"
--resources="cpus:2;gpus:0;mem:1024;disk:1024;ports:[31000-32000]" --revocable_cpu_low_priority="true"
--runtime_dir="/tmp/Endpoint_SlaveEndpointTest_NoAuthorizer_1_NmySi8" --sandbox_directory="/mnt/mesos/sandbox"
--strict="true" --switch_user="true" --systemd_enable_support="true" --systemd_runtime_directory="/run/systemd/system"
--version="false" --work_dir="/tmp/Endpoint_SlaveEndpointTest_NoAuthorizer_1_KW8PwJ" --zk_session_timeout="10secs"
I0901 01:41:57.550875  5815 credentials.hpp:86] Loading credential for authentication from
'/tmp/Endpoint_SlaveEndpointTest_NoAuthorizer_1_NmySi8/credential'
I0901 01:41:57.551056  5815 slave.cpp:285] Agent using credential for: test-principal
I0901 01:41:57.551091  5815 credentials.hpp:37] Loading credentials for authentication from
'/tmp/Endpoint_SlaveEndpointTest_NoAuthorizer_1_NmySi8/http_credentials'
I0901 01:41:57.551446  5815 http.cpp:1045] Creating default 'basic' HTTP authenticator for
realm 'mesos-agent-readonly'
I0901 01:41:57.551671  5815 http.cpp:1045] Creating default 'basic' HTTP authenticator for
realm 'mesos-agent-readwrite'
I0901 01:41:57.553135  5815 slave.cpp:581] Agent resources: [{"name":"cpus","scalar":{"value":2.0},"type":"SCALAR"},{"name":"mem","scalar":{"value":1024.0},"type":"SCALAR"},{"name":"disk","scalar":{"value":1024.0},"type":"SCALAR"},{"name":"ports","ranges":{"range":[{"begin":31000,"end":32000}]},"type":"RANGES"}]
I0901 01:41:57.553369  5815 slave.cpp:589] Agent attributes: [  ]
I0901 01:41:57.553382  5815 slave.cpp:598] Agent hostname: 4a1b31812cb8
I0901 01:41:57.553582  5801 status_update_manager.cpp:177] Pausing sending status updates
I0901 01:41:57.554977  5800 state.cpp:64] Recovering state from '/tmp/Endpoint_SlaveEndpointTest_NoAuthorizer_1_KW8PwJ/meta'
I0901 01:41:57.555434  5817 status_update_manager.cpp:203] Recovering status update manager
I0901 01:41:57.555652  5817 containerizer.cpp:646] Recovering containerizer
I0901 01:41:57.557217  5810 provisioner.cpp:416] Provisioner recovery complete
I0901 01:41:57.557680  5804 slave.cpp:6296] Finished recovery
I0901 01:41:57.558226  5804 slave.cpp:6478] Querying resource estimator for oversubscribable
resources
I0901 01:41:57.558511  5821 slave.cpp:6492] Received oversubscribable resources {} from the
resource estimator
I0901 01:41:57.561031  5801 process.cpp:3956] Handling HTTP event for process 'slave(814)'
with path: '/slave(814)/monitor/statistics.json'
I0901 01:41:57.562816  5812 http.cpp:1185] HTTP GET for /slave(814)/monitor/statistics.json
from 172.17.0.7:52760
I0901 01:41:57.562886  5812 http.cpp:976] Authorizing principal 'test-principal' to GET the
'/monitor/statistics.json' endpoint
I0901 01:41:57.567168  5804 slave.cpp:859] Agent terminating
[       OK ] Endpoint/SlaveEndpointTest.NoAuthorizer/1 (36 ms)
[ RUN      ] Endpoint/SlaveEndpointTest.NoAuthorizer/2
I0901 01:41:57.585177  5779 containerizer.cpp:290] Using isolation { environment_secret, posix/cpu,
posix/mem, filesystem/posix, network/cni }
W0901 01:41:57.585937  5779 backend.cpp:76] Failed to create 'aufs' backend: AufsBackend requires
root privileges
W0901 01:41:57.586107  5779 backend.cpp:76] Failed to create 'bind' backend: BindBackend requires
root privileges
I0901 01:41:57.586138  5779 provisioner.cpp:255] Using default backend 'copy'
I0901 01:41:57.589172  5779 cluster.cpp:448] Creating default 'local' authorizer
I0901 01:41:57.592108  5818 slave.cpp:252] Mesos agent started on (815)@172.17.0.7:39843
I0901 01:41:57.592146  5818 slave.cpp:253] Flags at startup: --acls="" --appc_simple_discovery_uri_prefix="http://"
--appc_store_dir="/tmp/Endpoint_SlaveEndpointTest_NoAuthorizer_2_rg9GHJ/store/appc" --authenticate_http_readonly="true"
--authenticate_http_readwrite="true" --authenticatee="crammd5" --authentication_backoff_factor="1secs"
--authorizer="local" --cgroups_cpu_enable_pids_and_tids_count="false" --cgroups_enable_cfs="false"
--cgroups_hierarchy="/sys/fs/cgroup" --cgroups_limit_swap="false" --cgroups_root="mesos" --container_disk_watch_interval="15secs"
--containerizers="mesos" --credential="/tmp/Endpoint_SlaveEndpointTest_NoAuthorizer_2_rg9GHJ/credential"
--default_role="*" --disallow_sharing_agent_pid_namespace="false" --disk_watch_interval="1mins"
--docker="docker" --docker_kill_orphans="true" --docker_registry="https://registry-1.docker.io"
--docker_remove_delay="6hrs" --docker_socket="/var/run/docker.sock" --docker_stop_timeout="0ns"
--docker_store_dir="/tmp/Endpoint_SlaveEndpointTest_NoAuthorizer_2_rg9GHJ/store/docker" --docker_volume_checkpoint_dir="/var/run/mesos/isolators/docker/volume"
--enforce_container_disk_quota="false" --executor_registration_timeout="1mins" --executor_reregistration_timeout="2secs"
--executor_shutdown_grace_period="5secs" --fetcher_cache_dir="/tmp/Endpoint_SlaveEndpointTest_NoAuthorizer_2_rg9GHJ/fetch"
--fetcher_cache_size="2GB" --frameworks_home="" --gc_delay="1weeks" --gc_disk_headroom="0.1"
--hadoop_home="" --help="false" --hostname_lookup="true" --http_command_executor="false" --http_credentials="/tmp/Endpoint_SlaveEndpointTest_NoAuthorizer_2_rg9GHJ/http_credentials"
--http_heartbeat_interval="30secs" --initialize_driver_logging="true" --isolation="posix/cpu,posix/mem"
--launcher="posix" --launcher_dir="/mesos/mesos-1.5.0/_build/src" --logbufsecs="0" --logging_level="INFO"
--max_completed_executors_per_framework="150" --oversubscribed_resources_interval="15secs"
--perf_duration="10secs" --perf_interval="1mins" --port="5051" --qos_correction_interval_min="0ns"
--quiet="false" --recover="reconnect" --recovery_timeout="15mins" --registration_backoff_factor="10ms"
--resources="cpus:2;gpus:0;mem:1024;disk:1024;ports:[31000-32000]" --revocable_cpu_low_priority="true"
--runtime_dir="/tmp/Endpoint_SlaveEndpointTest_NoAuthorizer_2_rg9GHJ" --sandbox_directory="/mnt/mesos/sandbox"
--strict="true" --switch_user="true" --systemd_enable_support="true" --systemd_runtime_directory="/run/systemd/system"
--version="false" --work_dir="/tmp/Endpoint_SlaveEndpointTest_NoAuthorizer_2_4JT2Pk" --zk_session_timeout="10secs"
I0901 01:41:57.592618  5818 credentials.hpp:86] Loading credential for authentication from
'/tmp/Endpoint_SlaveEndpointTest_NoAuthorizer_2_rg9GHJ/credential'
I0901 01:41:57.592813  5818 slave.cpp:285] Agent using credential for: test-principal
I0901 01:41:57.592839  5818 credentials.hpp:37] Loading credentials for authentication from
'/tmp/Endpoint_SlaveEndpointTest_NoAuthorizer_2_rg9GHJ/http_credentials'
I0901 01:41:57.593220  5818 http.cpp:1045] Creating default 'basic' HTTP authenticator for
realm 'mesos-agent-readonly'
I0901 01:41:57.593428  5818 http.cpp:1045] Creating default 'basic' HTTP authenticator for
realm 'mesos-agent-readwrite'
I0901 01:41:57.595685  5818 slave.cpp:581] Agent resources: [{"name":"cpus","scalar":{"value":2.0},"type":"SCALAR"},{"name":"mem","scalar":{"value":1024.0},"type":"SCALAR"},{"name":"disk","scalar":{"value":1024.0},"type":"SCALAR"},{"name":"ports","ranges":{"range":[{"begin":31000,"end":32000}]},"type":"RANGES"}]
I0901 01:41:57.596091  5818 slave.cpp:589] Agent attributes: [  ]
I0901 01:41:57.596118  5818 slave.cpp:598] Agent hostname: 4a1b31812cb8
I0901 01:41:57.596299  5821 status_update_manager.cpp:177] Pausing sending status updates
I0901 01:41:57.598323  5807 state.cpp:64] Recovering state from '/tmp/Endpoint_SlaveEndpointTest_NoAuthorizer_2_4JT2Pk/meta'
I0901 01:41:57.598767  5810 status_update_manager.cpp:203] Recovering status update manager
I0901 01:41:57.599009  5810 containerizer.cpp:646] Recovering containerizer
I0901 01:41:57.600888  5814 provisioner.cpp:416] Provisioner recovery complete
I0901 01:41:57.601486  5818 slave.cpp:6296] Finished recovery
I0901 01:41:57.602169  5818 slave.cpp:6478] Querying resource estimator for oversubscribable
resources
I0901 01:41:57.602460  5819 slave.cpp:6492] Received oversubscribable resources {} from the
resource estimator
I0901 01:41:57.605113  5821 process.cpp:3956] Handling HTTP event for process 'slave(815)'
with path: '/slave(815)/containers'
I0901 01:41:57.607148  5804 http.cpp:1185] HTTP GET for /slave(815)/containers from 172.17.0.7:52762
I0901 01:41:57.607275  5804 http.cpp:976] Authorizing principal 'test-principal' to GET the
'/containers' endpoint
I0901 01:41:57.611420  5817 slave.cpp:859] Agent terminating
[       OK ] Endpoint/SlaveEndpointTest.NoAuthorizer/2 (44 ms)
[----------] 9 tests from Endpoint/SlaveEndpointTest (345 ms total)

[----------] 2 tests from ContainerizerType/DefaultContainerDNSFlagTest
[ RUN      ] ContainerizerType/DefaultContainerDNSFlagTest.ValidateFlag/0
[       OK ] ContainerizerType/DefaultContainerDNSFlagTest.ValidateFlag/0 (12 ms)
[ RUN      ] ContainerizerType/DefaultContainerDNSFlagTest.ValidateFlag/1
[       OK ] ContainerizerType/DefaultContainerDNSFlagTest.ValidateFlag/1 (11 ms)
[----------] 2 tests from ContainerizerType/DefaultContainerDNSFlagTest (23 ms total)

[----------] Global test environment tear-down
[==========] 1666 tests from 183 test cases ran. (517754 ms total)
[  PASSED  ] 1665 tests.
[  FAILED  ] 1 test, listed below:
[  FAILED  ] ExamplesTest.JavaFramework

 1 FAILED TEST
  YOU HAVE 20 DISABLED TESTS

I0901 01:41:57.701668  5822 process.cpp:1072] Failed to accept socket: future discarded
make[4]: *** [check-local] Error 1
make[4]: Leaving directory `/mesos/mesos-1.5.0/_build/src'
make[3]: *** [check-am] Error 2
make[3]: Leaving directory `/mesos/mesos-1.5.0/_build/src'
make[2]: *** [check] Error 2
make[2]: Leaving directory `/mesos/mesos-1.5.0/_build/src'
make[1]: *** [check-recursive] Error 1
make[1]: Leaving directory `/mesos/mesos-1.5.0/_build'
make: *** [distcheck] Error 1
+ docker rmi mesos-1504227065-27679
Untagged: mesos-1504227065-27679:latest
Deleted: sha256:001b8b26df05cf76b43d9870f5cd8c50575e6bda698c8df123b11e160c7e9089
Deleted: sha256:a1439990e7e811729d047215c3e3dc22360da9ebd4182bd107cbca63ad0a972c
Deleted: sha256:cb7247b207c7bf481cc93d0f3fb677b38021e70fccdfada6c14d15a6b9451f5c
Deleted: sha256:e0b45403c696e68df27d7f07e07b1f083fd1050bf95780c3fe387695fd695226
Deleted: sha256:6aa39bd0a9f63efe426669f68629c96b8233f27056387561263ebc4f145f65c9
Deleted: sha256:511a6d6d0d76da1865b068ab18247531eaa2447357d8addcdd6bb8014b771817
Deleted: sha256:4d2ec508eeca58da9e6dd8f656267c22b054f13a50098ecbcbbf56cb661ecf87
Deleted: sha256:7bcdebe9d159e0f3bd06176fb86acb9d6a98b3baeed0ab9e113fdbc47bf4e888
Deleted: sha256:c944f7901d58075db4e0381c34c30ee1fe8a0c5d6823b49aef3cde068a10fca5
Deleted: sha256:ab2ea395807a1085d5fdab3e02a1a080bd99babc7155fb86f384999cedbc3d8f
Deleted: sha256:c214bb7270936ae94a36604a7f39a933c66416d1a1a14240abe5720babf1bd36
Deleted: sha256:f8f73858e6411dbab9c0a78e3f55f1801cb81562b2d304d8ea48668b14be14e5
Deleted: sha256:b34378691c18001a3e7f8e6cf98e1eaa598482f17dbc273e2d8dd805f667280a
Deleted: sha256:7cdda47bf43bbd7e68c0c0f709c2bbb7614257ef23aefcd9a8e15571654b5c4a
Deleted: sha256:a888d082c93da51d97048c32db64cee8488742b785b103331a6e463895ddf69d
Deleted: sha256:f62d4e341043a36b378d0bebada33feb0d25915f536e54bb8d21df59fa924728
Deleted: sha256:80fca21a3de972620bf586dd6d66265e472f3106a67e6b1db0c02d757f9e7814
Deleted: sha256:92323b385b6d168d54ea7c880ddeb3eb801ba1df2fbe5b8b9f961a4ac0ded48d
Deleted: sha256:534ccca6d6d043dd2188aac128679212e3fc77e96b8c6b8025bc8dc6bcd7bafa
Deleted: sha256:a7a10fa34435ca41ee81d73c51a30592fb0047515a850e8f583c240cd3affb0f
Deleted: sha256:fe8a44f8e1e7d94493315d941770fb8d21af4f6b16f76115641c44c809b9eca6
Deleted: sha256:28a79d55b2856bb41e3b20c552e41a7fc000e05f73442e6ca8e432723432344e
Deleted: sha256:dfff7e84e1e5c93d21bf96b78133679995317483cfeeb82812eb122335df54d4
Deleted: sha256:2716ab8d78bdcfd9fc1bfd0b9902190b38670330c41ed2041d4648fa900c8e40
Build step 'Execute shell' marked build as failure

Mime
View raw message