mesos-builds mailing list archives

Site index · List index
Message view « Date » · « Thread »
Top « Date » · « Thread »
From Apache Jenkins Server <jenk...@builds.apache.org>
Subject Build failed in Jenkins: Mesos-Reviewbot #19613
Date Thu, 28 Sep 2017 19:41:41 GMT
See <https://builds.apache.org/job/Mesos-Reviewbot/19613/display/redirect>

------------------------------------------
[...truncated 31.83 MB...]
I0928 19:41:29.132417  5801 credentials.hpp:37] Loading credentials for authentication from
'/tmp/Endpoint_SlaveEndpointTest_AuthorizedRequest_2_p0Vhz9/http_credentials'
I0928 19:41:29.132675  5801 http.cpp:1045] Creating default 'basic' HTTP authenticator for
realm 'mesos-agent-readonly'
I0928 19:41:29.132863  5801 http.cpp:1045] Creating default 'basic' HTTP authenticator for
realm 'mesos-agent-readwrite'
I0928 19:41:29.134457  5801 slave.cpp:585] Agent resources: [{"name":"cpus","scalar":{"value":2.0},"type":"SCALAR"},{"name":"mem","scalar":{"value":1024.0},"type":"SCALAR"},{"name":"disk","scalar":{"value":1024.0},"type":"SCALAR"},{"name":"ports","ranges":{"range":[{"begin":31000,"end":32000}]},"type":"RANGES"}]
I0928 19:41:29.134699  5801 slave.cpp:593] Agent attributes: [  ]
I0928 19:41:29.134714  5801 slave.cpp:602] Agent hostname: a8c7812b4ecc
I0928 19:41:29.134866  5799 status_update_manager.cpp:177] Pausing sending status updates
I0928 19:41:29.136476  5798 state.cpp:64] Recovering state from '/tmp/Endpoint_SlaveEndpointTest_AuthorizedRequest_2_EyhgC5/meta'
I0928 19:41:29.136767  5798 status_update_manager.cpp:203] Recovering status update manager
I0928 19:41:29.136960  5805 containerizer.cpp:648] Recovering containerizer
I0928 19:41:29.138322  5810 provisioner.cpp:416] Provisioner recovery complete
I0928 19:41:29.138665  5799 slave.cpp:6322] Finished recovery
I0928 19:41:29.139120  5799 slave.cpp:6504] Querying resource estimator for oversubscribable
resources
I0928 19:41:29.139387  5790 slave.cpp:6518] Received oversubscribable resources {} from the
resource estimator
I0928 19:41:29.142786  5804 process.cpp:3929] Handling HTTP event for process 'slave(811)'
with path: '/slave(811)/containers'
I0928 19:41:29.144588  5811 http.cpp:1185] HTTP GET for /slave(811)/containers from 172.17.0.2:51020
I0928 19:41:29.144668  5811 http.cpp:976] Authorizing principal 'test-principal' to GET the
'/containers' endpoint
I0928 19:41:29.148448  5771 slave.cpp:869] Agent terminating
[       OK ] Endpoint/SlaveEndpointTest.AuthorizedRequest/2 (34 ms)
[ RUN      ] Endpoint/SlaveEndpointTest.UnauthorizedRequest/0
I0928 19:41:29.163825  5771 containerizer.cpp:292] Using isolation { environment_secret, posix/cpu,
posix/mem, filesystem/posix, network/cni }
W0928 19:41:29.164402  5771 backend.cpp:76] Failed to create 'aufs' backend: AufsBackend requires
root privileges
W0928 19:41:29.164546  5771 backend.cpp:76] Failed to create 'bind' backend: BindBackend requires
root privileges
I0928 19:41:29.164577  5771 provisioner.cpp:255] Using default backend 'copy'
I0928 19:41:29.169558  5791 slave.cpp:254] Mesos agent started on (812)@172.17.0.2:38039
I0928 19:41:29.169582  5791 slave.cpp:255] Flags at startup: --acls="" --appc_simple_discovery_uri_prefix="http://"
--appc_store_dir="/tmp/Endpoint_SlaveEndpointTest_UnauthorizedRequest_0_4hkLEp/store/appc"
--authenticate_http_readonly="true" --authenticate_http_readwrite="true" --authenticatee="crammd5"
--authentication_backoff_factor="1secs" --authorizer="local" --cgroups_cpu_enable_pids_and_tids_count="false"
--cgroups_enable_cfs="false" --cgroups_hierarchy="/sys/fs/cgroup" --cgroups_limit_swap="false"
--cgroups_root="mesos" --container_disk_watch_interval="15secs" --containerizers="mesos" --credential="/tmp/Endpoint_SlaveEndpointTest_UnauthorizedRequest_0_4hkLEp/credential"
--default_role="*" --disallow_sharing_agent_pid_namespace="false" --disk_watch_interval="1mins"
--docker="docker" --docker_kill_orphans="true" --docker_registry="https://registry-1.docker.io"
--docker_remove_delay="6hrs" --docker_socket="/var/run/docker.sock" --docker_stop_timeout="0ns"
--docker_store_dir="/tmp/Endpoint_SlaveEndpointTest_UnauthorizedRequest_0_4hkLEp/store/docker"
--docker_volume_checkpoint_dir="/var/run/mesos/isolators/docker/volume" --enforce_container_disk_quota="false"
--executor_registration_timeout="1mins" --executor_reregistration_timeout="2secs" --executor_shutdown_grace_period="5secs"
--fetcher_cache_dir="/tmp/Endpoint_SlaveEndpointTest_UnauthorizedRequest_0_4hkLEp/fetch" --fetcher_cache_size="2GB"
--frameworks_home="" --gc_delay="1weeks" --gc_disk_headroom="0.1" --hadoop_home="" --help="false"
--hostname_lookup="true" --http_command_executor="false" --http_credentials="/tmp/Endpoint_SlaveEndpointTest_UnauthorizedRequest_0_4hkLEp/http_credentials"
--http_heartbeat_interval="30secs" --initialize_driver_logging="true" --isolation="posix/cpu,posix/mem"
--launcher="posix" --launcher_dir="/mesos/mesos-1.5.0/_build/src" --logbufsecs="0" --logging_level="INFO"
--max_completed_executors_per_framework="150" --oversubscribed_resources_interval="15secs"
--perf_duration="10secs" --perf_interval="1mins" --port="5051" --qos_correction_interval_min="0ns"
--quiet="false" --recover="reconnect" --recovery_timeout="15mins" --registration_backoff_factor="10ms"
--resources="cpus:2;gpus:0;mem:1024;disk:1024;ports:[31000-32000]" --revocable_cpu_low_priority="true"
--runtime_dir="/tmp/Endpoint_SlaveEndpointTest_UnauthorizedRequest_0_4hkLEp" --sandbox_directory="/mnt/mesos/sandbox"
--strict="true" --switch_user="true" --systemd_enable_support="true" --systemd_runtime_directory="/run/systemd/system"
--version="false" --work_dir="/tmp/Endpoint_SlaveEndpointTest_UnauthorizedRequest_0_hp8tCl"
--zk_session_timeout="10secs"
I0928 19:41:29.169945  5791 credentials.hpp:86] Loading credential for authentication from
'/tmp/Endpoint_SlaveEndpointTest_UnauthorizedRequest_0_4hkLEp/credential'
I0928 19:41:29.170090  5791 slave.cpp:287] Agent using credential for: test-principal
I0928 19:41:29.170120  5791 credentials.hpp:37] Loading credentials for authentication from
'/tmp/Endpoint_SlaveEndpointTest_UnauthorizedRequest_0_4hkLEp/http_credentials'
I0928 19:41:29.170410  5791 http.cpp:1045] Creating default 'basic' HTTP authenticator for
realm 'mesos-agent-readonly'
I0928 19:41:29.170600  5791 http.cpp:1045] Creating default 'basic' HTTP authenticator for
realm 'mesos-agent-readwrite'
I0928 19:41:29.172801  5791 slave.cpp:585] Agent resources: [{"name":"cpus","scalar":{"value":2.0},"type":"SCALAR"},{"name":"mem","scalar":{"value":1024.0},"type":"SCALAR"},{"name":"disk","scalar":{"value":1024.0},"type":"SCALAR"},{"name":"ports","ranges":{"range":[{"begin":31000,"end":32000}]},"type":"RANGES"}]
I0928 19:41:29.173205  5791 slave.cpp:593] Agent attributes: [  ]
I0928 19:41:29.173236  5791 slave.cpp:602] Agent hostname: a8c7812b4ecc
I0928 19:41:29.173399  5809 status_update_manager.cpp:177] Pausing sending status updates
I0928 19:41:29.175120  5797 state.cpp:64] Recovering state from '/tmp/Endpoint_SlaveEndpointTest_UnauthorizedRequest_0_hp8tCl/meta'
I0928 19:41:29.175513  5802 status_update_manager.cpp:203] Recovering status update manager
I0928 19:41:29.175761  5802 containerizer.cpp:648] Recovering containerizer
I0928 19:41:29.177278  5807 provisioner.cpp:416] Provisioner recovery complete
I0928 19:41:29.177803  5812 slave.cpp:6322] Finished recovery
I0928 19:41:29.178460  5812 slave.cpp:6504] Querying resource estimator for oversubscribable
resources
I0928 19:41:29.178690  5798 slave.cpp:6518] Received oversubscribable resources {} from the
resource estimator
I0928 19:41:29.182104  5805 process.cpp:3929] Handling HTTP event for process 'slave(812)'
with path: '/slave(812)/monitor/statistics'
I0928 19:41:29.183693  5792 http.cpp:1185] HTTP GET for /slave(812)/monitor/statistics from
172.17.0.2:51022
I0928 19:41:29.183760  5792 http.cpp:976] Authorizing principal 'test-principal' to GET the
'/monitor/statistics' endpoint
I0928 19:41:29.186575  5771 slave.cpp:869] Agent terminating
[       OK ] Endpoint/SlaveEndpointTest.UnauthorizedRequest/0 (37 ms)
[ RUN      ] Endpoint/SlaveEndpointTest.UnauthorizedRequest/1
I0928 19:41:29.198958  5771 containerizer.cpp:292] Using isolation { environment_secret, posix/cpu,
posix/mem, filesystem/posix, network/cni }
W0928 19:41:29.199548  5771 backend.cpp:76] Failed to create 'aufs' backend: AufsBackend requires
root privileges
W0928 19:41:29.199672  5771 backend.cpp:76] Failed to create 'bind' backend: BindBackend requires
root privileges
I0928 19:41:29.199703  5771 provisioner.cpp:255] Using default backend 'copy'
I0928 19:41:29.203871  5807 slave.cpp:254] Mesos agent started on (813)@172.17.0.2:38039
I0928 19:41:29.203930  5807 slave.cpp:255] Flags at startup: --acls="" --appc_simple_discovery_uri_prefix="http://"
--appc_store_dir="/tmp/Endpoint_SlaveEndpointTest_UnauthorizedRequest_1_2OJr6F/store/appc"
--authenticate_http_readonly="true" --authenticate_http_readwrite="true" --authenticatee="crammd5"
--authentication_backoff_factor="1secs" --authorizer="local" --cgroups_cpu_enable_pids_and_tids_count="false"
--cgroups_enable_cfs="false" --cgroups_hierarchy="/sys/fs/cgroup" --cgroups_limit_swap="false"
--cgroups_root="mesos" --container_disk_watch_interval="15secs" --containerizers="mesos" --credential="/tmp/Endpoint_SlaveEndpointTest_UnauthorizedRequest_1_2OJr6F/credential"
--default_role="*" --disallow_sharing_agent_pid_namespace="false" --disk_watch_interval="1mins"
--docker="docker" --docker_kill_orphans="true" --docker_registry="https://registry-1.docker.io"
--docker_remove_delay="6hrs" --docker_socket="/var/run/docker.sock" --docker_stop_timeout="0ns"
--docker_store_dir="/tmp/Endpoint_SlaveEndpointTest_UnauthorizedRequest_1_2OJr6F/store/docker"
--docker_volume_checkpoint_dir="/var/run/mesos/isolators/docker/volume" --enforce_container_disk_quota="false"
--executor_registration_timeout="1mins" --executor_reregistration_timeout="2secs" --executor_shutdown_grace_period="5secs"
--fetcher_cache_dir="/tmp/Endpoint_SlaveEndpointTest_UnauthorizedRequest_1_2OJr6F/fetch" --fetcher_cache_size="2GB"
--frameworks_home="" --gc_delay="1weeks" --gc_disk_headroom="0.1" --hadoop_home="" --help="false"
--hostname_lookup="true" --http_command_executor="false" --http_credentials="/tmp/Endpoint_SlaveEndpointTest_UnauthorizedRequest_1_2OJr6F/http_credentials"
--http_heartbeat_interval="30secs" --initialize_driver_logging="true" --isolation="posix/cpu,posix/mem"
--launcher="posix" --launcher_dir="/mesos/mesos-1.5.0/_build/src" --logbufsecs="0" --logging_level="INFO"
--max_completed_executors_per_framework="150" --oversubscribed_resources_interval="15secs"
--perf_duration="10secs" --perf_interval="1mins" --port="5051" --qos_correction_interval_min="0ns"
--quiet="false" --recover="reconnect" --recovery_timeout="15mins" --registration_backoff_factor="10ms"
--resources="cpus:2;gpus:0;mem:1024;disk:1024;ports:[31000-32000]" --revocable_cpu_low_priority="true"
--runtime_dir="/tmp/Endpoint_SlaveEndpointTest_UnauthorizedRequest_1_2OJr6F" --sandbox_directory="/mnt/mesos/sandbox"
--strict="true" --switch_user="true" --systemd_enable_support="true" --systemd_runtime_directory="/run/systemd/system"
--version="false" --work_dir="/tmp/Endpoint_SlaveEndpointTest_UnauthorizedRequest_1_1e6LYB"
--zk_session_timeout="10secs"
I0928 19:41:29.204438  5807 credentials.hpp:86] Loading credential for authentication from
'/tmp/Endpoint_SlaveEndpointTest_UnauthorizedRequest_1_2OJr6F/credential'
I0928 19:41:29.204710  5807 slave.cpp:287] Agent using credential for: test-principal
I0928 19:41:29.204732  5807 credentials.hpp:37] Loading credentials for authentication from
'/tmp/Endpoint_SlaveEndpointTest_UnauthorizedRequest_1_2OJr6F/http_credentials'
I0928 19:41:29.205021  5807 http.cpp:1045] Creating default 'basic' HTTP authenticator for
realm 'mesos-agent-readonly'
I0928 19:41:29.205257  5807 http.cpp:1045] Creating default 'basic' HTTP authenticator for
realm 'mesos-agent-readwrite'
I0928 19:41:29.206755  5807 slave.cpp:585] Agent resources: [{"name":"cpus","scalar":{"value":2.0},"type":"SCALAR"},{"name":"mem","scalar":{"value":1024.0},"type":"SCALAR"},{"name":"disk","scalar":{"value":1024.0},"type":"SCALAR"},{"name":"ports","ranges":{"range":[{"begin":31000,"end":32000}]},"type":"RANGES"}]
I0928 19:41:29.207010  5807 slave.cpp:593] Agent attributes: [  ]
I0928 19:41:29.207023  5807 slave.cpp:602] Agent hostname: a8c7812b4ecc
I0928 19:41:29.207213  5800 status_update_manager.cpp:177] Pausing sending status updates
I0928 19:41:29.208809  5802 state.cpp:64] Recovering state from '/tmp/Endpoint_SlaveEndpointTest_UnauthorizedRequest_1_1e6LYB/meta'
I0928 19:41:29.209228  5811 status_update_manager.cpp:203] Recovering status update manager
I0928 19:41:29.209497  5801 containerizer.cpp:648] Recovering containerizer
I0928 19:41:29.211098  5808 provisioner.cpp:416] Provisioner recovery complete
I0928 19:41:29.211503  5800 slave.cpp:6322] Finished recovery
I0928 19:41:29.212144  5800 slave.cpp:6504] Querying resource estimator for oversubscribable
resources
I0928 19:41:29.212461  5805 slave.cpp:6518] Received oversubscribable resources {} from the
resource estimator
I0928 19:41:29.215214  5790 process.cpp:3929] Handling HTTP event for process 'slave(813)'
with path: '/slave(813)/monitor/statistics.json'
I0928 19:41:29.216774  5796 http.cpp:1185] HTTP GET for /slave(813)/monitor/statistics.json
from 172.17.0.2:51024
I0928 19:41:29.216859  5796 http.cpp:976] Authorizing principal 'test-principal' to GET the
'/monitor/statistics.json' endpoint
I0928 19:41:29.219815  5771 slave.cpp:869] Agent terminating
[       OK ] Endpoint/SlaveEndpointTest.UnauthorizedRequest/1 (33 ms)
[ RUN      ] Endpoint/SlaveEndpointTest.UnauthorizedRequest/2
I0928 19:41:29.232594  5771 containerizer.cpp:292] Using isolation { environment_secret, posix/cpu,
posix/mem, filesystem/posix, network/cni }
W0928 19:41:29.233095  5771 backend.cpp:76] Failed to create 'aufs' backend: AufsBackend requires
root privileges
W0928 19:41:29.233224  5771 backend.cpp:76] Failed to create 'bind' backend: BindBackend requires
root privileges
I0928 19:41:29.233258  5771 provisioner.cpp:255] Using default backend 'copy'
I0928 19:41:29.237071  5791 slave.cpp:254] Mesos agent started on (814)@172.17.0.2:38039
I0928 19:41:29.237097  5791 slave.cpp:255] Flags at startup: --acls="" --appc_simple_discovery_uri_prefix="http://"
--appc_store_dir="/tmp/Endpoint_SlaveEndpointTest_UnauthorizedRequest_2_0nDaSW/store/appc"
--authenticate_http_readonly="true" --authenticate_http_readwrite="true" --authenticatee="crammd5"
--authentication_backoff_factor="1secs" --authorizer="local" --cgroups_cpu_enable_pids_and_tids_count="false"
--cgroups_enable_cfs="false" --cgroups_hierarchy="/sys/fs/cgroup" --cgroups_limit_swap="false"
--cgroups_root="mesos" --container_disk_watch_interval="15secs" --containerizers="mesos" --credential="/tmp/Endpoint_SlaveEndpointTest_UnauthorizedRequest_2_0nDaSW/credential"
--default_role="*" --disallow_sharing_agent_pid_namespace="false" --disk_watch_interval="1mins"
--docker="docker" --docker_kill_orphans="true" --docker_registry="https://registry-1.docker.io"
--docker_remove_delay="6hrs" --docker_socket="/var/run/docker.sock" --docker_stop_timeout="0ns"
--docker_store_dir="/tmp/Endpoint_SlaveEndpointTest_UnauthorizedRequest_2_0nDaSW/store/docker"
--docker_volume_checkpoint_dir="/var/run/mesos/isolators/docker/volume" --enforce_container_disk_quota="false"
--executor_registration_timeout="1mins" --executor_reregistration_timeout="2secs" --executor_shutdown_grace_period="5secs"
--fetcher_cache_dir="/tmp/Endpoint_SlaveEndpointTest_UnauthorizedRequest_2_0nDaSW/fetch" --fetcher_cache_size="2GB"
--frameworks_home="" --gc_delay="1weeks" --gc_disk_headroom="0.1" --hadoop_home="" --help="false"
--hostname_lookup="true" --http_command_executor="false" --http_credentials="/tmp/Endpoint_SlaveEndpointTest_UnauthorizedRequest_2_0nDaSW/http_credentials"
--http_heartbeat_interval="30secs" --initialize_driver_logging="true" --isolation="posix/cpu,posix/mem"
--launcher="posix" --launcher_dir="/mesos/mesos-1.5.0/_build/src" --logbufsecs="0" --logging_level="INFO"
--max_completed_executors_per_framework="150" --oversubscribed_resources_interval="15secs"
--perf_duration="10secs" --perf_interval="1mins" --port="5051" --qos_correction_interval_min="0ns"
--quiet="false" --recover="reconnect" --recovery_timeout="15mins" --registration_backoff_factor="10ms"
--resources="cpus:2;gpus:0;mem:1024;disk:1024;ports:[31000-32000]" --revocable_cpu_low_priority="true"
--runtime_dir="/tmp/Endpoint_SlaveEndpointTest_UnauthorizedRequest_2_0nDaSW" --sandbox_directory="/mnt/mesos/sandbox"
--strict="true" --switch_user="true" --systemd_enable_support="true" --systemd_runtime_directory="/run/systemd/system"
--version="false" --work_dir="/tmp/Endpoint_SlaveEndpointTest_UnauthorizedRequest_2_fI3tFS"
--zk_session_timeout="10secs"
I0928 19:41:29.237509  5791 credentials.hpp:86] Loading credential for authentication from
'/tmp/Endpoint_SlaveEndpointTest_UnauthorizedRequest_2_0nDaSW/credential'
I0928 19:41:29.237682  5791 slave.cpp:287] Agent using credential for: test-principal
I0928 19:41:29.237706  5791 credentials.hpp:37] Loading credentials for authentication from
'/tmp/Endpoint_SlaveEndpointTest_UnauthorizedRequest_2_0nDaSW/http_credentials'
I0928 19:41:29.237953  5791 http.cpp:1045] Creating default 'basic' HTTP authenticator for
realm 'mesos-agent-readonly'
I0928 19:41:29.238142  5791 http.cpp:1045] Creating default 'basic' HTTP authenticator for
realm 'mesos-agent-readwrite'
I0928 19:41:29.239595  5791 slave.cpp:585] Agent resources: [{"name":"cpus","scalar":{"value":2.0},"type":"SCALAR"},{"name":"mem","scalar":{"value":1024.0},"type":"SCALAR"},{"name":"disk","scalar":{"value":1024.0},"type":"SCALAR"},{"name":"ports","ranges":{"range":[{"begin":31000,"end":32000}]},"type":"RANGES"}]
I0928 19:41:29.239836  5791 slave.cpp:593] Agent attributes: [  ]
I0928 19:41:29.239851  5791 slave.cpp:602] Agent hostname: a8c7812b4ecc
I0928 19:41:29.240017  5806 status_update_manager.cpp:177] Pausing sending status updates
I0928 19:41:29.241734  5807 state.cpp:64] Recovering state from '/tmp/Endpoint_SlaveEndpointTest_UnauthorizedRequest_2_fI3tFS/meta'
I0928 19:41:29.242087  5790 status_update_manager.cpp:203] Recovering status update manager
I0928 19:41:29.242291  5796 containerizer.cpp:648] Recovering containerizer
I0928 19:41:29.243753  5798 provisioner.cpp:416] Provisioner recovery complete
I0928 19:41:29.244153  5799 slave.cpp:6322] Finished recovery
I0928 19:41:29.244644  5799 slave.cpp:6504] Querying resource estimator for oversubscribable
resources
I0928 19:41:29.244886  5795 slave.cpp:6518] Received oversubscribable resources {} from the
resource estimator
I0928 19:41:29.247978  5811 process.cpp:3929] Handling HTTP event for process 'slave(814)'
with path: '/slave(814)/containers'
I0928 19:41:29.249217  5794 http.cpp:1185] HTTP GET for /slave(814)/containers from 172.17.0.2:51026
I0928 19:41:29.249299  5794 http.cpp:976] Authorizing principal 'test-principal' to GET the
'/containers' endpoint
I0928 19:41:29.252033  5802 slave.cpp:869] Agent terminating
[       OK ] Endpoint/SlaveEndpointTest.UnauthorizedRequest/2 (32 ms)
[ RUN      ] Endpoint/SlaveEndpointTest.NoAuthorizer/0
I0928 19:41:29.265338  5771 containerizer.cpp:292] Using isolation { environment_secret, posix/cpu,
posix/mem, filesystem/posix, network/cni }
W0928 19:41:29.265825  5771 backend.cpp:76] Failed to create 'aufs' backend: AufsBackend requires
root privileges
W0928 19:41:29.265933  5771 backend.cpp:76] Failed to create 'bind' backend: BindBackend requires
root privileges
I0928 19:41:29.265964  5771 provisioner.cpp:255] Using default backend 'copy'
I0928 19:41:29.268038  5771 cluster.cpp:448] Creating default 'local' authorizer
I0928 19:41:29.270319  5795 slave.cpp:254] Mesos agent started on (815)@172.17.0.2:38039
I0928 19:41:29.270380  5795 slave.cpp:255] Flags at startup: --acls="" --appc_simple_discovery_uri_prefix="http://"
--appc_store_dir="/tmp/Endpoint_SlaveEndpointTest_NoAuthorizer_0_6DTdXd/store/appc" --authenticate_http_readonly="true"
--authenticate_http_readwrite="true" --authenticatee="crammd5" --authentication_backoff_factor="1secs"
--authorizer="local" --cgroups_cpu_enable_pids_and_tids_count="false" --cgroups_enable_cfs="false"
--cgroups_hierarchy="/sys/fs/cgroup" --cgroups_limit_swap="false" --cgroups_root="mesos" --container_disk_watch_interval="15secs"
--containerizers="mesos" --credential="/tmp/Endpoint_SlaveEndpointTest_NoAuthorizer_0_6DTdXd/credential"
--default_role="*" --disallow_sharing_agent_pid_namespace="false" --disk_watch_interval="1mins"
--docker="docker" --docker_kill_orphans="true" --docker_registry="https://registry-1.docker.io"
--docker_remove_delay="6hrs" --docker_socket="/var/run/docker.sock" --docker_stop_timeout="0ns"
--docker_store_dir="/tmp/Endpoint_SlaveEndpointTest_NoAuthorizer_0_6DTdXd/store/docker" --docker_volume_checkpoint_dir="/var/run/mesos/isolators/docker/volume"
--enforce_container_disk_quota="false" --executor_registration_timeout="1mins" --executor_reregistration_timeout="2secs"
--executor_shutdown_grace_period="5secs" --fetcher_cache_dir="/tmp/Endpoint_SlaveEndpointTest_NoAuthorizer_0_6DTdXd/fetch"
--fetcher_cache_size="2GB" --frameworks_home="" --gc_delay="1weeks" --gc_disk_headroom="0.1"
--hadoop_home="" --help="false" --hostname_lookup="true" --http_command_executor="false" --http_credentials="/tmp/Endpoint_SlaveEndpointTest_NoAuthorizer_0_6DTdXd/http_credentials"
--http_heartbeat_interval="30secs" --initialize_driver_logging="true" --isolation="posix/cpu,posix/mem"
--launcher="posix" --launcher_dir="/mesos/mesos-1.5.0/_build/src" --logbufsecs="0" --logging_level="INFO"
--max_completed_executors_per_framework="150" --oversubscribed_resources_interval="15secs"
--perf_duration="10secs" --perf_interval="1mins" --port="5051" --qos_correction_interval_min="0ns"
--quiet="false" --recover="reconnect" --recovery_timeout="15mins" --registration_backoff_factor="10ms"
--resources="cpus:2;gpus:0;mem:1024;disk:1024;ports:[31000-32000]" --revocable_cpu_low_priority="true"
--runtime_dir="/tmp/Endpoint_SlaveEndpointTest_NoAuthorizer_0_6DTdXd" --sandbox_directory="/mnt/mesos/sandbox"
--strict="true" --switch_user="true" --systemd_enable_support="true" --systemd_runtime_directory="/run/systemd/system"
--version="false" --work_dir="/tmp/Endpoint_SlaveEndpointTest_NoAuthorizer_0_Ff4HF9" --zk_session_timeout="10secs"
I0928 19:41:29.270851  5795 credentials.hpp:86] Loading credential for authentication from
'/tmp/Endpoint_SlaveEndpointTest_NoAuthorizer_0_6DTdXd/credential'
I0928 19:41:29.271054  5795 slave.cpp:287] Agent using credential for: test-principal
I0928 19:41:29.271077  5795 credentials.hpp:37] Loading credentials for authentication from
'/tmp/Endpoint_SlaveEndpointTest_NoAuthorizer_0_6DTdXd/http_credentials'
I0928 19:41:29.271385  5795 http.cpp:1045] Creating default 'basic' HTTP authenticator for
realm 'mesos-agent-readonly'
I0928 19:41:29.271605  5795 http.cpp:1045] Creating default 'basic' HTTP authenticator for
realm 'mesos-agent-readwrite'
I0928 19:41:29.273169  5795 slave.cpp:585] Agent resources: [{"name":"cpus","scalar":{"value":2.0},"type":"SCALAR"},{"name":"mem","scalar":{"value":1024.0},"type":"SCALAR"},{"name":"disk","scalar":{"value":1024.0},"type":"SCALAR"},{"name":"ports","ranges":{"range":[{"begin":31000,"end":32000}]},"type":"RANGES"}]
I0928 19:41:29.273416  5795 slave.cpp:593] Agent attributes: [  ]
I0928 19:41:29.273430  5795 slave.cpp:602] Agent hostname: a8c7812b4ecc
I0928 19:41:29.273620  5790 status_update_manager.cpp:177] Pausing sending status updates
I0928 19:41:29.275365  5794 state.cpp:64] Recovering state from '/tmp/Endpoint_SlaveEndpointTest_NoAuthorizer_0_Ff4HF9/meta'
I0928 19:41:29.275735  5792 status_update_manager.cpp:203] Recovering status update manager
I0928 19:41:29.275972  5801 containerizer.cpp:648] Recovering containerizer
I0928 19:41:29.277709  5808 provisioner.cpp:416] Provisioner recovery complete
I0928 19:41:29.278163  5790 slave.cpp:6322] Finished recovery
I0928 19:41:29.278695  5790 slave.cpp:6504] Querying resource estimator for oversubscribable
resources
I0928 19:41:29.278995  5798 slave.cpp:6518] Received oversubscribable resources {} from the
resource estimator
I0928 19:41:29.281533  5803 process.cpp:3929] Handling HTTP event for process 'slave(815)'
with path: '/slave(815)/monitor/statistics'
I0928 19:41:29.283190  5800 http.cpp:1185] HTTP GET for /slave(815)/monitor/statistics from
172.17.0.2:51028
I0928 19:41:29.283306  5800 http.cpp:976] Authorizing principal 'test-principal' to GET the
'/monitor/statistics' endpoint
I0928 19:41:29.287062  5805 slave.cpp:869] Agent terminating
[       OK ] Endpoint/SlaveEndpointTest.NoAuthorizer/0 (34 ms)
[ RUN      ] Endpoint/SlaveEndpointTest.NoAuthorizer/1
I0928 19:41:29.299460  5771 containerizer.cpp:292] Using isolation { environment_secret, posix/cpu,
posix/mem, filesystem/posix, network/cni }
W0928 19:41:29.300004  5771 backend.cpp:76] Failed to create 'aufs' backend: AufsBackend requires
root privileges
W0928 19:41:29.300135  5771 backend.cpp:76] Failed to create 'bind' backend: BindBackend requires
root privileges
I0928 19:41:29.300179  5771 provisioner.cpp:255] Using default backend 'copy'
I0928 19:41:29.302070  5771 cluster.cpp:448] Creating default 'local' authorizer
I0928 19:41:29.304330  5792 slave.cpp:254] Mesos agent started on (816)@172.17.0.2:38039
I0928 19:41:29.304361  5792 slave.cpp:255] Flags at startup: --acls="" --appc_simple_discovery_uri_prefix="http://"
--appc_store_dir="/tmp/Endpoint_SlaveEndpointTest_NoAuthorizer_1_cWgymv/store/appc" --authenticate_http_readonly="true"
--authenticate_http_readwrite="true" --authenticatee="crammd5" --authentication_backoff_factor="1secs"
--authorizer="local" --cgroups_cpu_enable_pids_and_tids_count="false" --cgroups_enable_cfs="false"
--cgroups_hierarchy="/sys/fs/cgroup" --cgroups_limit_swap="false" --cgroups_root="mesos" --container_disk_watch_interval="15secs"
--containerizers="mesos" --credential="/tmp/Endpoint_SlaveEndpointTest_NoAuthorizer_1_cWgymv/credential"
--default_role="*" --disallow_sharing_agent_pid_namespace="false" --disk_watch_interval="1mins"
--docker="docker" --docker_kill_orphans="true" --docker_registry="https://registry-1.docker.io"
--docker_remove_delay="6hrs" --docker_socket="/var/run/docker.sock" --docker_stop_timeout="0ns"
--docker_store_dir="/tmp/Endpoint_SlaveEndpointTest_NoAuthorizer_1_cWgymv/store/docker" --docker_volume_checkpoint_dir="/var/run/mesos/isolators/docker/volume"
--enforce_container_disk_quota="false" --executor_registration_timeout="1mins" --executor_reregistration_timeout="2secs"
--executor_shutdown_grace_period="5secs" --fetcher_cache_dir="/tmp/Endpoint_SlaveEndpointTest_NoAuthorizer_1_cWgymv/fetch"
--fetcher_cache_size="2GB" --frameworks_home="" --gc_delay="1weeks" --gc_disk_headroom="0.1"
--hadoop_home="" --help="false" --hostname_lookup="true" --http_command_executor="false" --http_credentials="/tmp/Endpoint_SlaveEndpointTest_NoAuthorizer_1_cWgymv/http_credentials"
--http_heartbeat_interval="30secs" --initialize_driver_logging="true" --isolation="posix/cpu,posix/mem"
--launcher="posix" --launcher_dir="/mesos/mesos-1.5.0/_build/src" --logbufsecs="0" --logging_level="INFO"
--max_completed_executors_per_framework="150" --oversubscribed_resources_interval="15secs"
--perf_duration="10secs" --perf_interval="1mins" --port="5051" --qos_correction_interval_min="0ns"
--quiet="false" --recover="reconnect" --recovery_timeout="15mins" --registration_backoff_factor="10ms"
--resources="cpus:2;gpus:0;mem:1024;disk:1024;ports:[31000-32000]" --revocable_cpu_low_priority="true"
--runtime_dir="/tmp/Endpoint_SlaveEndpointTest_NoAuthorizer_1_cWgymv" --sandbox_directory="/mnt/mesos/sandbox"
--strict="true" --switch_user="true" --systemd_enable_support="true" --systemd_runtime_directory="/run/systemd/system"
--version="false" --work_dir="/tmp/Endpoint_SlaveEndpointTest_NoAuthorizer_1_rhUXZq" --zk_session_timeout="10secs"
I0928 19:41:29.304774  5792 credentials.hpp:86] Loading credential for authentication from
'/tmp/Endpoint_SlaveEndpointTest_NoAuthorizer_1_cWgymv/credential'
I0928 19:41:29.304986  5792 slave.cpp:287] Agent using credential for: test-principal
I0928 19:41:29.305013  5792 credentials.hpp:37] Loading credentials for authentication from
'/tmp/Endpoint_SlaveEndpointTest_NoAuthorizer_1_cWgymv/http_credentials'
I0928 19:41:29.305291  5792 http.cpp:1045] Creating default 'basic' HTTP authenticator for
realm 'mesos-agent-readonly'
I0928 19:41:29.305472  5792 http.cpp:1045] Creating default 'basic' HTTP authenticator for
realm 'mesos-agent-readwrite'
I0928 19:41:29.306989  5792 slave.cpp:585] Agent resources: [{"name":"cpus","scalar":{"value":2.0},"type":"SCALAR"},{"name":"mem","scalar":{"value":1024.0},"type":"SCALAR"},{"name":"disk","scalar":{"value":1024.0},"type":"SCALAR"},{"name":"ports","ranges":{"range":[{"begin":31000,"end":32000}]},"type":"RANGES"}]
I0928 19:41:29.307235  5792 slave.cpp:593] Agent attributes: [  ]
I0928 19:41:29.307252  5792 slave.cpp:602] Agent hostname: a8c7812b4ecc
I0928 19:41:29.307512  5791 status_update_manager.cpp:177] Pausing sending status updates
I0928 19:41:29.309425  5799 state.cpp:64] Recovering state from '/tmp/Endpoint_SlaveEndpointTest_NoAuthorizer_1_rhUXZq/meta'
I0928 19:41:29.309831  5799 status_update_manager.cpp:203] Recovering status update manager
I0928 19:41:29.310076  5795 containerizer.cpp:648] Recovering containerizer
I0928 19:41:29.311600  5803 provisioner.cpp:416] Provisioner recovery complete
I0928 19:41:29.312178  5802 slave.cpp:6322] Finished recovery
I0928 19:41:29.312680  5802 slave.cpp:6504] Querying resource estimator for oversubscribable
resources
I0928 19:41:29.312922  5800 slave.cpp:6518] Received oversubscribable resources {} from the
resource estimator
I0928 19:41:29.315358  5790 process.cpp:3929] Handling HTTP event for process 'slave(816)'
with path: '/slave(816)/monitor/statistics.json'
I0928 19:41:29.316840  5804 http.cpp:1185] HTTP GET for /slave(816)/monitor/statistics.json
from 172.17.0.2:51030
I0928 19:41:29.316969  5804 http.cpp:976] Authorizing principal 'test-principal' to GET the
'/monitor/statistics.json' endpoint
I0928 19:41:29.320580  5771 slave.cpp:869] Agent terminating
[       OK ] Endpoint/SlaveEndpointTest.NoAuthorizer/1 (34 ms)
[ RUN      ] Endpoint/SlaveEndpointTest.NoAuthorizer/2
I0928 19:41:29.333644  5771 containerizer.cpp:292] Using isolation { environment_secret, posix/cpu,
posix/mem, filesystem/posix, network/cni }
W0928 19:41:29.334133  5771 backend.cpp:76] Failed to create 'aufs' backend: AufsBackend requires
root privileges
W0928 19:41:29.334244  5771 backend.cpp:76] Failed to create 'bind' backend: BindBackend requires
root privileges
I0928 19:41:29.334290  5771 provisioner.cpp:255] Using default backend 'copy'
I0928 19:41:29.336005  5771 cluster.cpp:448] Creating default 'local' authorizer
I0928 19:41:29.338275  5798 slave.cpp:254] Mesos agent started on (817)@172.17.0.2:38039
I0928 19:41:29.338299  5798 slave.cpp:255] Flags at startup: --acls="" --appc_simple_discovery_uri_prefix="http://"
--appc_store_dir="/tmp/Endpoint_SlaveEndpointTest_NoAuthorizer_2_Iyui6M/store/appc" --authenticate_http_readonly="true"
--authenticate_http_readwrite="true" --authenticatee="crammd5" --authentication_backoff_factor="1secs"
--authorizer="local" --cgroups_cpu_enable_pids_and_tids_count="false" --cgroups_enable_cfs="false"
--cgroups_hierarchy="/sys/fs/cgroup" --cgroups_limit_swap="false" --cgroups_root="mesos" --container_disk_watch_interval="15secs"
--containerizers="mesos" --credential="/tmp/Endpoint_SlaveEndpointTest_NoAuthorizer_2_Iyui6M/credential"
--default_role="*" --disallow_sharing_agent_pid_namespace="false" --disk_watch_interval="1mins"
--docker="docker" --docker_kill_orphans="true" --docker_registry="https://registry-1.docker.io"
--docker_remove_delay="6hrs" --docker_socket="/var/run/docker.sock" --docker_stop_timeout="0ns"
--docker_store_dir="/tmp/Endpoint_SlaveEndpointTest_NoAuthorizer_2_Iyui6M/store/docker" --docker_volume_checkpoint_dir="/var/run/mesos/isolators/docker/volume"
--enforce_container_disk_quota="false" --executor_registration_timeout="1mins" --executor_reregistration_timeout="2secs"
--executor_shutdown_grace_period="5secs" --fetcher_cache_dir="/tmp/Endpoint_SlaveEndpointTest_NoAuthorizer_2_Iyui6M/fetch"
--fetcher_cache_size="2GB" --frameworks_home="" --gc_delay="1weeks" --gc_disk_headroom="0.1"
--hadoop_home="" --help="false" --hostname_lookup="true" --http_command_executor="false" --http_credentials="/tmp/Endpoint_SlaveEndpointTest_NoAuthorizer_2_Iyui6M/http_credentials"
--http_heartbeat_interval="30secs" --initialize_driver_logging="true" --isolation="posix/cpu,posix/mem"
--launcher="posix" --launcher_dir="/mesos/mesos-1.5.0/_build/src" --logbufsecs="0" --logging_level="INFO"
--max_completed_executors_per_framework="150" --oversubscribed_resources_interval="15secs"
--perf_duration="10secs" --perf_interval="1mins" --port="5051" --qos_correction_interval_min="0ns"
--quiet="false" --recover="reconnect" --recovery_timeout="15mins" --registration_backoff_factor="10ms"
--resources="cpus:2;gpus:0;mem:1024;disk:1024;ports:[31000-32000]" --revocable_cpu_low_priority="true"
--runtime_dir="/tmp/Endpoint_SlaveEndpointTest_NoAuthorizer_2_Iyui6M" --sandbox_directory="/mnt/mesos/sandbox"
--strict="true" --switch_user="true" --systemd_enable_support="true" --systemd_runtime_directory="/run/systemd/system"
--version="false" --work_dir="/tmp/Endpoint_SlaveEndpointTest_NoAuthorizer_2_HbBBEI" --zk_session_timeout="10secs"
I0928 19:41:29.338680  5798 credentials.hpp:86] Loading credential for authentication from
'/tmp/Endpoint_SlaveEndpointTest_NoAuthorizer_2_Iyui6M/credential'
I0928 19:41:29.338845  5798 slave.cpp:287] Agent using credential for: test-principal
I0928 19:41:29.338870  5798 credentials.hpp:37] Loading credentials for authentication from
'/tmp/Endpoint_SlaveEndpointTest_NoAuthorizer_2_Iyui6M/http_credentials'
I0928 19:41:29.339105  5798 http.cpp:1045] Creating default 'basic' HTTP authenticator for
realm 'mesos-agent-readonly'
I0928 19:41:29.339263  5798 http.cpp:1045] Creating default 'basic' HTTP authenticator for
realm 'mesos-agent-readwrite'
I0928 19:41:29.340593  5798 slave.cpp:585] Agent resources: [{"name":"cpus","scalar":{"value":2.0},"type":"SCALAR"},{"name":"mem","scalar":{"value":1024.0},"type":"SCALAR"},{"name":"disk","scalar":{"value":1024.0},"type":"SCALAR"},{"name":"ports","ranges":{"range":[{"begin":31000,"end":32000}]},"type":"RANGES"}]
I0928 19:41:29.340827  5798 slave.cpp:593] Agent attributes: [  ]
I0928 19:41:29.340843  5798 slave.cpp:602] Agent hostname: a8c7812b4ecc
I0928 19:41:29.340966  5804 status_update_manager.cpp:177] Pausing sending status updates
I0928 19:41:29.342407  5803 state.cpp:64] Recovering state from '/tmp/Endpoint_SlaveEndpointTest_NoAuthorizer_2_HbBBEI/meta'
I0928 19:41:29.342710  5792 status_update_manager.cpp:203] Recovering status update manager
I0928 19:41:29.342924  5805 containerizer.cpp:648] Recovering containerizer
I0928 19:41:29.344449  5800 provisioner.cpp:416] Provisioner recovery complete
I0928 19:41:29.344823  5804 slave.cpp:6322] Finished recovery
I0928 19:41:29.345306  5804 slave.cpp:6504] Querying resource estimator for oversubscribable
resources
I0928 19:41:29.345538  5801 slave.cpp:6518] Received oversubscribable resources {} from the
resource estimator
I0928 19:41:29.348453  5793 process.cpp:3929] Handling HTTP event for process 'slave(817)'
with path: '/slave(817)/containers'
I0928 19:41:29.349906  5799 http.cpp:1185] HTTP GET for /slave(817)/containers from 172.17.0.2:51032
I0928 19:41:29.350003  5799 http.cpp:976] Authorizing principal 'test-principal' to GET the
'/containers' endpoint
I0928 19:41:29.354293  5791 slave.cpp:869] Agent terminating
[       OK ] Endpoint/SlaveEndpointTest.NoAuthorizer/2 (31 ms)
[----------] 9 tests from Endpoint/SlaveEndpointTest (316 ms total)

[----------] 2 tests from ContainerizerType/DefaultContainerDNSFlagTest
[ RUN      ] ContainerizerType/DefaultContainerDNSFlagTest.ValidateFlag/0
[       OK ] ContainerizerType/DefaultContainerDNSFlagTest.ValidateFlag/0 (10 ms)
[ RUN      ] ContainerizerType/DefaultContainerDNSFlagTest.ValidateFlag/1
[       OK ] ContainerizerType/DefaultContainerDNSFlagTest.ValidateFlag/1 (10 ms)
[----------] 2 tests from ContainerizerType/DefaultContainerDNSFlagTest (20 ms total)

[----------] Global test environment tear-down
[==========] 1676 tests from 184 test cases ran. (837174 ms total)
[  PASSED  ] 1675 tests.
[  FAILED  ] 1 test, listed below:
[  FAILED  ] ExamplesTest.NoExecutorFramework

 1 FAILED TEST
  YOU HAVE 20 DISABLED TESTS

I0928 19:41:29.436759  5814 process.cpp:1068] Failed to accept socket: future discarded
make[4]: *** [check-local] Error 1
make[4]: Leaving directory `/mesos/mesos-1.5.0/_build/src'
make[3]: *** [check-am] Error 2
make[3]: Leaving directory `/mesos/mesos-1.5.0/_build/src'
make[2]: *** [check] Error 2
make[2]: Leaving directory `/mesos/mesos-1.5.0/_build/src'
make[1]: *** [check-recursive] Error 1
make[1]: Leaving directory `/mesos/mesos-1.5.0/_build'
make: *** [distcheck] Error 1
+ docker rmi mesos-1506624088-17779
Untagged: mesos-1506624088-17779:latest
Deleted: sha256:d3109e0b6f04713462942b3d9a12a2f3b0d66a54fb5c2f03f4ca0ade0e30d152
Deleted: sha256:99b602cfebbae6271a9c9081f44ea056e617499015cc798cf43cce2bfe63cd60
Deleted: sha256:6056c1b5b5f89223fbf54fb2d0a9e1c73c96e157bf807fa1b1529e2800db7453
Deleted: sha256:a369e996979cb4a3889d52691fb8c74cc799604be7eba852a5722039ddcf52c6
Deleted: sha256:6d5150b9ce0bdab0c1ab5d589aa465cd4b825ece6d1e51097fa097cb3f373f8d
Deleted: sha256:2e694f0cf264e8e93b7a10b404bef3cf728a95f22d7aa7a986f16ca246e376f1
Deleted: sha256:da410b7cf1bdb773fed119729a656f9ee7e125f5234091e6469247abb15a9fbe
Deleted: sha256:e093a257c5e0e0a10750b972daa9ac0032e8227a34f29d3a1b8dce18b583e528
Deleted: sha256:b6b98319d0dfcb11097129adce8b4c826e2aebda6d05bb7d0ca14e3ebbfd935b
Deleted: sha256:750b41a3d4a6451751eabdd974ff695225009df2388ceb3c333d0dbef46fe362
Deleted: sha256:c160cffcb7a7bd7cf95beae4c7be6f31713c908c08f82615d8ccc29d42ca3b24
Deleted: sha256:e7284e8e5b3d561ac6adf81f1773adc75492862596617fef273c3aaddc069190
Deleted: sha256:099e166d66e18196771c85a338cb58bf251ae124166fd025f5aad3782ace5961
Deleted: sha256:5124a94aa498e6a4108130a04a7ab95d7f26a5e9d9ce9f9c8ee85b451e9b9ff8
Deleted: sha256:4ba115563ed31aa2da1a94ec44827e75139a8b9fa70936fae3763ae120dc82d8
Deleted: sha256:1dbfaaa2f0dab0dca5b07c10e6126da73ee7a9936cedc579090b4c4dd4bc479c
Deleted: sha256:00f871bb411d17476da3586e5dfe928295d1abb97dc23c0a06f113c82257d5db
Deleted: sha256:ae7fb385b7f1a2cc2bf96e1b10fa212992bfc47851d238700c3676554bc9a054
Deleted: sha256:6646a3a43f4d29e73fd59c4c0bde90e5f4a824f03a5d2a8f2759c9f99ba2bd25
Deleted: sha256:35a148b43650fb225e1fd33f5063c2ac735b3cf1449fa2d5bc4a33ec2b761069
Deleted: sha256:2f6d84d40baec6b398392d50c0eee7014dd6559912ca4931661b8399a2397133
Deleted: sha256:0da09556333a59b89d619403c64d85c2cb5ffd6684154e41fc5d3b41a841e626
Deleted: sha256:548d17ec6be3d6c6015492fdafe8609d434ebb0393b8d1a914c7fe5be0e5c633
Deleted: sha256:6488f1901289f65d02d45542668e64cd56925d0c04a19e0d0acd460ef9b237fa
Deleted: sha256:76773fe3aed55a3c08312d2f4af6022539f8311355cee7bbedc46d980e5fc79e
Deleted: sha256:8e75e1766ad6d75252b9fa3eba5b844bf878b6bf8ffe465c4305d9dad76c1a91
Deleted: sha256:0f13c0ae18823b86e992aea709133cf2ad52e7dd035d4e3e5c54bbb21cc8f7d2
Deleted: sha256:99bdd0e96a104d2c55335702d71de19ac958bf4d3e3d1ef7ad47bde95b37d489
Build step 'Execute shell' marked build as failure

Mime
View raw message