mesos-builds mailing list archives

Site index · List index
Message view « Date » · « Thread »
Top « Date » · « Thread »
From Apache Jenkins Server <jenk...@builds.apache.org>
Subject Build failed in Jenkins: Mesos-Buildbot » cmake,gcc,--verbose,GLOG_v=1 MESOS_VERBOSE=1,ubuntu:14.04,(ubuntu)&&(!ubuntu-us1)&&(!ubuntu-eu2)&&(!qnode3)&&(!H23) #4226
Date Fri, 15 Sep 2017 11:34:27 GMT
See <https://builds.apache.org/job/Mesos-Buildbot/BUILDTOOL=cmake,COMPILER=gcc,CONFIGURATION=--verbose,ENVIRONMENT=GLOG_v=1%20MESOS_VERBOSE=1,OS=ubuntu%3A14.04,label_exp=(ubuntu)&&(!ubuntu-us1)&&(!ubuntu-eu2)&&(!qnode3)&&(!H23)/4226/display/redirect?page=changes>

Changes:

[alexr] Added workaround for a docker bug in docker build helper.

------------------------------------------
[...truncated 29.15 MB...]
3: I0915 11:34:18.896056 17227 http.cpp:1045] Creating default 'basic' HTTP authenticator
for realm 'mesos-agent-readonly'
3: I0915 11:34:18.896289 17227 http.cpp:1045] Creating default 'basic' HTTP authenticator
for realm 'mesos-agent-readwrite'
3: I0915 11:34:18.898077 17227 slave.cpp:583] Agent resources: [{"name":"cpus","scalar":{"value":2.0},"type":"SCALAR"},{"name":"mem","scalar":{"value":1024.0},"type":"SCALAR"},{"name":"disk","scalar":{"value":1024.0},"type":"SCALAR"},{"name":"ports","ranges":{"range":[{"begin":31000,"end":32000}]},"type":"RANGES"}]
3: I0915 11:34:18.898360 17227 slave.cpp:591] Agent attributes: [  ]
3: I0915 11:34:18.898386 17227 slave.cpp:600] Agent hostname: 7db44c662750
3: I0915 11:34:18.898538 17234 status_update_manager.cpp:177] Pausing sending status updates
3: I0915 11:34:18.900132 17242 state.cpp:64] Recovering state from '/tmp/Endpoint_SlaveEndpointTest_AuthorizedRequest_2_KEdBXo/meta'
3: I0915 11:34:18.900394 17224 status_update_manager.cpp:203] Recovering status update manager
3: I0915 11:34:18.900624 17228 containerizer.cpp:648] Recovering containerizer
3: I0915 11:34:18.901942 17230 provisioner.cpp:416] Provisioner recovery complete
3: I0915 11:34:18.902245 17234 slave.cpp:6298] Finished recovery
3: I0915 11:34:18.902796 17234 slave.cpp:6480] Querying resource estimator for oversubscribable
resources
3: I0915 11:34:18.903193 17242 slave.cpp:6494] Received oversubscribable resources {} from
the resource estimator
3: I0915 11:34:18.905537 17235 process.cpp:3929] Handling HTTP event for process 'slave(807)'
with path: '/slave(807)/containers'
3: I0915 11:34:18.906639 17235 http.cpp:1185] HTTP GET for /slave(807)/containers from 172.17.0.8:54426
3: I0915 11:34:18.906720 17235 http.cpp:976] Authorizing principal 'test-principal' to GET
the '/containers' endpoint
3: I0915 11:34:18.910437 17223 slave.cpp:861] Agent terminating
3: [       OK ] Endpoint/SlaveEndpointTest.AuthorizedRequest/2 (31 ms)
3: [ RUN      ] Endpoint/SlaveEndpointTest.UnauthorizedRequest/0
3: I0915 11:34:18.922503 17223 containerizer.cpp:292] Using isolation { environment_secret,
posix/cpu, posix/mem, filesystem/posix, network/cni }
3: W0915 11:34:18.923069 17223 backend.cpp:76] Failed to create 'aufs' backend: AufsBackend
requires root privileges
3: W0915 11:34:18.923193 17223 backend.cpp:76] Failed to create 'bind' backend: BindBackend
requires root privileges
3: I0915 11:34:18.923240 17223 provisioner.cpp:255] Using default backend 'copy'
3: I0915 11:34:18.927325 17233 slave.cpp:252] Mesos agent started on (808)@172.17.0.8:42877
3: I0915 11:34:18.927357 17233 slave.cpp:253] Flags at startup: --acls="" --appc_simple_discovery_uri_prefix="http://"
--appc_store_dir="/tmp/Endpoint_SlaveEndpointTest_UnauthorizedRequest_0_ejUDvp/store/appc"
--authenticate_http_readonly="true" --authenticate_http_readwrite="true" --authenticatee="crammd5"
--authentication_backoff_factor="1secs" --authorizer="local" --cgroups_cpu_enable_pids_and_tids_count="false"
--cgroups_enable_cfs="false" --cgroups_hierarchy="/sys/fs/cgroup" --cgroups_limit_swap="false"
--cgroups_root="mesos" --container_disk_watch_interval="15secs" --containerizers="mesos" --credential="/tmp/Endpoint_SlaveEndpointTest_UnauthorizedRequest_0_ejUDvp/credential"
--default_role="*" --disallow_sharing_agent_pid_namespace="false" --disk_watch_interval="1mins"
--docker="docker" --docker_kill_orphans="true" --docker_registry="https://registry-1.docker.io"
--docker_remove_delay="6hrs" --docker_socket="/var/run/docker.sock" --docker_stop_timeout="0ns"
--docker_store_dir="/tmp/Endpoint_SlaveEndpointTest_UnauthorizedRequest_0_ejUDvp/store/docker"
--docker_volume_checkpoint_dir="/var/run/mesos/isolators/docker/volume" --enforce_container_disk_quota="false"
--executor_registration_timeout="1mins" --executor_reregistration_timeout="2secs" --executor_shutdown_grace_period="5secs"
--fetcher_cache_dir="/tmp/Endpoint_SlaveEndpointTest_UnauthorizedRequest_0_ejUDvp/fetch" --fetcher_cache_size="2GB"
--frameworks_home="" --gc_delay="1weeks" --gc_disk_headroom="0.1" --hadoop_home="" --help="false"
--hostname_lookup="true" --http_command_executor="false" --http_credentials="/tmp/Endpoint_SlaveEndpointTest_UnauthorizedRequest_0_ejUDvp/http_credentials"
--http_heartbeat_interval="30secs" --initialize_driver_logging="true" --isolation="posix/cpu,posix/mem"
--launcher="posix" --launcher_dir="/mesos/build/src" --logbufsecs="0" --logging_level="INFO"
--max_completed_executors_per_framework="150" --oversubscribed_resources_interval="15secs"
--perf_duration="10secs" --perf_interval="1mins" --port="5051" --qos_correction_interval_min="0ns"
--quiet="false" --recover="reconnect" --recovery_timeout="15mins" --registration_backoff_factor="10ms"
--resources="cpus:2;gpus:0;mem:1024;disk:1024;ports:[31000-32000]" --revocable_cpu_low_priority="true"
--runtime_dir="/tmp/Endpoint_SlaveEndpointTest_UnauthorizedRequest_0_ejUDvp" --sandbox_directory="/mnt/mesos/sandbox"
--strict="true" --switch_user="true" --systemd_enable_support="true" --systemd_runtime_directory="/run/systemd/system"
--version="false" --work_dir="/tmp/Endpoint_SlaveEndpointTest_UnauthorizedRequest_0_lo3jnp"
--zk_session_timeout="10secs"
3: I0915 11:34:18.927827 17233 credentials.hpp:86] Loading credential for authentication from
'/tmp/Endpoint_SlaveEndpointTest_UnauthorizedRequest_0_ejUDvp/credential'
3: I0915 11:34:18.928052 17233 slave.cpp:285] Agent using credential for: test-principal
3: I0915 11:34:18.928067 17233 credentials.hpp:37] Loading credentials for authentication
from '/tmp/Endpoint_SlaveEndpointTest_UnauthorizedRequest_0_ejUDvp/http_credentials'
3: I0915 11:34:18.928292 17233 http.cpp:1045] Creating default 'basic' HTTP authenticator
for realm 'mesos-agent-readonly'
3: I0915 11:34:18.928499 17233 http.cpp:1045] Creating default 'basic' HTTP authenticator
for realm 'mesos-agent-readwrite'
3: I0915 11:34:18.929864 17233 slave.cpp:583] Agent resources: [{"name":"cpus","scalar":{"value":2.0},"type":"SCALAR"},{"name":"mem","scalar":{"value":1024.0},"type":"SCALAR"},{"name":"disk","scalar":{"value":1024.0},"type":"SCALAR"},{"name":"ports","ranges":{"range":[{"begin":31000,"end":32000}]},"type":"RANGES"}]
3: I0915 11:34:18.930074 17233 slave.cpp:591] Agent attributes: [  ]
3: I0915 11:34:18.930086 17233 slave.cpp:600] Agent hostname: 7db44c662750
3: I0915 11:34:18.930227 17234 status_update_manager.cpp:177] Pausing sending status updates
3: I0915 11:34:18.931723 17225 state.cpp:64] Recovering state from '/tmp/Endpoint_SlaveEndpointTest_UnauthorizedRequest_0_lo3jnp/meta'
3: I0915 11:34:18.932026 17238 status_update_manager.cpp:203] Recovering status update manager
3: I0915 11:34:18.932227 17238 containerizer.cpp:648] Recovering containerizer
3: I0915 11:34:18.933531 17237 provisioner.cpp:416] Provisioner recovery complete
3: I0915 11:34:18.933828 17247 slave.cpp:6298] Finished recovery
3: I0915 11:34:18.934345 17247 slave.cpp:6480] Querying resource estimator for oversubscribable
resources
3: I0915 11:34:18.934612 17224 slave.cpp:6494] Received oversubscribable resources {} from
the resource estimator
3: I0915 11:34:18.937377 17231 process.cpp:3929] Handling HTTP event for process 'slave(808)'
with path: '/slave(808)/monitor/statistics'
3: I0915 11:34:18.938427 17239 http.cpp:1185] HTTP GET for /slave(808)/monitor/statistics
from 172.17.0.8:54428
3: I0915 11:34:18.938506 17239 http.cpp:976] Authorizing principal 'test-principal' to GET
the '/monitor/statistics' endpoint
3: I0915 11:34:18.940434 17240 slave.cpp:861] Agent terminating
3: [       OK ] Endpoint/SlaveEndpointTest.UnauthorizedRequest/0 (30 ms)
3: [ RUN      ] Endpoint/SlaveEndpointTest.UnauthorizedRequest/1
3: I0915 11:34:18.954162 17223 containerizer.cpp:292] Using isolation { environment_secret,
posix/cpu, posix/mem, filesystem/posix, network/cni }
3: W0915 11:34:18.954975 17223 backend.cpp:76] Failed to create 'aufs' backend: AufsBackend
requires root privileges
3: W0915 11:34:18.955142 17223 backend.cpp:76] Failed to create 'bind' backend: BindBackend
requires root privileges
3: I0915 11:34:18.955188 17223 provisioner.cpp:255] Using default backend 'copy'
3: I0915 11:34:18.960747 17233 slave.cpp:252] Mesos agent started on (809)@172.17.0.8:42877
3: I0915 11:34:18.960781 17233 slave.cpp:253] Flags at startup: --acls="" --appc_simple_discovery_uri_prefix="http://"
--appc_store_dir="/tmp/Endpoint_SlaveEndpointTest_UnauthorizedRequest_1_yeXniq/store/appc"
--authenticate_http_readonly="true" --authenticate_http_readwrite="true" --authenticatee="crammd5"
--authentication_backoff_factor="1secs" --authorizer="local" --cgroups_cpu_enable_pids_and_tids_count="false"
--cgroups_enable_cfs="false" --cgroups_hierarchy="/sys/fs/cgroup" --cgroups_limit_swap="false"
--cgroups_root="mesos" --container_disk_watch_interval="15secs" --containerizers="mesos" --credential="/tmp/Endpoint_SlaveEndpointTest_UnauthorizedRequest_1_yeXniq/credential"
--default_role="*" --disallow_sharing_agent_pid_namespace="false" --disk_watch_interval="1mins"
--docker="docker" --docker_kill_orphans="true" --docker_registry="https://registry-1.docker.io"
--docker_remove_delay="6hrs" --docker_socket="/var/run/docker.sock" --docker_stop_timeout="0ns"
--docker_store_dir="/tmp/Endpoint_SlaveEndpointTest_UnauthorizedRequest_1_yeXniq/store/docker"
--docker_volume_checkpoint_dir="/var/run/mesos/isolators/docker/volume" --enforce_container_disk_quota="false"
--executor_registration_timeout="1mins" --executor_reregistration_timeout="2secs" --executor_shutdown_grace_period="5secs"
--fetcher_cache_dir="/tmp/Endpoint_SlaveEndpointTest_UnauthorizedRequest_1_yeXniq/fetch" --fetcher_cache_size="2GB"
--frameworks_home="" --gc_delay="1weeks" --gc_disk_headroom="0.1" --hadoop_home="" --help="false"
--hostname_lookup="true" --http_command_executor="false" --http_credentials="/tmp/Endpoint_SlaveEndpointTest_UnauthorizedRequest_1_yeXniq/http_credentials"
--http_heartbeat_interval="30secs" --initialize_driver_logging="true" --isolation="posix/cpu,posix/mem"
--launcher="posix" --launcher_dir="/mesos/build/src" --logbufsecs="0" --logging_level="INFO"
--max_completed_executors_per_framework="150" --oversubscribed_resources_interval="15secs"
--perf_duration="10secs" --perf_interval="1mins" --port="5051" --qos_correction_interval_min="0ns"
--quiet="false" --recover="reconnect" --recovery_timeout="15mins" --registration_backoff_factor="10ms"
--resources="cpus:2;gpus:0;mem:1024;disk:1024;ports:[31000-32000]" --revocable_cpu_low_priority="true"
--runtime_dir="/tmp/Endpoint_SlaveEndpointTest_UnauthorizedRequest_1_yeXniq" --sandbox_directory="/mnt/mesos/sandbox"
--strict="true" --switch_user="true" --systemd_enable_support="true" --systemd_runtime_directory="/run/systemd/system"
--version="false" --work_dir="/tmp/Endpoint_SlaveEndpointTest_UnauthorizedRequest_1_mhbw5p"
--zk_session_timeout="10secs"
3: I0915 11:34:18.961343 17233 credentials.hpp:86] Loading credential for authentication from
'/tmp/Endpoint_SlaveEndpointTest_UnauthorizedRequest_1_yeXniq/credential'
3: I0915 11:34:18.961522 17233 slave.cpp:285] Agent using credential for: test-principal
3: I0915 11:34:18.961544 17233 credentials.hpp:37] Loading credentials for authentication
from '/tmp/Endpoint_SlaveEndpointTest_UnauthorizedRequest_1_yeXniq/http_credentials'
3: I0915 11:34:18.961822 17233 http.cpp:1045] Creating default 'basic' HTTP authenticator
for realm 'mesos-agent-readonly'
3: I0915 11:34:18.962050 17233 http.cpp:1045] Creating default 'basic' HTTP authenticator
for realm 'mesos-agent-readwrite'
3: I0915 11:34:18.963599 17233 slave.cpp:583] Agent resources: [{"name":"cpus","scalar":{"value":2.0},"type":"SCALAR"},{"name":"mem","scalar":{"value":1024.0},"type":"SCALAR"},{"name":"disk","scalar":{"value":1024.0},"type":"SCALAR"},{"name":"ports","ranges":{"range":[{"begin":31000,"end":32000}]},"type":"RANGES"}]
3: I0915 11:34:18.963840 17233 slave.cpp:591] Agent attributes: [  ]
3: I0915 11:34:18.963852 17233 slave.cpp:600] Agent hostname: 7db44c662750
3: I0915 11:34:18.963994 17226 status_update_manager.cpp:177] Pausing sending status updates
3: I0915 11:34:18.965551 17231 state.cpp:64] Recovering state from '/tmp/Endpoint_SlaveEndpointTest_UnauthorizedRequest_1_mhbw5p/meta'
3: I0915 11:34:18.965940 17240 status_update_manager.cpp:203] Recovering status update manager
3: I0915 11:34:18.966127 17239 containerizer.cpp:648] Recovering containerizer
3: I0915 11:34:18.967907 17245 provisioner.cpp:416] Provisioner recovery complete
3: I0915 11:34:18.968397 17247 slave.cpp:6298] Finished recovery
3: I0915 11:34:18.968958 17247 slave.cpp:6480] Querying resource estimator for oversubscribable
resources
3: I0915 11:34:18.969277 17240 slave.cpp:6494] Received oversubscribable resources {} from
the resource estimator
3: I0915 11:34:18.972079 17242 process.cpp:3929] Handling HTTP event for process 'slave(809)'
with path: '/slave(809)/monitor/statistics.json'
3: I0915 11:34:18.973598 17235 http.cpp:1185] HTTP GET for /slave(809)/monitor/statistics.json
from 172.17.0.8:54430
3: I0915 11:34:18.973667 17235 http.cpp:976] Authorizing principal 'test-principal' to GET
the '/monitor/statistics.json' endpoint
3: I0915 11:34:18.975831 17223 slave.cpp:861] Agent terminating
3: [       OK ] Endpoint/SlaveEndpointTest.UnauthorizedRequest/1 (34 ms)
3: [ RUN      ] Endpoint/SlaveEndpointTest.UnauthorizedRequest/2
3: I0915 11:34:18.986461 17223 containerizer.cpp:292] Using isolation { environment_secret,
posix/cpu, posix/mem, filesystem/posix, network/cni }
3: W0915 11:34:18.986977 17223 backend.cpp:76] Failed to create 'aufs' backend: AufsBackend
requires root privileges
3: W0915 11:34:18.987082 17223 backend.cpp:76] Failed to create 'bind' backend: BindBackend
requires root privileges
3: I0915 11:34:18.987112 17223 provisioner.cpp:255] Using default backend 'copy'
3: I0915 11:34:18.990438 17226 slave.cpp:252] Mesos agent started on (810)@172.17.0.8:42877
3: I0915 11:34:18.990454 17226 slave.cpp:253] Flags at startup: --acls="" --appc_simple_discovery_uri_prefix="http://"
--appc_store_dir="/tmp/Endpoint_SlaveEndpointTest_UnauthorizedRequest_2_Nzyvpr/store/appc"
--authenticate_http_readonly="true" --authenticate_http_readwrite="true" --authenticatee="crammd5"
--authentication_backoff_factor="1secs" --authorizer="local" --cgroups_cpu_enable_pids_and_tids_count="false"
--cgroups_enable_cfs="false" --cgroups_hierarchy="/sys/fs/cgroup" --cgroups_limit_swap="false"
--cgroups_root="mesos" --container_disk_watch_interval="15secs" --containerizers="mesos" --credential="/tmp/Endpoint_SlaveEndpointTest_UnauthorizedRequest_2_Nzyvpr/credential"
--default_role="*" --disallow_sharing_agent_pid_namespace="false" --disk_watch_interval="1mins"
--docker="docker" --docker_kill_orphans="true" --docker_registry="https://registry-1.docker.io"
--docker_remove_delay="6hrs" --docker_socket="/var/run/docker.sock" --docker_stop_timeout="0ns"
--docker_store_dir="/tmp/Endpoint_SlaveEndpointTest_UnauthorizedRequest_2_Nzyvpr/store/docker"
--docker_volume_checkpoint_dir="/var/run/mesos/isolators/docker/volume" --enforce_container_disk_quota="false"
--executor_registration_timeout="1mins" --executor_reregistration_timeout="2secs" --executor_shutdown_grace_period="5secs"
--fetcher_cache_dir="/tmp/Endpoint_SlaveEndpointTest_UnauthorizedRequest_2_Nzyvpr/fetch" --fetcher_cache_size="2GB"
--frameworks_home="" --gc_delay="1weeks" --gc_disk_headroom="0.1" --hadoop_home="" --help="false"
--hostname_lookup="true" --http_command_executor="false" --http_credentials="/tmp/Endpoint_SlaveEndpointTest_UnauthorizedRequest_2_Nzyvpr/http_credentials"
--http_heartbeat_interval="30secs" --initialize_driver_logging="true" --isolation="posix/cpu,posix/mem"
--launcher="posix" --launcher_dir="/mesos/build/src" --logbufsecs="0" --logging_level="INFO"
--max_completed_executors_per_framework="150" --oversubscribed_resources_interval="15secs"
--perf_duration="10secs" --perf_interval="1mins" --port="5051" --qos_correction_interval_min="0ns"
--quiet="false" --recover="reconnect" --recovery_timeout="15mins" --registration_backoff_factor="10ms"
--resources="cpus:2;gpus:0;mem:1024;disk:1024;ports:[31000-32000]" --revocable_cpu_low_priority="true"
--runtime_dir="/tmp/Endpoint_SlaveEndpointTest_UnauthorizedRequest_2_Nzyvpr" --sandbox_directory="/mnt/mesos/sandbox"
--strict="true" --switch_user="true" --systemd_enable_support="true" --systemd_runtime_directory="/run/systemd/system"
--version="false" --work_dir="/tmp/Endpoint_SlaveEndpointTest_UnauthorizedRequest_2_OQzz7q"
--zk_session_timeout="10secs"
3: I0915 11:34:18.990828 17226 credentials.hpp:86] Loading credential for authentication from
'/tmp/Endpoint_SlaveEndpointTest_UnauthorizedRequest_2_Nzyvpr/credential'
3: I0915 11:34:18.990985 17226 slave.cpp:285] Agent using credential for: test-principal
3: I0915 11:34:18.991004 17226 credentials.hpp:37] Loading credentials for authentication
from '/tmp/Endpoint_SlaveEndpointTest_UnauthorizedRequest_2_Nzyvpr/http_credentials'
3: I0915 11:34:18.991225 17226 http.cpp:1045] Creating default 'basic' HTTP authenticator
for realm 'mesos-agent-readonly'
3: I0915 11:34:18.991394 17226 http.cpp:1045] Creating default 'basic' HTTP authenticator
for realm 'mesos-agent-readwrite'
3: I0915 11:34:18.992732 17226 slave.cpp:583] Agent resources: [{"name":"cpus","scalar":{"value":2.0},"type":"SCALAR"},{"name":"mem","scalar":{"value":1024.0},"type":"SCALAR"},{"name":"disk","scalar":{"value":1024.0},"type":"SCALAR"},{"name":"ports","ranges":{"range":[{"begin":31000,"end":32000}]},"type":"RANGES"}]
3: I0915 11:34:18.992950 17226 slave.cpp:591] Agent attributes: [  ]
3: I0915 11:34:18.992959 17226 slave.cpp:600] Agent hostname: 7db44c662750
3: I0915 11:34:18.993136 17237 status_update_manager.cpp:177] Pausing sending status updates
3: I0915 11:34:18.994673 17243 state.cpp:64] Recovering state from '/tmp/Endpoint_SlaveEndpointTest_UnauthorizedRequest_2_OQzz7q/meta'
3: I0915 11:34:18.995043 17247 status_update_manager.cpp:203] Recovering status update manager
3: I0915 11:34:18.995285 17230 containerizer.cpp:648] Recovering containerizer
3: I0915 11:34:18.996814 17240 provisioner.cpp:416] Provisioner recovery complete
3: I0915 11:34:18.997125 17224 slave.cpp:6298] Finished recovery
3: I0915 11:34:18.997615 17224 slave.cpp:6480] Querying resource estimator for oversubscribable
resources
3: I0915 11:34:18.997932 17239 slave.cpp:6494] Received oversubscribable resources {} from
the resource estimator
3: I0915 11:34:19.000723 17227 process.cpp:3929] Handling HTTP event for process 'slave(810)'
with path: '/slave(810)/containers'
3: I0915 11:34:19.002362 17236 http.cpp:1185] HTTP GET for /slave(810)/containers from 172.17.0.8:54432
3: I0915 11:34:19.002444 17236 http.cpp:976] Authorizing principal 'test-principal' to GET
the '/containers' endpoint
3: I0915 11:34:19.004832 17225 slave.cpp:861] Agent terminating
3: [       OK ] Endpoint/SlaveEndpointTest.UnauthorizedRequest/2 (30 ms)
3: [ RUN      ] Endpoint/SlaveEndpointTest.NoAuthorizer/0
3: I0915 11:34:19.016903 17223 containerizer.cpp:292] Using isolation { environment_secret,
posix/cpu, posix/mem, filesystem/posix, network/cni }
3: W0915 11:34:19.017382 17223 backend.cpp:76] Failed to create 'aufs' backend: AufsBackend
requires root privileges
3: W0915 11:34:19.017490 17223 backend.cpp:76] Failed to create 'bind' backend: BindBackend
requires root privileges
3: I0915 11:34:19.017521 17223 provisioner.cpp:255] Using default backend 'copy'
3: I0915 11:34:19.019593 17223 cluster.cpp:448] Creating default 'local' authorizer
3: I0915 11:34:19.021857 17245 slave.cpp:252] Mesos agent started on (811)@172.17.0.8:42877
3: I0915 11:34:19.021872 17245 slave.cpp:253] Flags at startup: --acls="" --appc_simple_discovery_uri_prefix="http://"
--appc_store_dir="/tmp/Endpoint_SlaveEndpointTest_NoAuthorizer_0_7TnmOs/store/appc" --authenticate_http_readonly="true"
--authenticate_http_readwrite="true" --authenticatee="crammd5" --authentication_backoff_factor="1secs"
--authorizer="local" --cgroups_cpu_enable_pids_and_tids_count="false" --cgroups_enable_cfs="false"
--cgroups_hierarchy="/sys/fs/cgroup" --cgroups_limit_swap="false" --cgroups_root="mesos" --container_disk_watch_interval="15secs"
--containerizers="mesos" --credential="/tmp/Endpoint_SlaveEndpointTest_NoAuthorizer_0_7TnmOs/credential"
--default_role="*" --disallow_sharing_agent_pid_namespace="false" --disk_watch_interval="1mins"
--docker="docker" --docker_kill_orphans="true" --docker_registry="https://registry-1.docker.io"
--docker_remove_delay="6hrs" --docker_socket="/var/run/docker.sock" --docker_stop_timeout="0ns"
--docker_store_dir="/tmp/Endpoint_SlaveEndpointTest_NoAuthorizer_0_7TnmOs/store/docker" --docker_volume_checkpoint_dir="/var/run/mesos/isolators/docker/volume"
--enforce_container_disk_quota="false" --executor_registration_timeout="1mins" --executor_reregistration_timeout="2secs"
--executor_shutdown_grace_period="5secs" --fetcher_cache_dir="/tmp/Endpoint_SlaveEndpointTest_NoAuthorizer_0_7TnmOs/fetch"
--fetcher_cache_size="2GB" --frameworks_home="" --gc_delay="1weeks" --gc_disk_headroom="0.1"
--hadoop_home="" --help="false" --hostname_lookup="true" --http_command_executor="false" --http_credentials="/tmp/Endpoint_SlaveEndpointTest_NoAuthorizer_0_7TnmOs/http_credentials"
--http_heartbeat_interval="30secs" --initialize_driver_logging="true" --isolation="posix/cpu,posix/mem"
--launcher="posix" --launcher_dir="/mesos/build/src" --logbufsecs="0" --logging_level="INFO"
--max_completed_executors_per_framework="150" --oversubscribed_resources_interval="15secs"
--perf_duration="10secs" --perf_interval="1mins" --port="5051" --qos_correction_interval_min="0ns"
--quiet="false" --recover="reconnect" --recovery_timeout="15mins" --registration_backoff_factor="10ms"
--resources="cpus:2;gpus:0;mem:1024;disk:1024;ports:[31000-32000]" --revocable_cpu_low_priority="true"
--runtime_dir="/tmp/Endpoint_SlaveEndpointTest_NoAuthorizer_0_7TnmOs" --sandbox_directory="/mnt/mesos/sandbox"
--strict="true" --switch_user="true" --systemd_enable_support="true" --systemd_runtime_directory="/run/systemd/system"
--version="false" --work_dir="/tmp/Endpoint_SlaveEndpointTest_NoAuthorizer_0_iKoWrs" --zk_session_timeout="10secs"
3: I0915 11:34:19.022290 17245 credentials.hpp:86] Loading credential for authentication from
'/tmp/Endpoint_SlaveEndpointTest_NoAuthorizer_0_7TnmOs/credential'
3: I0915 11:34:19.022449 17245 slave.cpp:285] Agent using credential for: test-principal
3: I0915 11:34:19.022465 17245 credentials.hpp:37] Loading credentials for authentication
from '/tmp/Endpoint_SlaveEndpointTest_NoAuthorizer_0_7TnmOs/http_credentials'
3: I0915 11:34:19.022680 17245 http.cpp:1045] Creating default 'basic' HTTP authenticator
for realm 'mesos-agent-readonly'
3: I0915 11:34:19.022850 17245 http.cpp:1045] Creating default 'basic' HTTP authenticator
for realm 'mesos-agent-readwrite'
3: I0915 11:34:19.024152 17245 slave.cpp:583] Agent resources: [{"name":"cpus","scalar":{"value":2.0},"type":"SCALAR"},{"name":"mem","scalar":{"value":1024.0},"type":"SCALAR"},{"name":"disk","scalar":{"value":1024.0},"type":"SCALAR"},{"name":"ports","ranges":{"range":[{"begin":31000,"end":32000}]},"type":"RANGES"}]
3: I0915 11:34:19.024358 17245 slave.cpp:591] Agent attributes: [  ]
3: I0915 11:34:19.024369 17245 slave.cpp:600] Agent hostname: 7db44c662750
3: I0915 11:34:19.024528 17233 status_update_manager.cpp:177] Pausing sending status updates
3: I0915 11:34:19.026140 17247 state.cpp:64] Recovering state from '/tmp/Endpoint_SlaveEndpointTest_NoAuthorizer_0_iKoWrs/meta'
3: I0915 11:34:19.026526 17227 status_update_manager.cpp:203] Recovering status update manager
3: I0915 11:34:19.026744 17231 containerizer.cpp:648] Recovering containerizer
3: I0915 11:34:19.028262 17234 provisioner.cpp:416] Provisioner recovery complete
3: I0915 11:34:19.028602 17228 slave.cpp:6298] Finished recovery
3: I0915 11:34:19.029075 17228 slave.cpp:6480] Querying resource estimator for oversubscribable
resources
3: I0915 11:34:19.029350 17227 slave.cpp:6494] Received oversubscribable resources {} from
the resource estimator
3: I0915 11:34:19.032150 17243 process.cpp:3929] Handling HTTP event for process 'slave(811)'
with path: '/slave(811)/monitor/statistics'
3: I0915 11:34:19.033769 17246 http.cpp:1185] HTTP GET for /slave(811)/monitor/statistics
from 172.17.0.8:54434
3: I0915 11:34:19.033879 17246 http.cpp:976] Authorizing principal 'test-principal' to GET
the '/monitor/statistics' endpoint
3: I0915 11:34:19.037796 17241 slave.cpp:861] Agent terminating
3: [       OK ] Endpoint/SlaveEndpointTest.NoAuthorizer/0 (33 ms)
3: [ RUN      ] Endpoint/SlaveEndpointTest.NoAuthorizer/1
3: I0915 11:34:19.049968 17223 containerizer.cpp:292] Using isolation { environment_secret,
posix/cpu, posix/mem, filesystem/posix, network/cni }
3: W0915 11:34:19.050428 17223 backend.cpp:76] Failed to create 'aufs' backend: AufsBackend
requires root privileges
3: W0915 11:34:19.050534 17223 backend.cpp:76] Failed to create 'bind' backend: BindBackend
requires root privileges
3: I0915 11:34:19.050565 17223 provisioner.cpp:255] Using default backend 'copy'
3: I0915 11:34:19.052187 17223 cluster.cpp:448] Creating default 'local' authorizer
3: I0915 11:34:19.054111 17226 slave.cpp:252] Mesos agent started on (812)@172.17.0.8:42877
3: I0915 11:34:19.054149 17226 slave.cpp:253] Flags at startup: --acls="" --appc_simple_discovery_uri_prefix="http://"
--appc_store_dir="/tmp/Endpoint_SlaveEndpointTest_NoAuthorizer_1_nwEDwu/store/appc" --authenticate_http_readonly="true"
--authenticate_http_readwrite="true" --authenticatee="crammd5" --authentication_backoff_factor="1secs"
--authorizer="local" --cgroups_cpu_enable_pids_and_tids_count="false" --cgroups_enable_cfs="false"
--cgroups_hierarchy="/sys/fs/cgroup" --cgroups_limit_swap="false" --cgroups_root="mesos" --container_disk_watch_interval="15secs"
--containerizers="mesos" --credential="/tmp/Endpoint_SlaveEndpointTest_NoAuthorizer_1_nwEDwu/credential"
--default_role="*" --disallow_sharing_agent_pid_namespace="false" --disk_watch_interval="1mins"
--docker="docker" --docker_kill_orphans="true" --docker_registry="https://registry-1.docker.io"
--docker_remove_delay="6hrs" --docker_socket="/var/run/docker.sock" --docker_stop_timeout="0ns"
--docker_store_dir="/tmp/Endpoint_SlaveEndpointTest_NoAuthorizer_1_nwEDwu/store/docker" --docker_volume_checkpoint_dir="/var/run/mesos/isolators/docker/volume"
--enforce_container_disk_quota="false" --executor_registration_timeout="1mins" --executor_reregistration_timeout="2secs"
--executor_shutdown_grace_period="5secs" --fetcher_cache_dir="/tmp/Endpoint_SlaveEndpointTest_NoAuthorizer_1_nwEDwu/fetch"
--fetcher_cache_size="2GB" --frameworks_home="" --gc_delay="1weeks" --gc_disk_headroom="0.1"
--hadoop_home="" --help="false" --hostname_lookup="true" --http_command_executor="false" --http_credentials="/tmp/Endpoint_SlaveEndpointTest_NoAuthorizer_1_nwEDwu/http_credentials"
--http_heartbeat_interval="30secs" --initialize_driver_logging="true" --isolation="posix/cpu,posix/mem"
--launcher="posix" --launcher_dir="/mesos/build/src" --logbufsecs="0" --logging_level="INFO"
--max_completed_executors_per_framework="150" --oversubscribed_resources_interval="15secs"
--perf_duration="10secs" --perf_interval="1mins" --port="5051" --qos_correction_interval_min="0ns"
--quiet="false" --recover="reconnect" --recovery_timeout="15mins" --registration_backoff_factor="10ms"
--resources="cpus:2;gpus:0;mem:1024;disk:1024;ports:[31000-32000]" --revocable_cpu_low_priority="true"
--runtime_dir="/tmp/Endpoint_SlaveEndpointTest_NoAuthorizer_1_nwEDwu" --sandbox_directory="/mnt/mesos/sandbox"
--strict="true" --switch_user="true" --systemd_enable_support="true" --systemd_runtime_directory="/run/systemd/system"
--version="false" --work_dir="/tmp/Endpoint_SlaveEndpointTest_NoAuthorizer_1_BQhj5t" --zk_session_timeout="10secs"
3: I0915 11:34:19.054829 17226 credentials.hpp:86] Loading credential for authentication from
'/tmp/Endpoint_SlaveEndpointTest_NoAuthorizer_1_nwEDwu/credential'
3: I0915 11:34:19.055088 17226 slave.cpp:285] Agent using credential for: test-principal
3: I0915 11:34:19.055114 17226 credentials.hpp:37] Loading credentials for authentication
from '/tmp/Endpoint_SlaveEndpointTest_NoAuthorizer_1_nwEDwu/http_credentials'
3: I0915 11:34:19.055487 17226 http.cpp:1045] Creating default 'basic' HTTP authenticator
for realm 'mesos-agent-readonly'
3: I0915 11:34:19.055721 17226 http.cpp:1045] Creating default 'basic' HTTP authenticator
for realm 'mesos-agent-readwrite'
3: I0915 11:34:19.057736 17226 slave.cpp:583] Agent resources: [{"name":"cpus","scalar":{"value":2.0},"type":"SCALAR"},{"name":"mem","scalar":{"value":1024.0},"type":"SCALAR"},{"name":"disk","scalar":{"value":1024.0},"type":"SCALAR"},{"name":"ports","ranges":{"range":[{"begin":31000,"end":32000}]},"type":"RANGES"}]
3: I0915 11:34:19.058054 17226 slave.cpp:591] Agent attributes: [  ]
3: I0915 11:34:19.058068 17226 slave.cpp:600] Agent hostname: 7db44c662750
3: I0915 11:34:19.058257 17228 status_update_manager.cpp:177] Pausing sending status updates
3: I0915 11:34:19.060062 17243 state.cpp:64] Recovering state from '/tmp/Endpoint_SlaveEndpointTest_NoAuthorizer_1_BQhj5t/meta'
3: I0915 11:34:19.060536 17236 status_update_manager.cpp:203] Recovering status update manager
3: I0915 11:34:19.060729 17237 containerizer.cpp:648] Recovering containerizer
3: I0915 11:34:19.062496 17228 provisioner.cpp:416] Provisioner recovery complete
3: I0915 11:34:19.062976 17234 slave.cpp:6298] Finished recovery
3: I0915 11:34:19.063515 17234 slave.cpp:6480] Querying resource estimator for oversubscribable
resources
3: I0915 11:34:19.063778 17227 slave.cpp:6494] Received oversubscribable resources {} from
the resource estimator
3: I0915 11:34:19.066484 17232 process.cpp:3929] Handling HTTP event for process 'slave(812)'
with path: '/slave(812)/monitor/statistics.json'
3: I0915 11:34:19.068112 17231 http.cpp:1185] HTTP GET for /slave(812)/monitor/statistics.json
from 172.17.0.8:54436
3: I0915 11:34:19.068217 17231 http.cpp:976] Authorizing principal 'test-principal' to GET
the '/monitor/statistics.json' endpoint
3: I0915 11:34:19.072067 17229 slave.cpp:861] Agent terminating
3: [       OK ] Endpoint/SlaveEndpointTest.NoAuthorizer/1 (34 ms)
3: [ RUN      ] Endpoint/SlaveEndpointTest.NoAuthorizer/2
3: I0915 11:34:19.083740 17223 containerizer.cpp:292] Using isolation { environment_secret,
posix/cpu, posix/mem, filesystem/posix, network/cni }
3: W0915 11:34:19.084205 17223 backend.cpp:76] Failed to create 'aufs' backend: AufsBackend
requires root privileges
3: W0915 11:34:19.084318 17223 backend.cpp:76] Failed to create 'bind' backend: BindBackend
requires root privileges
3: I0915 11:34:19.084348 17223 provisioner.cpp:255] Using default backend 'copy'
3: I0915 11:34:19.086022 17223 cluster.cpp:448] Creating default 'local' authorizer
3: I0915 11:34:19.087833 17237 slave.cpp:252] Mesos agent started on (813)@172.17.0.8:42877
3: I0915 11:34:19.087855 17237 slave.cpp:253] Flags at startup: --acls="" --appc_simple_discovery_uri_prefix="http://"
--appc_store_dir="/tmp/Endpoint_SlaveEndpointTest_NoAuthorizer_2_Ah59yw/store/appc" --authenticate_http_readonly="true"
--authenticate_http_readwrite="true" --authenticatee="crammd5" --authentication_backoff_factor="1secs"
--authorizer="local" --cgroups_cpu_enable_pids_and_tids_count="false" --cgroups_enable_cfs="false"
--cgroups_hierarchy="/sys/fs/cgroup" --cgroups_limit_swap="false" --cgroups_root="mesos" --container_disk_watch_interval="15secs"
--containerizers="mesos" --credential="/tmp/Endpoint_SlaveEndpointTest_NoAuthorizer_2_Ah59yw/credential"
--default_role="*" --disallow_sharing_agent_pid_namespace="false" --disk_watch_interval="1mins"
--docker="docker" --docker_kill_orphans="true" --docker_registry="https://registry-1.docker.io"
--docker_remove_delay="6hrs" --docker_socket="/var/run/docker.sock" --docker_stop_timeout="0ns"
--docker_store_dir="/tmp/Endpoint_SlaveEndpointTest_NoAuthorizer_2_Ah59yw/store/docker" --docker_volume_checkpoint_dir="/var/run/mesos/isolators/docker/volume"
--enforce_container_disk_quota="false" --executor_registration_timeout="1mins" --executor_reregistration_timeout="2secs"
--executor_shutdown_grace_period="5secs" --fetcher_cache_dir="/tmp/Endpoint_SlaveEndpointTest_NoAuthorizer_2_Ah59yw/fetch"
--fetcher_cache_size="2GB" --frameworks_home="" --gc_delay="1weeks" --gc_disk_headroom="0.1"
--hadoop_home="" --help="false" --hostname_lookup="true" --http_command_executor="false" --http_credentials="/tmp/Endpoint_SlaveEndpointTest_NoAuthorizer_2_Ah59yw/http_credentials"
--http_heartbeat_interval="30secs" --initialize_driver_logging="true" --isolation="posix/cpu,posix/mem"
--launcher="posix" --launcher_dir="/mesos/build/src" --logbufsecs="0" --logging_level="INFO"
--max_completed_executors_per_framework="150" --oversubscribed_resources_interval="15secs"
--perf_duration="10secs" --perf_interval="1mins" --port="5051" --qos_correction_interval_min="0ns"
--quiet="false" --recover="reconnect" --recovery_timeout="15mins" --registration_backoff_factor="10ms"
--resources="cpus:2;gpus:0;mem:1024;disk:1024;ports:[31000-32000]" --revocable_cpu_low_priority="true"
--runtime_dir="/tmp/Endpoint_SlaveEndpointTest_NoAuthorizer_2_Ah59yw" --sandbox_directory="/mnt/mesos/sandbox"
--strict="true" --switch_user="true" --systemd_enable_support="true" --systemd_runtime_directory="/run/systemd/system"
--version="false" --work_dir="/tmp/Endpoint_SlaveEndpointTest_NoAuthorizer_2_HG0M2v" --zk_session_timeout="10secs"
3: I0915 11:34:19.088234 17237 credentials.hpp:86] Loading credential for authentication from
'/tmp/Endpoint_SlaveEndpointTest_NoAuthorizer_2_Ah59yw/credential'
3: I0915 11:34:19.088409 17237 slave.cpp:285] Agent using credential for: test-principal
3: I0915 11:34:19.088425 17237 credentials.hpp:37] Loading credentials for authentication
from '/tmp/Endpoint_SlaveEndpointTest_NoAuthorizer_2_Ah59yw/http_credentials'
3: I0915 11:34:19.088663 17237 http.cpp:1045] Creating default 'basic' HTTP authenticator
for realm 'mesos-agent-readonly'
3: I0915 11:34:19.088831 17237 http.cpp:1045] Creating default 'basic' HTTP authenticator
for realm 'mesos-agent-readwrite'
3: I0915 11:34:19.090178 17237 slave.cpp:583] Agent resources: [{"name":"cpus","scalar":{"value":2.0},"type":"SCALAR"},{"name":"mem","scalar":{"value":1024.0},"type":"SCALAR"},{"name":"disk","scalar":{"value":1024.0},"type":"SCALAR"},{"name":"ports","ranges":{"range":[{"begin":31000,"end":32000}]},"type":"RANGES"}]
3: I0915 11:34:19.090401 17237 slave.cpp:591] Agent attributes: [  ]
3: I0915 11:34:19.090412 17237 slave.cpp:600] Agent hostname: 7db44c662750
3: I0915 11:34:19.090548 17247 status_update_manager.cpp:177] Pausing sending status updates
3: I0915 11:34:19.092109 17235 state.cpp:64] Recovering state from '/tmp/Endpoint_SlaveEndpointTest_NoAuthorizer_2_HG0M2v/meta'
3: I0915 11:34:19.092468 17229 status_update_manager.cpp:203] Recovering status update manager
3: I0915 11:34:19.092670 17234 containerizer.cpp:648] Recovering containerizer
3: I0915 11:34:19.094174 17227 provisioner.cpp:416] Provisioner recovery complete
3: I0915 11:34:19.094666 17238 slave.cpp:6298] Finished recovery
3: I0915 11:34:19.095376 17238 slave.cpp:6480] Querying resource estimator for oversubscribable
resources
3: I0915 11:34:19.095793 17241 slave.cpp:6494] Received oversubscribable resources {} from
the resource estimator
3: I0915 11:34:19.098779 17240 process.cpp:3929] Handling HTTP event for process 'slave(813)'
with path: '/slave(813)/containers'
3: I0915 11:34:19.100127 17225 http.cpp:1185] HTTP GET for /slave(813)/containers from 172.17.0.8:54438
3: I0915 11:34:19.100203 17225 http.cpp:976] Authorizing principal 'test-principal' to GET
the '/containers' endpoint
3: I0915 11:34:19.104482 17223 slave.cpp:861] Agent terminating
3: [       OK ] Endpoint/SlaveEndpointTest.NoAuthorizer/2 (34 ms)
3: [----------] 9 tests from Endpoint/SlaveEndpointTest (287 ms total)
3: 
3: [----------] Global test environment tear-down
3: [==========] 1620 tests from 176 test cases ran. (308737 ms total)
3: [  PASSED  ] 1619 tests.
3: [  FAILED  ] 1 test, listed below:
3: [  FAILED  ] ExamplesTest.DynamicReservationFramework
3: 
3:  1 FAILED TEST
3:   YOU HAVE 20 DISABLED TESTS
3: 
3: I0915 11:34:19.184279 17248 process.cpp:1068] Failed to accept socket: future discarded
3/3 Test #3: MesosTests .......................***Failed  312.82 sec

67% tests passed, 1 tests failed out of 3

Total Test time (real) = 332.03 sec

The following tests FAILED:
	  3 - MesosTests (Failed)
Errors while running CTest
make[3]: *** [CMakeFiles/check] Error 8
make[3]: Leaving directory `/mesos/build'
make[2]: *** [CMakeFiles/check.dir/all] Error 2
make[2]: Leaving directory `/mesos/build'
make[1]: *** [CMakeFiles/check.dir/rule] Error 2
make[1]: Leaving directory `/mesos/build'
make: *** [check] Error 2
+ docker rmi mesos-1505473117-7940
Untagged: mesos-1505473117-7940:latest
Deleted: sha256:4022f9d0e1ae35f18d02dfd78120a7d22b2bd69ae2e70980c9a082b1cf2368d3
Deleted: sha256:e67afa57d0795583d4e6d68c9fa556f9ff4c188eefe7cbb79e16d060307363cc
Deleted: sha256:2f496fe42783f1ef3a5bc9478ecc678244ce853f45a40ac410b2995f12c91525
Deleted: sha256:d1eaff84d076227e3d9daff177447ebd60095d6aa159b8f3c610d7f7a72b3909
Deleted: sha256:cad098f02473b33d4add0f9b68436a8e12f71c71396552322511d221eac33f7a
Deleted: sha256:6d41569b5dba3642c0f0a47bbb23b80c9bcd17c047c2b017b08714d5bcf429f5
Deleted: sha256:e966f52511f3b3f2cc928c59f639eb18f61e7bb87c9e869f83829d73c5b76235
Deleted: sha256:9583b1003a74047f2e0c2c9bfab4e0452a2c11fd877105f0a2f2fbf3d96c6200
Deleted: sha256:2dad7b5de7072a83837584076c7285bc0cfb429c5c6d29f6e544cfff37b13fbb
Deleted: sha256:f97529546d22d625a62cfa2f8ecf547235c060c489b1024ad60611ba3c6cc705
Deleted: sha256:a961843f6b7d2472a384b73c9b28d14becfd2c694c28aabd58ef891709c64219
Deleted: sha256:0001b9b8db39f15e6575c5b7a8c1b393599df751650999b6b8acc51497398f5e
Deleted: sha256:fb12a0cb69c370d3cb21c0cf08a85c46f77d99e7e0784583cbe57d11138823a6
Deleted: sha256:99ce444ff56eb0af1eb5403f250e5e6c4c93e68796abe40b22a2472e2456c63c
Deleted: sha256:a977b199f1bb5280a4106bc91652323eb71fb2da18d19d60144f2b9298e87cb5
Deleted: sha256:12207ccdfe71fea2ccf2a419715278194be4df7fd5bfac1ac37d81f2368468dd
Deleted: sha256:2c7bafa25234866b4439ae35278558509b0b20e5b146ed9f7758ef48a2abd99d
Deleted: sha256:c9d3104ff152f033a5f64c60cb2ceb1209cae4835f5d24260229680f62633006
Deleted: sha256:cc8dbc24cad346445656e28171919d896de60152180e60742127a733829b9df4
Deleted: sha256:27b21a4e78aad15eb10a0e7dcb44bd11f7346b83052d3367a55a3ace2a022ec4
Deleted: sha256:fdb3cfe7112d9410dc35ede6c7cec4f4c33e6b1e520c661499463b2618d09336
Deleted: sha256:a1e7e34e89affb94d56465c6b8d0dd8713b1d732660cc67facac177ad88206f2
Deleted: sha256:5b359fe39a373b95c51d8758aaad5e2a398cdc904f8dfc2089a1bdb98c21a214
Deleted: sha256:1392a5a7ccbf44e1a961c1e37a51eb0114c5489ae9467a73aa9ae8ad4e5e244e
Deleted: sha256:421e1f5aa7b65dc0aaa2f550bb5553ae7685e0ec524bd6b0a5f7f0090506c9a7
Deleted: sha256:54b799991935d8bb9eb698a9fb462be76e751bead76c413650dec98365d56700
Deleted: sha256:3de3d7160a822f4be6911747cbafb48ba3e704babd92a88d77fe2a0031987777
Deleted: sha256:efff0b30a637f445ed727dfdf045076021d6894bbed631ae73fa67aa2e6d2410
Build step 'Execute shell' marked build as failure
Not sending mail to unregistered user benjamin.bannier@mesosphere.io

Mime
View raw message