mesos-builds mailing list archives

Site index · List index
Message view « Date » · « Thread »
Top « Date » · « Thread »
From Apache Jenkins Server <jenk...@builds.apache.org>
Subject Build failed in Jenkins: Mesos-Buildbot » autotools,gcc,--verbose --enable-libevent --enable-ssl,GLOG_v=1 MESOS_VERBOSE=1,ubuntu:14.04,(ubuntu)&&(!ubuntu-us1)&&(!ubuntu-eu2)&&(!qnode3)&&(!H23) #4273
Date Thu, 28 Sep 2017 14:48:24 GMT
See <https://builds.apache.org/job/Mesos-Buildbot/BUILDTOOL=autotools,COMPILER=gcc,CONFIGURATION=--verbose%20--enable-libevent%20--enable-ssl,ENVIRONMENT=GLOG_v=1%20MESOS_VERBOSE=1,OS=ubuntu%3A14.04,label_exp=(ubuntu)&&(!ubuntu-us1)&&(!ubuntu-eu2)&&(!qnode3)&&(!H23)/4273/display/redirect?page=changes>

Changes:

[alexr] Updated maximum acceptable number of similar lines in Python files.

------------------------------------------
[...truncated 32.90 MB...]
I0928 14:48:03.397352 29541 slave.cpp:255] Flags at startup: --acls="" --appc_simple_discovery_uri_prefix="http://"
--appc_store_dir="/tmp/Endpoint_SlaveEndpointTest_UnauthorizedRequest_0_S1icRL/store/appc"
--authenticate_http_executors="true" --authenticate_http_readonly="true" --authenticate_http_readwrite="true"
--authenticatee="crammd5" --authentication_backoff_factor="1secs" --authorizer="local" --cgroups_cpu_enable_pids_and_tids_count="false"
--cgroups_enable_cfs="false" --cgroups_hierarchy="/sys/fs/cgroup" --cgroups_limit_swap="false"
--cgroups_root="mesos" --container_disk_watch_interval="15secs" --containerizers="mesos" --credential="/tmp/Endpoint_SlaveEndpointTest_UnauthorizedRequest_0_S1icRL/credential"
--default_role="*" --disallow_sharing_agent_pid_namespace="false" --disk_watch_interval="1mins"
--docker="docker" --docker_kill_orphans="true" --docker_registry="https://registry-1.docker.io"
--docker_remove_delay="6hrs" --docker_socket="/var/run/docker.sock" --docker_stop_timeout="0ns"
--docker_store_dir="/tmp/Endpoint_SlaveEndpointTest_UnauthorizedRequest_0_S1icRL/store/docker"
--docker_volume_checkpoint_dir="/var/run/mesos/isolators/docker/volume" --enforce_container_disk_quota="false"
--executor_registration_timeout="1mins" --executor_reregistration_timeout="2secs" --executor_secret_key="/tmp/Endpoint_SlaveEndpointTest_UnauthorizedRequest_0_S1icRL/executor_secret_key"
--executor_shutdown_grace_period="5secs" --fetcher_cache_dir="/tmp/Endpoint_SlaveEndpointTest_UnauthorizedRequest_0_S1icRL/fetch"
--fetcher_cache_size="2GB" --frameworks_home="" --gc_delay="1weeks" --gc_disk_headroom="0.1"
--hadoop_home="" --help="false" --hostname_lookup="true" --http_command_executor="false" --http_credentials="/tmp/Endpoint_SlaveEndpointTest_UnauthorizedRequest_0_S1icRL/http_credentials"
--http_heartbeat_interval="30secs" --initialize_driver_logging="true" --isolation="posix/cpu,posix/mem"
--launcher="posix" --launcher_dir="/mesos/mesos-1.5.0/_build/src" --logbufsecs="0" --logging_level="INFO"
--max_completed_executors_per_framework="150" --oversubscribed_resources_interval="15secs"
--perf_duration="10secs" --perf_interval="1mins" --port="5051" --qos_correction_interval_min="0ns"
--quiet="false" --recover="reconnect" --recovery_timeout="15mins" --registration_backoff_factor="10ms"
--resources="cpus:2;gpus:0;mem:1024;disk:1024;ports:[31000-32000]" --revocable_cpu_low_priority="true"
--runtime_dir="/tmp/Endpoint_SlaveEndpointTest_UnauthorizedRequest_0_S1icRL" --sandbox_directory="/mnt/mesos/sandbox"
--strict="true" --switch_user="true" --systemd_enable_support="true" --systemd_runtime_directory="/run/systemd/system"
--version="false" --work_dir="/tmp/Endpoint_SlaveEndpointTest_UnauthorizedRequest_0_fRKt3K"
--zk_session_timeout="10secs"
I0928 14:48:03.397719 29541 credentials.hpp:86] Loading credential for authentication from
'/tmp/Endpoint_SlaveEndpointTest_UnauthorizedRequest_0_S1icRL/credential'
I0928 14:48:03.397856 29541 slave.cpp:287] Agent using credential for: test-principal
I0928 14:48:03.397884 29541 credentials.hpp:37] Loading credentials for authentication from
'/tmp/Endpoint_SlaveEndpointTest_UnauthorizedRequest_0_S1icRL/http_credentials'
I0928 14:48:03.398152 29541 http.cpp:1045] Creating default 'basic' HTTP authenticator for
realm 'mesos-agent-executor'
I0928 14:48:03.398262 29541 http.cpp:1066] Creating default 'jwt' HTTP authenticator for realm
'mesos-agent-executor'
I0928 14:48:03.398470 29541 http.cpp:1045] Creating default 'basic' HTTP authenticator for
realm 'mesos-agent-readonly'
I0928 14:48:03.398567 29541 http.cpp:1066] Creating default 'jwt' HTTP authenticator for realm
'mesos-agent-readonly'
I0928 14:48:03.398741 29541 http.cpp:1045] Creating default 'basic' HTTP authenticator for
realm 'mesos-agent-readwrite'
I0928 14:48:03.398836 29541 http.cpp:1066] Creating default 'jwt' HTTP authenticator for realm
'mesos-agent-readwrite'
I0928 14:48:03.400178 29541 slave.cpp:585] Agent resources: [{"name":"cpus","scalar":{"value":2.0},"type":"SCALAR"},{"name":"mem","scalar":{"value":1024.0},"type":"SCALAR"},{"name":"disk","scalar":{"value":1024.0},"type":"SCALAR"},{"name":"ports","ranges":{"range":[{"begin":31000,"end":32000}]},"type":"RANGES"}]
I0928 14:48:03.400408 29541 slave.cpp:593] Agent attributes: [  ]
I0928 14:48:03.400423 29541 slave.cpp:602] Agent hostname: d87ed8082743
I0928 14:48:03.400601 29537 status_update_manager.cpp:177] Pausing sending status updates
I0928 14:48:03.401945 29544 state.cpp:64] Recovering state from '/tmp/Endpoint_SlaveEndpointTest_UnauthorizedRequest_0_fRKt3K/meta'
I0928 14:48:03.402209 29526 status_update_manager.cpp:203] Recovering status update manager
I0928 14:48:03.402395 29542 containerizer.cpp:648] Recovering containerizer
I0928 14:48:03.403584 29532 provisioner.cpp:416] Provisioner recovery complete
I0928 14:48:03.403859 29537 slave.cpp:6322] Finished recovery
I0928 14:48:03.404317 29537 slave.cpp:6504] Querying resource estimator for oversubscribable
resources
I0928 14:48:03.404567 29536 slave.cpp:6518] Received oversubscribable resources {} from the
resource estimator
I0928 14:48:03.406424 29528 process.cpp:3929] Handling HTTP event for process 'slave(818)'
with path: '/slave(818)/monitor/statistics'
I0928 14:48:03.408293 29532 http.cpp:1185] HTTP GET for /slave(818)/monitor/statistics from
172.17.0.3:50534
I0928 14:48:03.408362 29532 http.cpp:976] Authorizing principal 'test-principal' to GET the
'/monitor/statistics' endpoint
I0928 14:48:03.410507  8675 slave.cpp:869] Agent terminating
[       OK ] Endpoint/SlaveEndpointTest.UnauthorizedRequest/0 (27 ms)
[ RUN      ] Endpoint/SlaveEndpointTest.UnauthorizedRequest/1
I0928 14:48:03.421257  8675 containerizer.cpp:292] Using isolation { environment_secret, posix/cpu,
posix/mem, filesystem/posix, network/cni }
W0928 14:48:03.421720  8675 backend.cpp:76] Failed to create 'aufs' backend: AufsBackend requires
root privileges
W0928 14:48:03.421825  8675 backend.cpp:76] Failed to create 'bind' backend: BindBackend requires
root privileges
I0928 14:48:03.421855  8675 provisioner.cpp:255] Using default backend 'copy'
I0928 14:48:03.425258 29524 slave.cpp:254] Mesos agent started on (819)@172.17.0.3:39149
I0928 14:48:03.425282 29524 slave.cpp:255] Flags at startup: --acls="" --appc_simple_discovery_uri_prefix="http://"
--appc_store_dir="/tmp/Endpoint_SlaveEndpointTest_UnauthorizedRequest_1_g6bgiP/store/appc"
--authenticate_http_executors="true" --authenticate_http_readonly="true" --authenticate_http_readwrite="true"
--authenticatee="crammd5" --authentication_backoff_factor="1secs" --authorizer="local" --cgroups_cpu_enable_pids_and_tids_count="false"
--cgroups_enable_cfs="false" --cgroups_hierarchy="/sys/fs/cgroup" --cgroups_limit_swap="false"
--cgroups_root="mesos" --container_disk_watch_interval="15secs" --containerizers="mesos" --credential="/tmp/Endpoint_SlaveEndpointTest_UnauthorizedRequest_1_g6bgiP/credential"
--default_role="*" --disallow_sharing_agent_pid_namespace="false" --disk_watch_interval="1mins"
--docker="docker" --docker_kill_orphans="true" --docker_registry="https://registry-1.docker.io"
--docker_remove_delay="6hrs" --docker_socket="/var/run/docker.sock" --docker_stop_timeout="0ns"
--docker_store_dir="/tmp/Endpoint_SlaveEndpointTest_UnauthorizedRequest_1_g6bgiP/store/docker"
--docker_volume_checkpoint_dir="/var/run/mesos/isolators/docker/volume" --enforce_container_disk_quota="false"
--executor_registration_timeout="1mins" --executor_reregistration_timeout="2secs" --executor_secret_key="/tmp/Endpoint_SlaveEndpointTest_UnauthorizedRequest_1_g6bgiP/executor_secret_key"
--executor_shutdown_grace_period="5secs" --fetcher_cache_dir="/tmp/Endpoint_SlaveEndpointTest_UnauthorizedRequest_1_g6bgiP/fetch"
--fetcher_cache_size="2GB" --frameworks_home="" --gc_delay="1weeks" --gc_disk_headroom="0.1"
--hadoop_home="" --help="false" --hostname_lookup="true" --http_command_executor="false" --http_credentials="/tmp/Endpoint_SlaveEndpointTest_UnauthorizedRequest_1_g6bgiP/http_credentials"
--http_heartbeat_interval="30secs" --initialize_driver_logging="true" --isolation="posix/cpu,posix/mem"
--launcher="posix" --launcher_dir="/mesos/mesos-1.5.0/_build/src" --logbufsecs="0" --logging_level="INFO"
--max_completed_executors_per_framework="150" --oversubscribed_resources_interval="15secs"
--perf_duration="10secs" --perf_interval="1mins" --port="5051" --qos_correction_interval_min="0ns"
--quiet="false" --recover="reconnect" --recovery_timeout="15mins" --registration_backoff_factor="10ms"
--resources="cpus:2;gpus:0;mem:1024;disk:1024;ports:[31000-32000]" --revocable_cpu_low_priority="true"
--runtime_dir="/tmp/Endpoint_SlaveEndpointTest_UnauthorizedRequest_1_g6bgiP" --sandbox_directory="/mnt/mesos/sandbox"
--strict="true" --switch_user="true" --systemd_enable_support="true" --systemd_runtime_directory="/run/systemd/system"
--version="false" --work_dir="/tmp/Endpoint_SlaveEndpointTest_UnauthorizedRequest_1_vftnqO"
--zk_session_timeout="10secs"
I0928 14:48:03.425663 29524 credentials.hpp:86] Loading credential for authentication from
'/tmp/Endpoint_SlaveEndpointTest_UnauthorizedRequest_1_g6bgiP/credential'
I0928 14:48:03.425801 29524 slave.cpp:287] Agent using credential for: test-principal
I0928 14:48:03.425822 29524 credentials.hpp:37] Loading credentials for authentication from
'/tmp/Endpoint_SlaveEndpointTest_UnauthorizedRequest_1_g6bgiP/http_credentials'
I0928 14:48:03.426115 29524 http.cpp:1045] Creating default 'basic' HTTP authenticator for
realm 'mesos-agent-executor'
I0928 14:48:03.426228 29524 http.cpp:1066] Creating default 'jwt' HTTP authenticator for realm
'mesos-agent-executor'
I0928 14:48:03.426430 29524 http.cpp:1045] Creating default 'basic' HTTP authenticator for
realm 'mesos-agent-readonly'
I0928 14:48:03.426535 29524 http.cpp:1066] Creating default 'jwt' HTTP authenticator for realm
'mesos-agent-readonly'
I0928 14:48:03.426733 29524 http.cpp:1045] Creating default 'basic' HTTP authenticator for
realm 'mesos-agent-readwrite'
I0928 14:48:03.426834 29524 http.cpp:1066] Creating default 'jwt' HTTP authenticator for realm
'mesos-agent-readwrite'
I0928 14:48:03.428206 29524 slave.cpp:585] Agent resources: [{"name":"cpus","scalar":{"value":2.0},"type":"SCALAR"},{"name":"mem","scalar":{"value":1024.0},"type":"SCALAR"},{"name":"disk","scalar":{"value":1024.0},"type":"SCALAR"},{"name":"ports","ranges":{"range":[{"begin":31000,"end":32000}]},"type":"RANGES"}]
I0928 14:48:03.428429 29524 slave.cpp:593] Agent attributes: [  ]
I0928 14:48:03.428442 29524 slave.cpp:602] Agent hostname: d87ed8082743
I0928 14:48:03.428596 29540 status_update_manager.cpp:177] Pausing sending status updates
I0928 14:48:03.430032 29529 state.cpp:64] Recovering state from '/tmp/Endpoint_SlaveEndpointTest_UnauthorizedRequest_1_vftnqO/meta'
I0928 14:48:03.430281 29529 status_update_manager.cpp:203] Recovering status update manager
I0928 14:48:03.430454 29533 containerizer.cpp:648] Recovering containerizer
I0928 14:48:03.431674 29526 provisioner.cpp:416] Provisioner recovery complete
I0928 14:48:03.431977 29540 slave.cpp:6322] Finished recovery
I0928 14:48:03.432385 29540 slave.cpp:6504] Querying resource estimator for oversubscribable
resources
I0928 14:48:03.432627 29539 slave.cpp:6518] Received oversubscribable resources {} from the
resource estimator
I0928 14:48:03.434375 29534 process.cpp:3929] Handling HTTP event for process 'slave(819)'
with path: '/slave(819)/monitor/statistics.json'
I0928 14:48:03.435928 29526 http.cpp:1185] HTTP GET for /slave(819)/monitor/statistics.json
from 172.17.0.3:50538
I0928 14:48:03.435992 29526 http.cpp:976] Authorizing principal 'test-principal' to GET the
'/monitor/statistics.json' endpoint
I0928 14:48:03.437424 29544 slave.cpp:869] Agent terminating
[       OK ] Endpoint/SlaveEndpointTest.UnauthorizedRequest/1 (26 ms)
[ RUN      ] Endpoint/SlaveEndpointTest.UnauthorizedRequest/2
I0928 14:48:03.447746  8675 containerizer.cpp:292] Using isolation { environment_secret, posix/cpu,
posix/mem, filesystem/posix, network/cni }
W0928 14:48:03.448205  8675 backend.cpp:76] Failed to create 'aufs' backend: AufsBackend requires
root privileges
W0928 14:48:03.448309  8675 backend.cpp:76] Failed to create 'bind' backend: BindBackend requires
root privileges
I0928 14:48:03.448339  8675 provisioner.cpp:255] Using default backend 'copy'
I0928 14:48:03.451741 29525 slave.cpp:254] Mesos agent started on (820)@172.17.0.3:39149
I0928 14:48:03.451768 29525 slave.cpp:255] Flags at startup: --acls="" --appc_simple_discovery_uri_prefix="http://"
--appc_store_dir="/tmp/Endpoint_SlaveEndpointTest_UnauthorizedRequest_2_aB1kZS/store/appc"
--authenticate_http_executors="true" --authenticate_http_readonly="true" --authenticate_http_readwrite="true"
--authenticatee="crammd5" --authentication_backoff_factor="1secs" --authorizer="local" --cgroups_cpu_enable_pids_and_tids_count="false"
--cgroups_enable_cfs="false" --cgroups_hierarchy="/sys/fs/cgroup" --cgroups_limit_swap="false"
--cgroups_root="mesos" --container_disk_watch_interval="15secs" --containerizers="mesos" --credential="/tmp/Endpoint_SlaveEndpointTest_UnauthorizedRequest_2_aB1kZS/credential"
--default_role="*" --disallow_sharing_agent_pid_namespace="false" --disk_watch_interval="1mins"
--docker="docker" --docker_kill_orphans="true" --docker_registry="https://registry-1.docker.io"
--docker_remove_delay="6hrs" --docker_socket="/var/run/docker.sock" --docker_stop_timeout="0ns"
--docker_store_dir="/tmp/Endpoint_SlaveEndpointTest_UnauthorizedRequest_2_aB1kZS/store/docker"
--docker_volume_checkpoint_dir="/var/run/mesos/isolators/docker/volume" --enforce_container_disk_quota="false"
--executor_registration_timeout="1mins" --executor_reregistration_timeout="2secs" --executor_secret_key="/tmp/Endpoint_SlaveEndpointTest_UnauthorizedRequest_2_aB1kZS/executor_secret_key"
--executor_shutdown_grace_period="5secs" --fetcher_cache_dir="/tmp/Endpoint_SlaveEndpointTest_UnauthorizedRequest_2_aB1kZS/fetch"
--fetcher_cache_size="2GB" --frameworks_home="" --gc_delay="1weeks" --gc_disk_headroom="0.1"
--hadoop_home="" --help="false" --hostname_lookup="true" --http_command_executor="false" --http_credentials="/tmp/Endpoint_SlaveEndpointTest_UnauthorizedRequest_2_aB1kZS/http_credentials"
--http_heartbeat_interval="30secs" --initialize_driver_logging="true" --isolation="posix/cpu,posix/mem"
--launcher="posix" --launcher_dir="/mesos/mesos-1.5.0/_build/src" --logbufsecs="0" --logging_level="INFO"
--max_completed_executors_per_framework="150" --oversubscribed_resources_interval="15secs"
--perf_duration="10secs" --perf_interval="1mins" --port="5051" --qos_correction_interval_min="0ns"
--quiet="false" --recover="reconnect" --recovery_timeout="15mins" --registration_backoff_factor="10ms"
--resources="cpus:2;gpus:0;mem:1024;disk:1024;ports:[31000-32000]" --revocable_cpu_low_priority="true"
--runtime_dir="/tmp/Endpoint_SlaveEndpointTest_UnauthorizedRequest_2_aB1kZS" --sandbox_directory="/mnt/mesos/sandbox"
--strict="true" --switch_user="true" --systemd_enable_support="true" --systemd_runtime_directory="/run/systemd/system"
--version="false" --work_dir="/tmp/Endpoint_SlaveEndpointTest_UnauthorizedRequest_2_vVGv3R"
--zk_session_timeout="10secs"
I0928 14:48:03.452152 29525 credentials.hpp:86] Loading credential for authentication from
'/tmp/Endpoint_SlaveEndpointTest_UnauthorizedRequest_2_aB1kZS/credential'
I0928 14:48:03.452296 29525 slave.cpp:287] Agent using credential for: test-principal
I0928 14:48:03.452317 29525 credentials.hpp:37] Loading credentials for authentication from
'/tmp/Endpoint_SlaveEndpointTest_UnauthorizedRequest_2_aB1kZS/http_credentials'
I0928 14:48:03.452601 29525 http.cpp:1045] Creating default 'basic' HTTP authenticator for
realm 'mesos-agent-executor'
I0928 14:48:03.452711 29525 http.cpp:1066] Creating default 'jwt' HTTP authenticator for realm
'mesos-agent-executor'
I0928 14:48:03.452919 29525 http.cpp:1045] Creating default 'basic' HTTP authenticator for
realm 'mesos-agent-readonly'
I0928 14:48:03.453025 29525 http.cpp:1066] Creating default 'jwt' HTTP authenticator for realm
'mesos-agent-readonly'
I0928 14:48:03.453202 29525 http.cpp:1045] Creating default 'basic' HTTP authenticator for
realm 'mesos-agent-readwrite'
I0928 14:48:03.453310 29525 http.cpp:1066] Creating default 'jwt' HTTP authenticator for realm
'mesos-agent-readwrite'
I0928 14:48:03.454663 29525 slave.cpp:585] Agent resources: [{"name":"cpus","scalar":{"value":2.0},"type":"SCALAR"},{"name":"mem","scalar":{"value":1024.0},"type":"SCALAR"},{"name":"disk","scalar":{"value":1024.0},"type":"SCALAR"},{"name":"ports","ranges":{"range":[{"begin":31000,"end":32000}]},"type":"RANGES"}]
I0928 14:48:03.454883 29525 slave.cpp:593] Agent attributes: [  ]
I0928 14:48:03.454897 29525 slave.cpp:602] Agent hostname: d87ed8082743
I0928 14:48:03.455049 29523 status_update_manager.cpp:177] Pausing sending status updates
I0928 14:48:03.456265 29545 state.cpp:64] Recovering state from '/tmp/Endpoint_SlaveEndpointTest_UnauthorizedRequest_2_vVGv3R/meta'
I0928 14:48:03.456511 29543 status_update_manager.cpp:203] Recovering status update manager
I0928 14:48:03.456750 29542 containerizer.cpp:648] Recovering containerizer
I0928 14:48:03.457952 29531 provisioner.cpp:416] Provisioner recovery complete
I0928 14:48:03.458242 29523 slave.cpp:6322] Finished recovery
I0928 14:48:03.458686 29523 slave.cpp:6504] Querying resource estimator for oversubscribable
resources
I0928 14:48:03.458885 29533 slave.cpp:6518] Received oversubscribable resources {} from the
resource estimator
I0928 14:48:03.460598 29526 process.cpp:3929] Handling HTTP event for process 'slave(820)'
with path: '/slave(820)/containers'
I0928 14:48:03.462188 29531 http.cpp:1185] HTTP GET for /slave(820)/containers from 172.17.0.3:50540
I0928 14:48:03.462249 29531 http.cpp:976] Authorizing principal 'test-principal' to GET the
'/containers' endpoint
I0928 14:48:03.464042 29546 slave.cpp:869] Agent terminating
[       OK ] Endpoint/SlaveEndpointTest.UnauthorizedRequest/2 (31 ms)
[ RUN      ] Endpoint/SlaveEndpointTest.NoAuthorizer/0
I0928 14:48:03.479871  8675 containerizer.cpp:292] Using isolation { environment_secret, posix/cpu,
posix/mem, filesystem/posix, network/cni }
W0928 14:48:03.480319  8675 backend.cpp:76] Failed to create 'aufs' backend: AufsBackend requires
root privileges
W0928 14:48:03.480422  8675 backend.cpp:76] Failed to create 'bind' backend: BindBackend requires
root privileges
I0928 14:48:03.480451  8675 provisioner.cpp:255] Using default backend 'copy'
I0928 14:48:03.482231  8675 cluster.cpp:448] Creating default 'local' authorizer
I0928 14:48:03.484191 29531 slave.cpp:254] Mesos agent started on (821)@172.17.0.3:39149
I0928 14:48:03.484211 29531 slave.cpp:255] Flags at startup: --acls="" --appc_simple_discovery_uri_prefix="http://"
--appc_store_dir="/tmp/Endpoint_SlaveEndpointTest_NoAuthorizer_0_wgNtYW/store/appc" --authenticate_http_executors="true"
--authenticate_http_readonly="true" --authenticate_http_readwrite="true" --authenticatee="crammd5"
--authentication_backoff_factor="1secs" --authorizer="local" --cgroups_cpu_enable_pids_and_tids_count="false"
--cgroups_enable_cfs="false" --cgroups_hierarchy="/sys/fs/cgroup" --cgroups_limit_swap="false"
--cgroups_root="mesos" --container_disk_watch_interval="15secs" --containerizers="mesos" --credential="/tmp/Endpoint_SlaveEndpointTest_NoAuthorizer_0_wgNtYW/credential"
--default_role="*" --disallow_sharing_agent_pid_namespace="false" --disk_watch_interval="1mins"
--docker="docker" --docker_kill_orphans="true" --docker_registry="https://registry-1.docker.io"
--docker_remove_delay="6hrs" --docker_socket="/var/run/docker.sock" --docker_stop_timeout="0ns"
--docker_store_dir="/tmp/Endpoint_SlaveEndpointTest_NoAuthorizer_0_wgNtYW/store/docker" --docker_volume_checkpoint_dir="/var/run/mesos/isolators/docker/volume"
--enforce_container_disk_quota="false" --executor_registration_timeout="1mins" --executor_reregistration_timeout="2secs"
--executor_secret_key="/tmp/Endpoint_SlaveEndpointTest_NoAuthorizer_0_wgNtYW/executor_secret_key"
--executor_shutdown_grace_period="5secs" --fetcher_cache_dir="/tmp/Endpoint_SlaveEndpointTest_NoAuthorizer_0_wgNtYW/fetch"
--fetcher_cache_size="2GB" --frameworks_home="" --gc_delay="1weeks" --gc_disk_headroom="0.1"
--hadoop_home="" --help="false" --hostname_lookup="true" --http_command_executor="false" --http_credentials="/tmp/Endpoint_SlaveEndpointTest_NoAuthorizer_0_wgNtYW/http_credentials"
--http_heartbeat_interval="30secs" --initialize_driver_logging="true" --isolation="posix/cpu,posix/mem"
--launcher="posix" --launcher_dir="/mesos/mesos-1.5.0/_build/src" --logbufsecs="0" --logging_level="INFO"
--max_completed_executors_per_framework="150" --oversubscribed_resources_interval="15secs"
--perf_duration="10secs" --perf_interval="1mins" --port="5051" --qos_correction_interval_min="0ns"
--quiet="false" --recover="reconnect" --recovery_timeout="15mins" --registration_backoff_factor="10ms"
--resources="cpus:2;gpus:0;mem:1024;disk:1024;ports:[31000-32000]" --revocable_cpu_low_priority="true"
--runtime_dir="/tmp/Endpoint_SlaveEndpointTest_NoAuthorizer_0_wgNtYW" --sandbox_directory="/mnt/mesos/sandbox"
--strict="true" --switch_user="true" --systemd_enable_support="true" --systemd_runtime_directory="/run/systemd/system"
--version="false" --work_dir="/tmp/Endpoint_SlaveEndpointTest_NoAuthorizer_0_VdUVXV" --zk_session_timeout="10secs"
I0928 14:48:03.484566 29531 credentials.hpp:86] Loading credential for authentication from
'/tmp/Endpoint_SlaveEndpointTest_NoAuthorizer_0_wgNtYW/credential'
I0928 14:48:03.484725 29531 slave.cpp:287] Agent using credential for: test-principal
I0928 14:48:03.484746 29531 credentials.hpp:37] Loading credentials for authentication from
'/tmp/Endpoint_SlaveEndpointTest_NoAuthorizer_0_wgNtYW/http_credentials'
I0928 14:48:03.485018 29531 http.cpp:1045] Creating default 'basic' HTTP authenticator for
realm 'mesos-agent-executor'
I0928 14:48:03.485147 29531 http.cpp:1066] Creating default 'jwt' HTTP authenticator for realm
'mesos-agent-executor'
I0928 14:48:03.485342 29531 http.cpp:1045] Creating default 'basic' HTTP authenticator for
realm 'mesos-agent-readonly'
I0928 14:48:03.485446 29531 http.cpp:1066] Creating default 'jwt' HTTP authenticator for realm
'mesos-agent-readonly'
I0928 14:48:03.485630 29531 http.cpp:1045] Creating default 'basic' HTTP authenticator for
realm 'mesos-agent-readwrite'
I0928 14:48:03.485733 29531 http.cpp:1066] Creating default 'jwt' HTTP authenticator for realm
'mesos-agent-readwrite'
I0928 14:48:03.487084 29531 slave.cpp:585] Agent resources: [{"name":"cpus","scalar":{"value":2.0},"type":"SCALAR"},{"name":"mem","scalar":{"value":1024.0},"type":"SCALAR"},{"name":"disk","scalar":{"value":1024.0},"type":"SCALAR"},{"name":"ports","ranges":{"range":[{"begin":31000,"end":32000}]},"type":"RANGES"}]
I0928 14:48:03.487308 29531 slave.cpp:593] Agent attributes: [  ]
I0928 14:48:03.487323 29531 slave.cpp:602] Agent hostname: d87ed8082743
I0928 14:48:03.487435 29539 status_update_manager.cpp:177] Pausing sending status updates
I0928 14:48:03.488723 29523 state.cpp:64] Recovering state from '/tmp/Endpoint_SlaveEndpointTest_NoAuthorizer_0_VdUVXV/meta'
I0928 14:48:03.488968 29527 status_update_manager.cpp:203] Recovering status update manager
I0928 14:48:03.489166 29536 containerizer.cpp:648] Recovering containerizer
I0928 14:48:03.491145 29529 provisioner.cpp:416] Provisioner recovery complete
I0928 14:48:03.491672 29539 slave.cpp:6322] Finished recovery
I0928 14:48:03.492316 29539 slave.cpp:6504] Querying resource estimator for oversubscribable
resources
I0928 14:48:03.492674 29546 slave.cpp:6518] Received oversubscribable resources {} from the
resource estimator
I0928 14:48:03.495263 29543 process.cpp:3929] Handling HTTP event for process 'slave(821)'
with path: '/slave(821)/monitor/statistics'
I0928 14:48:03.497130 29524 http.cpp:1185] HTTP GET for /slave(821)/monitor/statistics from
172.17.0.3:50542
I0928 14:48:03.497196 29524 http.cpp:976] Authorizing principal 'test-principal' to GET the
'/monitor/statistics' endpoint
I0928 14:48:03.500298 29534 slave.cpp:869] Agent terminating
[       OK ] Endpoint/SlaveEndpointTest.NoAuthorizer/0 (33 ms)
[ RUN      ] Endpoint/SlaveEndpointTest.NoAuthorizer/1
I0928 14:48:03.516969  8675 containerizer.cpp:292] Using isolation { environment_secret, posix/cpu,
posix/mem, filesystem/posix, network/cni }
W0928 14:48:03.517925  8675 backend.cpp:76] Failed to create 'aufs' backend: AufsBackend requires
root privileges
W0928 14:48:03.518149  8675 backend.cpp:76] Failed to create 'bind' backend: BindBackend requires
root privileges
I0928 14:48:03.518185  8675 provisioner.cpp:255] Using default backend 'copy'
I0928 14:48:03.521211  8675 cluster.cpp:448] Creating default 'local' authorizer
I0928 14:48:03.523784 29532 slave.cpp:254] Mesos agent started on (822)@172.17.0.3:39149
I0928 14:48:03.523813 29532 slave.cpp:255] Flags at startup: --acls="" --appc_simple_discovery_uri_prefix="http://"
--appc_store_dir="/tmp/Endpoint_SlaveEndpointTest_NoAuthorizer_1_Yx1Xh1/store/appc" --authenticate_http_executors="true"
--authenticate_http_readonly="true" --authenticate_http_readwrite="true" --authenticatee="crammd5"
--authentication_backoff_factor="1secs" --authorizer="local" --cgroups_cpu_enable_pids_and_tids_count="false"
--cgroups_enable_cfs="false" --cgroups_hierarchy="/sys/fs/cgroup" --cgroups_limit_swap="false"
--cgroups_root="mesos" --container_disk_watch_interval="15secs" --containerizers="mesos" --credential="/tmp/Endpoint_SlaveEndpointTest_NoAuthorizer_1_Yx1Xh1/credential"
--default_role="*" --disallow_sharing_agent_pid_namespace="false" --disk_watch_interval="1mins"
--docker="docker" --docker_kill_orphans="true" --docker_registry="https://registry-1.docker.io"
--docker_remove_delay="6hrs" --docker_socket="/var/run/docker.sock" --docker_stop_timeout="0ns"
--docker_store_dir="/tmp/Endpoint_SlaveEndpointTest_NoAuthorizer_1_Yx1Xh1/store/docker" --docker_volume_checkpoint_dir="/var/run/mesos/isolators/docker/volume"
--enforce_container_disk_quota="false" --executor_registration_timeout="1mins" --executor_reregistration_timeout="2secs"
--executor_secret_key="/tmp/Endpoint_SlaveEndpointTest_NoAuthorizer_1_Yx1Xh1/executor_secret_key"
--executor_shutdown_grace_period="5secs" --fetcher_cache_dir="/tmp/Endpoint_SlaveEndpointTest_NoAuthorizer_1_Yx1Xh1/fetch"
--fetcher_cache_size="2GB" --frameworks_home="" --gc_delay="1weeks" --gc_disk_headroom="0.1"
--hadoop_home="" --help="false" --hostname_lookup="true" --http_command_executor="false" --http_credentials="/tmp/Endpoint_SlaveEndpointTest_NoAuthorizer_1_Yx1Xh1/http_credentials"
--http_heartbeat_interval="30secs" --initialize_driver_logging="true" --isolation="posix/cpu,posix/mem"
--launcher="posix" --launcher_dir="/mesos/mesos-1.5.0/_build/src" --logbufsecs="0" --logging_level="INFO"
--max_completed_executors_per_framework="150" --oversubscribed_resources_interval="15secs"
--perf_duration="10secs" --perf_interval="1mins" --port="5051" --qos_correction_interval_min="0ns"
--quiet="false" --recover="reconnect" --recovery_timeout="15mins" --registration_backoff_factor="10ms"
--resources="cpus:2;gpus:0;mem:1024;disk:1024;ports:[31000-32000]" --revocable_cpu_low_priority="true"
--runtime_dir="/tmp/Endpoint_SlaveEndpointTest_NoAuthorizer_1_Yx1Xh1" --sandbox_directory="/mnt/mesos/sandbox"
--strict="true" --switch_user="true" --systemd_enable_support="true" --systemd_runtime_directory="/run/systemd/system"
--version="false" --work_dir="/tmp/Endpoint_SlaveEndpointTest_NoAuthorizer_1_D0Qdc0" --zk_session_timeout="10secs"
I0928 14:48:03.524345 29532 credentials.hpp:86] Loading credential for authentication from
'/tmp/Endpoint_SlaveEndpointTest_NoAuthorizer_1_Yx1Xh1/credential'
I0928 14:48:03.524533 29532 slave.cpp:287] Agent using credential for: test-principal
I0928 14:48:03.524561 29532 credentials.hpp:37] Loading credentials for authentication from
'/tmp/Endpoint_SlaveEndpointTest_NoAuthorizer_1_Yx1Xh1/http_credentials'
I0928 14:48:03.525001 29532 http.cpp:1045] Creating default 'basic' HTTP authenticator for
realm 'mesos-agent-executor'
I0928 14:48:03.525151 29532 http.cpp:1066] Creating default 'jwt' HTTP authenticator for realm
'mesos-agent-executor'
I0928 14:48:03.525498 29532 http.cpp:1045] Creating default 'basic' HTTP authenticator for
realm 'mesos-agent-readonly'
I0928 14:48:03.525656 29532 http.cpp:1066] Creating default 'jwt' HTTP authenticator for realm
'mesos-agent-readonly'
I0928 14:48:03.525956 29532 http.cpp:1045] Creating default 'basic' HTTP authenticator for
realm 'mesos-agent-readwrite'
I0928 14:48:03.526085 29532 http.cpp:1066] Creating default 'jwt' HTTP authenticator for realm
'mesos-agent-readwrite'
I0928 14:48:03.527842 29532 slave.cpp:585] Agent resources: [{"name":"cpus","scalar":{"value":2.0},"type":"SCALAR"},{"name":"mem","scalar":{"value":1024.0},"type":"SCALAR"},{"name":"disk","scalar":{"value":1024.0},"type":"SCALAR"},{"name":"ports","ranges":{"range":[{"begin":31000,"end":32000}]},"type":"RANGES"}]
I0928 14:48:03.528122 29532 slave.cpp:593] Agent attributes: [  ]
I0928 14:48:03.528141 29532 slave.cpp:602] Agent hostname: d87ed8082743
I0928 14:48:03.528339 29526 status_update_manager.cpp:177] Pausing sending status updates
I0928 14:48:03.530522 29529 state.cpp:64] Recovering state from '/tmp/Endpoint_SlaveEndpointTest_NoAuthorizer_1_D0Qdc0/meta'
I0928 14:48:03.530951 29534 status_update_manager.cpp:203] Recovering status update manager
I0928 14:48:03.531217 29544 containerizer.cpp:648] Recovering containerizer
I0928 14:48:03.532738 29537 provisioner.cpp:416] Provisioner recovery complete
I0928 14:48:03.533169 29526 slave.cpp:6322] Finished recovery
I0928 14:48:03.533641 29526 slave.cpp:6504] Querying resource estimator for oversubscribable
resources
I0928 14:48:03.533923 29546 slave.cpp:6518] Received oversubscribable resources {} from the
resource estimator
I0928 14:48:03.536345 29541 process.cpp:3929] Handling HTTP event for process 'slave(822)'
with path: '/slave(822)/monitor/statistics.json'
I0928 14:48:03.538475 29531 http.cpp:1185] HTTP GET for /slave(822)/monitor/statistics.json
from 172.17.0.3:50544
I0928 14:48:03.538553 29531 http.cpp:976] Authorizing principal 'test-principal' to GET the
'/monitor/statistics.json' endpoint
I0928 14:48:03.542583  8675 slave.cpp:869] Agent terminating
[       OK ] Endpoint/SlaveEndpointTest.NoAuthorizer/1 (41 ms)
[ RUN      ] Endpoint/SlaveEndpointTest.NoAuthorizer/2
I0928 14:48:03.554875  8675 containerizer.cpp:292] Using isolation { environment_secret, posix/cpu,
posix/mem, filesystem/posix, network/cni }
W0928 14:48:03.555402  8675 backend.cpp:76] Failed to create 'aufs' backend: AufsBackend requires
root privileges
W0928 14:48:03.555516  8675 backend.cpp:76] Failed to create 'bind' backend: BindBackend requires
root privileges
I0928 14:48:03.555555  8675 provisioner.cpp:255] Using default backend 'copy'
I0928 14:48:03.557376  8675 cluster.cpp:448] Creating default 'local' authorizer
I0928 14:48:03.559396 29546 slave.cpp:254] Mesos agent started on (823)@172.17.0.3:39149
I0928 14:48:03.559422 29546 slave.cpp:255] Flags at startup: --acls="" --appc_simple_discovery_uri_prefix="http://"
--appc_store_dir="/tmp/Endpoint_SlaveEndpointTest_NoAuthorizer_2_mv9DZ5/store/appc" --authenticate_http_executors="true"
--authenticate_http_readonly="true" --authenticate_http_readwrite="true" --authenticatee="crammd5"
--authentication_backoff_factor="1secs" --authorizer="local" --cgroups_cpu_enable_pids_and_tids_count="false"
--cgroups_enable_cfs="false" --cgroups_hierarchy="/sys/fs/cgroup" --cgroups_limit_swap="false"
--cgroups_root="mesos" --container_disk_watch_interval="15secs" --containerizers="mesos" --credential="/tmp/Endpoint_SlaveEndpointTest_NoAuthorizer_2_mv9DZ5/credential"
--default_role="*" --disallow_sharing_agent_pid_namespace="false" --disk_watch_interval="1mins"
--docker="docker" --docker_kill_orphans="true" --docker_registry="https://registry-1.docker.io"
--docker_remove_delay="6hrs" --docker_socket="/var/run/docker.sock" --docker_stop_timeout="0ns"
--docker_store_dir="/tmp/Endpoint_SlaveEndpointTest_NoAuthorizer_2_mv9DZ5/store/docker" --docker_volume_checkpoint_dir="/var/run/mesos/isolators/docker/volume"
--enforce_container_disk_quota="false" --executor_registration_timeout="1mins" --executor_reregistration_timeout="2secs"
--executor_secret_key="/tmp/Endpoint_SlaveEndpointTest_NoAuthorizer_2_mv9DZ5/executor_secret_key"
--executor_shutdown_grace_period="5secs" --fetcher_cache_dir="/tmp/Endpoint_SlaveEndpointTest_NoAuthorizer_2_mv9DZ5/fetch"
--fetcher_cache_size="2GB" --frameworks_home="" --gc_delay="1weeks" --gc_disk_headroom="0.1"
--hadoop_home="" --help="false" --hostname_lookup="true" --http_command_executor="false" --http_credentials="/tmp/Endpoint_SlaveEndpointTest_NoAuthorizer_2_mv9DZ5/http_credentials"
--http_heartbeat_interval="30secs" --initialize_driver_logging="true" --isolation="posix/cpu,posix/mem"
--launcher="posix" --launcher_dir="/mesos/mesos-1.5.0/_build/src" --logbufsecs="0" --logging_level="INFO"
--max_completed_executors_per_framework="150" --oversubscribed_resources_interval="15secs"
--perf_duration="10secs" --perf_interval="1mins" --port="5051" --qos_correction_interval_min="0ns"
--quiet="false" --recover="reconnect" --recovery_timeout="15mins" --registration_backoff_factor="10ms"
--resources="cpus:2;gpus:0;mem:1024;disk:1024;ports:[31000-32000]" --revocable_cpu_low_priority="true"
--runtime_dir="/tmp/Endpoint_SlaveEndpointTest_NoAuthorizer_2_mv9DZ5" --sandbox_directory="/mnt/mesos/sandbox"
--strict="true" --switch_user="true" --systemd_enable_support="true" --systemd_runtime_directory="/run/systemd/system"
--version="false" --work_dir="/tmp/Endpoint_SlaveEndpointTest_NoAuthorizer_2_7IRXN4" --zk_session_timeout="10secs"
I0928 14:48:03.559839 29546 credentials.hpp:86] Loading credential for authentication from
'/tmp/Endpoint_SlaveEndpointTest_NoAuthorizer_2_mv9DZ5/credential'
I0928 14:48:03.559994 29546 slave.cpp:287] Agent using credential for: test-principal
I0928 14:48:03.560016 29546 credentials.hpp:37] Loading credentials for authentication from
'/tmp/Endpoint_SlaveEndpointTest_NoAuthorizer_2_mv9DZ5/http_credentials'
I0928 14:48:03.560315 29546 http.cpp:1045] Creating default 'basic' HTTP authenticator for
realm 'mesos-agent-executor'
I0928 14:48:03.560447 29546 http.cpp:1066] Creating default 'jwt' HTTP authenticator for realm
'mesos-agent-executor'
I0928 14:48:03.560703 29546 http.cpp:1045] Creating default 'basic' HTTP authenticator for
realm 'mesos-agent-readonly'
I0928 14:48:03.560809 29546 http.cpp:1066] Creating default 'jwt' HTTP authenticator for realm
'mesos-agent-readonly'
I0928 14:48:03.560994 29546 http.cpp:1045] Creating default 'basic' HTTP authenticator for
realm 'mesos-agent-readwrite'
I0928 14:48:03.561108 29546 http.cpp:1066] Creating default 'jwt' HTTP authenticator for realm
'mesos-agent-readwrite'
I0928 14:48:03.562489 29546 slave.cpp:585] Agent resources: [{"name":"cpus","scalar":{"value":2.0},"type":"SCALAR"},{"name":"mem","scalar":{"value":1024.0},"type":"SCALAR"},{"name":"disk","scalar":{"value":1024.0},"type":"SCALAR"},{"name":"ports","ranges":{"range":[{"begin":31000,"end":32000}]},"type":"RANGES"}]
I0928 14:48:03.562716 29546 slave.cpp:593] Agent attributes: [  ]
I0928 14:48:03.562731 29546 slave.cpp:602] Agent hostname: d87ed8082743
I0928 14:48:03.562852 29543 status_update_manager.cpp:177] Pausing sending status updates
I0928 14:48:03.564278 29531 state.cpp:64] Recovering state from '/tmp/Endpoint_SlaveEndpointTest_NoAuthorizer_2_7IRXN4/meta'
I0928 14:48:03.564602 29530 status_update_manager.cpp:203] Recovering status update manager
I0928 14:48:03.564865 29530 containerizer.cpp:648] Recovering containerizer
I0928 14:48:03.566290 29525 provisioner.cpp:416] Provisioner recovery complete
I0928 14:48:03.566639 29532 slave.cpp:6322] Finished recovery
I0928 14:48:03.567142 29532 slave.cpp:6504] Querying resource estimator for oversubscribable
resources
I0928 14:48:03.567383 29536 slave.cpp:6518] Received oversubscribable resources {} from the
resource estimator
I0928 14:48:03.569506 29529 process.cpp:3929] Handling HTTP event for process 'slave(823)'
with path: '/slave(823)/containers'
I0928 14:48:03.571259 29525 http.cpp:1185] HTTP GET for /slave(823)/containers from 172.17.0.3:50548
I0928 14:48:03.571323 29525 http.cpp:976] Authorizing principal 'test-principal' to GET the
'/containers' endpoint
I0928 14:48:03.575160 29527 slave.cpp:869] Agent terminating
[       OK ] Endpoint/SlaveEndpointTest.NoAuthorizer/2 (31 ms)
[----------] 9 tests from Endpoint/SlaveEndpointTest (282 ms total)

[----------] 2 tests from ContainerizerType/DefaultContainerDNSFlagTest
[ RUN      ] ContainerizerType/DefaultContainerDNSFlagTest.ValidateFlag/0
[       OK ] ContainerizerType/DefaultContainerDNSFlagTest.ValidateFlag/0 (13 ms)
[ RUN      ] ContainerizerType/DefaultContainerDNSFlagTest.ValidateFlag/1
[       OK ] ContainerizerType/DefaultContainerDNSFlagTest.ValidateFlag/1 (13 ms)
[----------] 2 tests from ContainerizerType/DefaultContainerDNSFlagTest (26 ms total)

[----------] Global test environment tear-down
[==========] 1684 tests from 186 test cases ran. (648858 ms total)
[  PASSED  ] 1683 tests.
[  FAILED  ] 1 test, listed below:
[  FAILED  ] ExamplesTest.PersistentVolumeFramework

 1 FAILED TEST
  YOU HAVE 20 DISABLED TESTS

I0928 14:48:03.669821 29547 process.cpp:1068] Failed to accept socket: future discarded
make[4]: *** [check-local] Error 1
make[4]: Leaving directory `/mesos/mesos-1.5.0/_build/src'
make[3]: *** [check-am] Error 2
make[3]: Leaving directory `/mesos/mesos-1.5.0/_build/src'
make[2]: *** [check] Error 2
make[2]: Leaving directory `/mesos/mesos-1.5.0/_build/src'
make[1]: *** [check-recursive] Error 1
make[1]: Leaving directory `/mesos/mesos-1.5.0/_build'
make: *** [distcheck] Error 1
+ docker rmi mesos-1506606490-5318
Untagged: mesos-1506606490-5318:latest
Deleted: sha256:2945211d2cad2dad04df1a9efe2167bff2a96466bc37dd6b2e2590ea6dd0bf8b
Deleted: sha256:8632584c0f06d88b5c3ed8e90fb4c841a7d65ec5f116a64027925c7d77c16367
Deleted: sha256:316b4400a15beab0be4e64108446b1cf94bedc68594ef4fa485c1d3c5e83ab9f
Deleted: sha256:0b43ffd20470578e53284f750b0cef5cd0f13a0dfb90ed39ebd290e65dbaba8e
Deleted: sha256:5779ab186b25c850bacf3a82ac5120102401aadde9a90352ba599ee6c0c08c9b
Deleted: sha256:0b1176975606bb6705164b49037a9be4741068abce91be48c7d4d54ed19d8bc7
Deleted: sha256:7b4d2ed5089911cda6ed699bd1f79192215c827fa6f8393389782f970471ac80
Deleted: sha256:509e001b4f310eb0e1e26fc336466892bf1beb5dc47ba7963af59ec2c5a64e77
Deleted: sha256:3e5b22468ac5164cc9b0098869ac117fdbb790613411f475b0b3bb6f50a61cc5
Deleted: sha256:47bfa7c4e3d2c0970eb1055335c0616c5482d6ba42036d256a928530b0c4abf8
Deleted: sha256:16b08c02426eea0c63dd488c99dd449edc535d9290b50679081ebc347526ae1a
Deleted: sha256:0bb609a13222369744f8385ee8b4ce52beaa33d9c9fa6b8f068ee5cafc2ced14
Deleted: sha256:989cb9734f2e0f16b161c9ecf08def6f6169306677b71c4b11faf96957436356
Deleted: sha256:0f399f5b66259717e2d1fab605bece35c1b84ec0a76cb211032237c29932e52a
Deleted: sha256:7818c6ea605e81253ab54385f5e8b84464880e389fd8481a877be06e3c22d3be
Deleted: sha256:859cbf841c4ca40273e7c7468886d6fc0592fc801d9be04f70bf1e23b8c1b0b6
Deleted: sha256:45139e2a6a0ebd2a85c3b46f77d4cc624c0f93b273b79b76bac3ad9ffeda7201
Deleted: sha256:848d27b2681204c220f6d9c38d478650a833cd41b48d7449c6d452b3163a96ef
Deleted: sha256:cedc2af71cbb6a1d1c66487938c7123695b210336a96114d731c090de56651ff
Deleted: sha256:871fa86b3250a7ccea0b191c16dd75b3bec7fae7d159d9d7509e4a9248e4488f
Deleted: sha256:f6da246a2a306fbbbdd6639f5de8381433faffaa4bac6007cba67a4128ec9a6f
Deleted: sha256:5c5ed83c39ca04f9c0802f8cbe970d5626cc14d2a07832b60ea9d706eb6bdfa8
Deleted: sha256:bf4dc6c3ed03e17e039a3703af7cb7425f2e43c37abb3595cb3386df401cc05f
Deleted: sha256:397ebde62bf35c377fcf249185df53dbba42ac5df0e054eb4cfb0cc9cd5bb66b
Deleted: sha256:5f9c0ca15c404a05862a9e68d3f11377d26d238c31e9475ec089287014465614
Deleted: sha256:9fa6b62be87f1cd60976cf5dcc8b0f178d8df81ba65a1dd12ceb3066105a0f00
Deleted: sha256:c1fb99ae1d3d2b2318d8292779c57c5f5855ba21b47de1b44cd6d7da3801f5e8
Deleted: sha256:bca46920a442dd4d1fc468afba57d4dcdddb016add743d65bcc22a4ae39cd6ab
Build step 'Execute shell' marked build as failure
Not sending mail to unregistered user benjamin.hindman@gmail.com

Mime
View raw message