mesos-builds mailing list archives

Site index · List index
Message view « Date » · « Thread »
Top « Date » · « Thread »
From Apache Jenkins Server <jenk...@builds.apache.org>
Subject Build failed in Jenkins: Mesos-Buildbot » cmake,gcc,--verbose,GLOG_v=1 MESOS_VERBOSE=1,ubuntu:14.04,(ubuntu)&&(!ubuntu-us1)&&(!ubuntu-eu2)&&(!qnode3)&&(!H23) #4227
Date Fri, 15 Sep 2017 12:43:50 GMT
See <https://builds.apache.org/job/Mesos-Buildbot/BUILDTOOL=cmake,COMPILER=gcc,CONFIGURATION=--verbose,ENVIRONMENT=GLOG_v=1%20MESOS_VERBOSE=1,OS=ubuntu%3A14.04,label_exp=(ubuntu)&&(!ubuntu-us1)&&(!ubuntu-eu2)&&(!qnode3)&&(!H23)/4227/display/redirect>

------------------------------------------
[...truncated 1.12 MB...]
cd /mesos/build/src/tests && /usr/bin/g++  -DBUILD_DIR=\"/mesos/build\" -DBUILD_FLAGS=\"\" -DBUILD_JAVA_JVM_LIBRARY=\"\" -DHAS_AUTHENTICATION=1 -DHAVE_LIBZ -DLIBDIR=\"/usr/local/libmesos\" -DPICOJSON_USE_INT64 -DPKGDATADIR=\"/usr/local/share/mesos\" -DPKGLIBEXECDIR=\"/usr/local/libexec/mesos\" -DPKGMODULEDIR=\"\" -DSBINDIR=\"\" -DSOURCE_DIR=\"/mesos\" -DTESTLIBEXECDIR=\"\" -DUSE_CMAKE_BUILD_CONFIG -DUSE_STATIC_LIB -DVERSION=\"1.5.0\" -DZOOKEEPER_VERSION=\"3.4.8\" -D__STDC_FORMAT_MACROS -I/mesos/include -I/mesos/build/include -I/mesos/build/include/mesos -I/mesos/build/src -I/mesos/src -I/mesos/3rdparty/libprocess/src/../include -I/mesos/3rdparty/stout/include -isystem /usr/include/apr-1.0 -isystem /mesos/build/3rdparty/boost-1.53.0/src/boost-1.53.0 -isystem /mesos/build/3rdparty/elfio-3.2/src/elfio-3.2 -isystem /mesos/build/3rdparty/glog-0.3.3/src/glog-0.3.3-build/include -isystem /mesos/build/3rdparty/picojson-1.3.0/src/picojson-1.3.0 -isystem /mesos/build/3rdparty/protobuf-3.3.0/src/protobuf-3.3.0/src -isystem /usr/include/subversion-1 -isystem /mesos/build/3rdparty/http_parser-2.6.2/src/http_parser-2.6.2 -isystem /mesos/build/3rdparty/zookeeper-3.4.8/src/zookeeper-3.4.8/src/c/include -isystem /mesos/build/3rdparty/zookeeper-3.4.8/src/zookeeper-3.4.8/src/c/generated -isystem /mesos/build/3rdparty/nvml-352.79/src/nvml-352.79 -isystem /mesos/build/3rdparty/leveldb-1.19/src/leveldb-1.19/include -isystem /mesos/build/3rdparty/googletest-1.8.0/src/googletest-1.8.0/googlemock/include -isystem /mesos/build/3rdparty/googletest-1.8.0/src/googletest-1.8.0/googletest/include  -std=c++11 -Wformat-security -fstack-protector -fPIE   -o CMakeFiles/mesos-tests.dir/containerizer/memory_test_helper.cpp.o -c /mesos/src/tests/containerizer/memory_test_helper.cpp
[ 83%] Building CXX object src/tests/CMakeFiles/mesos-tests.dir/containerizer/capabilities_test_helper.cpp.o
cd /mesos/build/src/tests && /usr/bin/g++  -DBUILD_DIR=\"/mesos/build\" -DBUILD_FLAGS=\"\" -DBUILD_JAVA_JVM_LIBRARY=\"\" -DHAS_AUTHENTICATION=1 -DHAVE_LIBZ -DLIBDIR=\"/usr/local/libmesos\" -DPICOJSON_USE_INT64 -DPKGDATADIR=\"/usr/local/share/mesos\" -DPKGLIBEXECDIR=\"/usr/local/libexec/mesos\" -DPKGMODULEDIR=\"\" -DSBINDIR=\"\" -DSOURCE_DIR=\"/mesos\" -DTESTLIBEXECDIR=\"\" -DUSE_CMAKE_BUILD_CONFIG -DUSE_STATIC_LIB -DVERSION=\"1.5.0\" -DZOOKEEPER_VERSION=\"3.4.8\" -D__STDC_FORMAT_MACROS -I/mesos/include -I/mesos/build/include -I/mesos/build/include/mesos -I/mesos/build/src -I/mesos/src -I/mesos/3rdparty/libprocess/src/../include -I/mesos/3rdparty/stout/include -isystem /usr/include/apr-1.0 -isystem /mesos/build/3rdparty/boost-1.53.0/src/boost-1.53.0 -isystem /mesos/build/3rdparty/elfio-3.2/src/elfio-3.2 -isystem /mesos/build/3rdparty/glog-0.3.3/src/glog-0.3.3-build/include -isystem /mesos/build/3rdparty/picojson-1.3.0/src/picojson-1.3.0 -isystem /mesos/build/3rdparty/protobuf-3.3.0/src/protobuf-3.3.0/src -isystem /usr/include/subversion-1 -isystem /mesos/build/3rdparty/http_parser-2.6.2/src/http_parser-2.6.2 -isystem /mesos/build/3rdparty/zookeeper-3.4.8/src/zookeeper-3.4.8/src/c/include -isystem /mesos/build/3rdparty/zookeeper-3.4.8/src/zookeeper-3.4.8/src/c/generated -isystem /mesos/build/3rdparty/nvml-352.79/src/nvml-352.79 -isystem /mesos/build/3rdparty/leveldb-1.19/src/leveldb-1.19/include -isystem /mesos/build/3rdparty/googletest-1.8.0/src/googletest-1.8.0/googlemock/include -isystem /mesos/build/3rdparty/googletest-1.8.0/src/googletest-1.8.0/googletest/include  -std=c++11 -Wformat-security -fstack-protector -fPIE   -o CMakeFiles/mesos-tests.dir/containerizer/capabilities_test_helper.cpp.o -c /mesos/src/tests/containerizer/capabilities_test_helper.cpp
[ 83%] Building CXX object src/tests/CMakeFiles/mesos-tests.dir/containerizer/setns_test_helper.cpp.o
cd /mesos/build/src/tests && /usr/bin/g++  -DBUILD_DIR=\"/mesos/build\" -DBUILD_FLAGS=\"\" -DBUILD_JAVA_JVM_LIBRARY=\"\" -DHAS_AUTHENTICATION=1 -DHAVE_LIBZ -DLIBDIR=\"/usr/local/libmesos\" -DPICOJSON_USE_INT64 -DPKGDATADIR=\"/usr/local/share/mesos\" -DPKGLIBEXECDIR=\"/usr/local/libexec/mesos\" -DPKGMODULEDIR=\"\" -DSBINDIR=\"\" -DSOURCE_DIR=\"/mesos\" -DTESTLIBEXECDIR=\"\" -DUSE_CMAKE_BUILD_CONFIG -DUSE_STATIC_LIB -DVERSION=\"1.5.0\" -DZOOKEEPER_VERSION=\"3.4.8\" -D__STDC_FORMAT_MACROS -I/mesos/include -I/mesos/build/include -I/mesos/build/include/mesos -I/mesos/build/src -I/mesos/src -I/mesos/3rdparty/libprocess/src/../include -I/mesos/3rdparty/stout/include -isystem /usr/include/apr-1.0 -isystem /mesos/build/3rdparty/boost-1.53.0/src/boost-1.53.0 -isystem /mesos/build/3rdparty/elfio-3.2/src/elfio-3.2 -isystem /mesos/build/3rdparty/glog-0.3.3/src/glog-0.3.3-build/include -isystem /mesos/build/3rdparty/picojson-1.3.0/src/picojson-1.3.0 -isystem /mesos/build/3rdparty/protobuf-3.3.0/src/protobuf-3.3.0/src -isystem /usr/include/subversion-1 -isystem /mesos/build/3rdparty/http_parser-2.6.2/src/http_parser-2.6.2 -isystem /mesos/build/3rdparty/zookeeper-3.4.8/src/zookeeper-3.4.8/src/c/include -isystem /mesos/build/3rdparty/zookeeper-3.4.8/src/zookeeper-3.4.8/src/c/generated -isystem /mesos/build/3rdparty/nvml-352.79/src/nvml-352.79 -isystem /mesos/build/3rdparty/leveldb-1.19/src/leveldb-1.19/include -isystem /mesos/build/3rdparty/googletest-1.8.0/src/googletest-1.8.0/googlemock/include -isystem /mesos/build/3rdparty/googletest-1.8.0/src/googletest-1.8.0/googletest/include  -std=c++11 -Wformat-security -fstack-protector -fPIE   -o CMakeFiles/mesos-tests.dir/containerizer/setns_test_helper.cpp.o -c /mesos/src/tests/containerizer/setns_test_helper.cpp
[ 84%] Building CXX object src/tests/CMakeFiles/mesos-tests.dir/anonymous_tests.cpp.o
cd /mesos/build/src/tests && /usr/bin/g++  -DBUILD_DIR=\"/mesos/build\" -DBUILD_FLAGS=\"\" -DBUILD_JAVA_JVM_LIBRARY=\"\" -DHAS_AUTHENTICATION=1 -DHAVE_LIBZ -DLIBDIR=\"/usr/local/libmesos\" -DPICOJSON_USE_INT64 -DPKGDATADIR=\"/usr/local/share/mesos\" -DPKGLIBEXECDIR=\"/usr/local/libexec/mesos\" -DPKGMODULEDIR=\"\" -DSBINDIR=\"\" -DSOURCE_DIR=\"/mesos\" -DTESTLIBEXECDIR=\"\" -DUSE_CMAKE_BUILD_CONFIG -DUSE_STATIC_LIB -DVERSION=\"1.5.0\" -DZOOKEEPER_VERSION=\"3.4.8\" -D__STDC_FORMAT_MACROS -I/mesos/include -I/mesos/build/include -I/mesos/build/include/mesos -I/mesos/build/src -I/mesos/src -I/mesos/3rdparty/libprocess/src/../include -I/mesos/3rdparty/stout/include -isystem /usr/include/apr-1.0 -isystem /mesos/build/3rdparty/boost-1.53.0/src/boost-1.53.0 -isystem /mesos/build/3rdparty/elfio-3.2/src/elfio-3.2 -isystem /mesos/build/3rdparty/glog-0.3.3/src/glog-0.3.3-build/include -isystem /mesos/build/3rdparty/picojson-1.3.0/src/picojson-1.3.0 -isystem /mesos/build/3rdparty/protobuf-3.3.0/src/protobuf-3.3.0/src -isystem /usr/include/subversion-1 -isystem /mesos/build/3rdparty/http_parser-2.6.2/src/http_parser-2.6.2 -isystem /mesos/build/3rdparty/zookeeper-3.4.8/src/zookeeper-3.4.8/src/c/include -isystem /mesos/build/3rdparty/zookeeper-3.4.8/src/zookeeper-3.4.8/src/c/generated -isystem /mesos/build/3rdparty/nvml-352.79/src/nvml-352.79 -isystem /mesos/build/3rdparty/leveldb-1.19/src/leveldb-1.19/include -isystem /mesos/build/3rdparty/googletest-1.8.0/src/googletest-1.8.0/googlemock/include -isystem /mesos/build/3rdparty/googletest-1.8.0/src/googletest-1.8.0/googletest/include  -std=c++11 -Wformat-security -fstack-protector -fPIE   -o CMakeFiles/mesos-tests.dir/anonymous_tests.cpp.o -c /mesos/src/tests/anonymous_tests.cpp
[ 84%] Building CXX object src/tests/CMakeFiles/mesos-tests.dir/api_tests.cpp.o
cd /mesos/build/src/tests && /usr/bin/g++  -DBUILD_DIR=\"/mesos/build\" -DBUILD_FLAGS=\"\" -DBUILD_JAVA_JVM_LIBRARY=\"\" -DHAS_AUTHENTICATION=1 -DHAVE_LIBZ -DLIBDIR=\"/usr/local/libmesos\" -DPICOJSON_USE_INT64 -DPKGDATADIR=\"/usr/local/share/mesos\" -DPKGLIBEXECDIR=\"/usr/local/libexec/mesos\" -DPKGMODULEDIR=\"\" -DSBINDIR=\"\" -DSOURCE_DIR=\"/mesos\" -DTESTLIBEXECDIR=\"\" -DUSE_CMAKE_BUILD_CONFIG -DUSE_STATIC_LIB -DVERSION=\"1.5.0\" -DZOOKEEPER_VERSION=\"3.4.8\" -D__STDC_FORMAT_MACROS -I/mesos/include -I/mesos/build/include -I/mesos/build/include/mesos -I/mesos/build/src -I/mesos/src -I/mesos/3rdparty/libprocess/src/../include -I/mesos/3rdparty/stout/include -isystem /usr/include/apr-1.0 -isystem /mesos/build/3rdparty/boost-1.53.0/src/boost-1.53.0 -isystem /mesos/build/3rdparty/elfio-3.2/src/elfio-3.2 -isystem /mesos/build/3rdparty/glog-0.3.3/src/glog-0.3.3-build/include -isystem /mesos/build/3rdparty/picojson-1.3.0/src/picojson-1.3.0 -isystem /mesos/build/3rdparty/protobuf-3.3.0/src/protobuf-3.3.0/src -isystem /usr/include/subversion-1 -isystem /mesos/build/3rdparty/http_parser-2.6.2/src/http_parser-2.6.2 -isystem /mesos/build/3rdparty/zookeeper-3.4.8/src/zookeeper-3.4.8/src/c/include -isystem /mesos/build/3rdparty/zookeeper-3.4.8/src/zookeeper-3.4.8/src/c/generated -isystem /mesos/build/3rdparty/nvml-352.79/src/nvml-352.79 -isystem /mesos/build/3rdparty/leveldb-1.19/src/leveldb-1.19/include -isystem /mesos/build/3rdparty/googletest-1.8.0/src/googletest-1.8.0/googlemock/include -isystem /mesos/build/3rdparty/googletest-1.8.0/src/googletest-1.8.0/googletest/include  -std=c++11 -Wformat-security -fstack-protector -fPIE   -o CMakeFiles/mesos-tests.dir/api_tests.cpp.o -c /mesos/src/tests/api_tests.cpp
[ 84%] Building CXX object src/tests/CMakeFiles/mesos-tests.dir/attributes_tests.cpp.o
cd /mesos/build/src/tests && /usr/bin/g++  -DBUILD_DIR=\"/mesos/build\" -DBUILD_FLAGS=\"\" -DBUILD_JAVA_JVM_LIBRARY=\"\" -DHAS_AUTHENTICATION=1 -DHAVE_LIBZ -DLIBDIR=\"/usr/local/libmesos\" -DPICOJSON_USE_INT64 -DPKGDATADIR=\"/usr/local/share/mesos\" -DPKGLIBEXECDIR=\"/usr/local/libexec/mesos\" -DPKGMODULEDIR=\"\" -DSBINDIR=\"\" -DSOURCE_DIR=\"/mesos\" -DTESTLIBEXECDIR=\"\" -DUSE_CMAKE_BUILD_CONFIG -DUSE_STATIC_LIB -DVERSION=\"1.5.0\" -DZOOKEEPER_VERSION=\"3.4.8\" -D__STDC_FORMAT_MACROS -I/mesos/include -I/mesos/build/include -I/mesos/build/include/mesos -I/mesos/build/src -I/mesos/src -I/mesos/3rdparty/libprocess/src/../include -I/mesos/3rdparty/stout/include -isystem /usr/include/apr-1.0 -isystem /mesos/build/3rdparty/boost-1.53.0/src/boost-1.53.0 -isystem /mesos/build/3rdparty/elfio-3.2/src/elfio-3.2 -isystem /mesos/build/3rdparty/glog-0.3.3/src/glog-0.3.3-build/include -isystem /mesos/build/3rdparty/picojson-1.3.0/src/picojson-1.3.0 -isystem /mesos/build/3rdparty/protobuf-3.3.0/src/protobuf-3.3.0/src -isystem /usr/include/subversion-1 -isystem /mesos/build/3rdparty/http_parser-2.6.2/src/http_parser-2.6.2 -isystem /mesos/build/3rdparty/zookeeper-3.4.8/src/zookeeper-3.4.8/src/c/include -isystem /mesos/build/3rdparty/zookeeper-3.4.8/src/zookeeper-3.4.8/src/c/generated -isystem /mesos/build/3rdparty/nvml-352.79/src/nvml-352.79 -isystem /mesos/build/3rdparty/leveldb-1.19/src/leveldb-1.19/include -isystem /mesos/build/3rdparty/googletest-1.8.0/src/googletest-1.8.0/googlemock/include -isystem /mesos/build/3rdparty/googletest-1.8.0/src/googletest-1.8.0/googletest/include  -std=c++11 -Wformat-security -fstack-protector -fPIE   -o CMakeFiles/mesos-tests.dir/attributes_tests.cpp.o -c /mesos/src/tests/attributes_tests.cpp
[ 84%] Building CXX object src/tests/CMakeFiles/mesos-tests.dir/authentication_tests.cpp.o
cd /mesos/build/src/tests && /usr/bin/g++  -DBUILD_DIR=\"/mesos/build\" -DBUILD_FLAGS=\"\" -DBUILD_JAVA_JVM_LIBRARY=\"\" -DHAS_AUTHENTICATION=1 -DHAVE_LIBZ -DLIBDIR=\"/usr/local/libmesos\" -DPICOJSON_USE_INT64 -DPKGDATADIR=\"/usr/local/share/mesos\" -DPKGLIBEXECDIR=\"/usr/local/libexec/mesos\" -DPKGMODULEDIR=\"\" -DSBINDIR=\"\" -DSOURCE_DIR=\"/mesos\" -DTESTLIBEXECDIR=\"\" -DUSE_CMAKE_BUILD_CONFIG -DUSE_STATIC_LIB -DVERSION=\"1.5.0\" -DZOOKEEPER_VERSION=\"3.4.8\" -D__STDC_FORMAT_MACROS -I/mesos/include -I/mesos/build/include -I/mesos/build/include/mesos -I/mesos/build/src -I/mesos/src -I/mesos/3rdparty/libprocess/src/../include -I/mesos/3rdparty/stout/include -isystem /usr/include/apr-1.0 -isystem /mesos/build/3rdparty/boost-1.53.0/src/boost-1.53.0 -isystem /mesos/build/3rdparty/elfio-3.2/src/elfio-3.2 -isystem /mesos/build/3rdparty/glog-0.3.3/src/glog-0.3.3-build/include -isystem /mesos/build/3rdparty/picojson-1.3.0/src/picojson-1.3.0 -isystem /mesos/build/3rdparty/protobuf-3.3.0/src/protobuf-3.3.0/src -isystem /usr/include/subversion-1 -isystem /mesos/build/3rdparty/http_parser-2.6.2/src/http_parser-2.6.2 -isystem /mesos/build/3rdparty/zookeeper-3.4.8/src/zookeeper-3.4.8/src/c/include -isystem /mesos/build/3rdparty/zookeeper-3.4.8/src/zookeeper-3.4.8/src/c/generated -isystem /mesos/build/3rdparty/nvml-352.79/src/nvml-352.79 -isystem /mesos/build/3rdparty/leveldb-1.19/src/leveldb-1.19/include -isystem /mesos/build/3rdparty/googletest-1.8.0/src/googletest-1.8.0/googlemock/include -isystem /mesos/build/3rdparty/googletest-1.8.0/src/googletest-1.8.0/googletest/include  -std=c++11 -Wformat-security -fstack-protector -fPIE   -o CMakeFiles/mesos-tests.dir/authentication_tests.cpp.o -c /mesos/src/tests/authentication_tests.cpp
[ 84%] Building CXX object src/tests/CMakeFiles/mesos-tests.dir/check_tests.cpp.o
cd /mesos/build/src/tests && /usr/bin/g++  -DBUILD_DIR=\"/mesos/build\" -DBUILD_FLAGS=\"\" -DBUILD_JAVA_JVM_LIBRARY=\"\" -DHAS_AUTHENTICATION=1 -DHAVE_LIBZ -DLIBDIR=\"/usr/local/libmesos\" -DPICOJSON_USE_INT64 -DPKGDATADIR=\"/usr/local/share/mesos\" -DPKGLIBEXECDIR=\"/usr/local/libexec/mesos\" -DPKGMODULEDIR=\"\" -DSBINDIR=\"\" -DSOURCE_DIR=\"/mesos\" -DTESTLIBEXECDIR=\"\" -DUSE_CMAKE_BUILD_CONFIG -DUSE_STATIC_LIB -DVERSION=\"1.5.0\" -DZOOKEEPER_VERSION=\"3.4.8\" -D__STDC_FORMAT_MACROS -I/mesos/include -I/mesos/build/include -I/mesos/build/include/mesos -I/mesos/build/src -I/mesos/src -I/mesos/3rdparty/libprocess/src/../include -I/mesos/3rdparty/stout/include -isystem /usr/include/apr-1.0 -isystem /mesos/build/3rdparty/boost-1.53.0/src/boost-1.53.0 -isystem /mesos/build/3rdparty/elfio-3.2/src/elfio-3.2 -isystem /mesos/build/3rdparty/glog-0.3.3/src/glog-0.3.3-build/include -isystem /mesos/build/3rdparty/picojson-1.3.0/src/picojson-1.3.0 -isystem /mesos/build/3rdparty/protobuf-3.3.0/src/protobuf-3.3.0/src -isystem /usr/include/subversion-1 -isystem /mesos/build/3rdparty/http_parser-2.6.2/src/http_parser-2.6.2 -isystem /mesos/build/3rdparty/zookeeper-3.4.8/src/zookeeper-3.4.8/src/c/include -isystem /mesos/build/3rdparty/zookeeper-3.4.8/src/zookeeper-3.4.8/src/c/generated -isystem /mesos/build/3rdparty/nvml-352.79/src/nvml-352.79 -isystem /mesos/build/3rdparty/leveldb-1.19/src/leveldb-1.19/include -isystem /mesos/build/3rdparty/googletest-1.8.0/src/googletest-1.8.0/googlemock/include -isystem /mesos/build/3rdparty/googletest-1.8.0/src/googletest-1.8.0/googletest/include  -std=c++11 -Wformat-security -fstack-protector -fPIE   -o CMakeFiles/mesos-tests.dir/check_tests.cpp.o -c /mesos/src/tests/check_tests.cpp
[ 84%] Building CXX object src/tests/CMakeFiles/mesos-tests.dir/command_executor_tests.cpp.o
cd /mesos/build/src/tests && /usr/bin/g++  -DBUILD_DIR=\"/mesos/build\" -DBUILD_FLAGS=\"\" -DBUILD_JAVA_JVM_LIBRARY=\"\" -DHAS_AUTHENTICATION=1 -DHAVE_LIBZ -DLIBDIR=\"/usr/local/libmesos\" -DPICOJSON_USE_INT64 -DPKGDATADIR=\"/usr/local/share/mesos\" -DPKGLIBEXECDIR=\"/usr/local/libexec/mesos\" -DPKGMODULEDIR=\"\" -DSBINDIR=\"\" -DSOURCE_DIR=\"/mesos\" -DTESTLIBEXECDIR=\"\" -DUSE_CMAKE_BUILD_CONFIG -DUSE_STATIC_LIB -DVERSION=\"1.5.0\" -DZOOKEEPER_VERSION=\"3.4.8\" -D__STDC_FORMAT_MACROS -I/mesos/include -I/mesos/build/include -I/mesos/build/include/mesos -I/mesos/build/src -I/mesos/src -I/mesos/3rdparty/libprocess/src/../include -I/mesos/3rdparty/stout/include -isystem /usr/include/apr-1.0 -isystem /mesos/build/3rdparty/boost-1.53.0/src/boost-1.53.0 -isystem /mesos/build/3rdparty/elfio-3.2/src/elfio-3.2 -isystem /mesos/build/3rdparty/glog-0.3.3/src/glog-0.3.3-build/include -isystem /mesos/build/3rdparty/picojson-1.3.0/src/picojson-1.3.0 -isystem /mesos/build/3rdparty/protobuf-3.3.0/src/protobuf-3.3.0/src -isystem /usr/include/subversion-1 -isystem /mesos/build/3rdparty/http_parser-2.6.2/src/http_parser-2.6.2 -isystem /mesos/build/3rdparty/zookeeper-3.4.8/src/zookeeper-3.4.8/src/c/include -isystem /mesos/build/3rdparty/zookeeper-3.4.8/src/zookeeper-3.4.8/src/c/generated -isystem /mesos/build/3rdparty/nvml-352.79/src/nvml-352.79 -isystem /mesos/build/3rdparty/leveldb-1.19/src/leveldb-1.19/include -isystem /mesos/build/3rdparty/googletest-1.8.0/src/googletest-1.8.0/googlemock/include -isystem /mesos/build/3rdparty/googletest-1.8.0/src/googletest-1.8.0/googletest/include  -std=c++11 -Wformat-security -fstack-protector -fPIE   -o CMakeFiles/mesos-tests.dir/command_executor_tests.cpp.o -c /mesos/src/tests/command_executor_tests.cpp
[ 84%] Building CXX object src/tests/CMakeFiles/mesos-tests.dir/common_validation_tests.cpp.o
cd /mesos/build/src/tests && /usr/bin/g++  -DBUILD_DIR=\"/mesos/build\" -DBUILD_FLAGS=\"\" -DBUILD_JAVA_JVM_LIBRARY=\"\" -DHAS_AUTHENTICATION=1 -DHAVE_LIBZ -DLIBDIR=\"/usr/local/libmesos\" -DPICOJSON_USE_INT64 -DPKGDATADIR=\"/usr/local/share/mesos\" -DPKGLIBEXECDIR=\"/usr/local/libexec/mesos\" -DPKGMODULEDIR=\"\" -DSBINDIR=\"\" -DSOURCE_DIR=\"/mesos\" -DTESTLIBEXECDIR=\"\" -DUSE_CMAKE_BUILD_CONFIG -DUSE_STATIC_LIB -DVERSION=\"1.5.0\" -DZOOKEEPER_VERSION=\"3.4.8\" -D__STDC_FORMAT_MACROS -I/mesos/include -I/mesos/build/include -I/mesos/build/include/mesos -I/mesos/build/src -I/mesos/src -I/mesos/3rdparty/libprocess/src/../include -I/mesos/3rdparty/stout/include -isystem /usr/include/apr-1.0 -isystem /mesos/build/3rdparty/boost-1.53.0/src/boost-1.53.0 -isystem /mesos/build/3rdparty/elfio-3.2/src/elfio-3.2 -isystem /mesos/build/3rdparty/glog-0.3.3/src/glog-0.3.3-build/include -isystem /mesos/build/3rdparty/picojson-1.3.0/src/picojson-1.3.0 -isystem /mesos/build/3rdparty/protobuf-3.3.0/src/protobuf-3.3.0/src -isystem /usr/include/subversion-1 -isystem /mesos/build/3rdparty/http_parser-2.6.2/src/http_parser-2.6.2 -isystem /mesos/build/3rdparty/zookeeper-3.4.8/src/zookeeper-3.4.8/src/c/include -isystem /mesos/build/3rdparty/zookeeper-3.4.8/src/zookeeper-3.4.8/src/c/generated -isystem /mesos/build/3rdparty/nvml-352.79/src/nvml-352.79 -isystem /mesos/build/3rdparty/leveldb-1.19/src/leveldb-1.19/include -isystem /mesos/build/3rdparty/googletest-1.8.0/src/googletest-1.8.0/googlemock/include -isystem /mesos/build/3rdparty/googletest-1.8.0/src/googletest-1.8.0/googletest/include  -std=c++11 -Wformat-security -fstack-protector -fPIE   -o CMakeFiles/mesos-tests.dir/common_validation_tests.cpp.o -c /mesos/src/tests/common_validation_tests.cpp
[ 84%] Building CXX object src/tests/CMakeFiles/mesos-tests.dir/credentials_tests.cpp.o
cd /mesos/build/src/tests && /usr/bin/g++  -DBUILD_DIR=\"/mesos/build\" -DBUILD_FLAGS=\"\" -DBUILD_JAVA_JVM_LIBRARY=\"\" -DHAS_AUTHENTICATION=1 -DHAVE_LIBZ -DLIBDIR=\"/usr/local/libmesos\" -DPICOJSON_USE_INT64 -DPKGDATADIR=\"/usr/local/share/mesos\" -DPKGLIBEXECDIR=\"/usr/local/libexec/mesos\" -DPKGMODULEDIR=\"\" -DSBINDIR=\"\" -DSOURCE_DIR=\"/mesos\" -DTESTLIBEXECDIR=\"\" -DUSE_CMAKE_BUILD_CONFIG -DUSE_STATIC_LIB -DVERSION=\"1.5.0\" -DZOOKEEPER_VERSION=\"3.4.8\" -D__STDC_FORMAT_MACROS -I/mesos/include -I/mesos/build/include -I/mesos/build/include/mesos -I/mesos/build/src -I/mesos/src -I/mesos/3rdparty/libprocess/src/../include -I/mesos/3rdparty/stout/include -isystem /usr/include/apr-1.0 -isystem /mesos/build/3rdparty/boost-1.53.0/src/boost-1.53.0 -isystem /mesos/build/3rdparty/elfio-3.2/src/elfio-3.2 -isystem /mesos/build/3rdparty/glog-0.3.3/src/glog-0.3.3-build/include -isystem /mesos/build/3rdparty/picojson-1.3.0/src/picojson-1.3.0 -isystem /mesos/build/3rdparty/protobuf-3.3.0/src/protobuf-3.3.0/src -isystem /usr/include/subversion-1 -isystem /mesos/build/3rdparty/http_parser-2.6.2/src/http_parser-2.6.2 -isystem /mesos/build/3rdparty/zookeeper-3.4.8/src/zookeeper-3.4.8/src/c/include -isystem /mesos/build/3rdparty/zookeeper-3.4.8/src/zookeeper-3.4.8/src/c/generated -isystem /mesos/build/3rdparty/nvml-352.79/src/nvml-352.79 -isystem /mesos/build/3rdparty/leveldb-1.19/src/leveldb-1.19/include -isystem /mesos/build/3rdparty/googletest-1.8.0/src/googletest-1.8.0/googlemock/include -isystem /mesos/build/3rdparty/googletest-1.8.0/src/googletest-1.8.0/googletest/include  -std=c++11 -Wformat-security -fstack-protector -fPIE   -o CMakeFiles/mesos-tests.dir/credentials_tests.cpp.o -c /mesos/src/tests/credentials_tests.cpp
[ 85%] Building CXX object src/tests/CMakeFiles/mesos-tests.dir/default_executor_tests.cpp.o
cd /mesos/build/src/tests && /usr/bin/g++  -DBUILD_DIR=\"/mesos/build\" -DBUILD_FLAGS=\"\" -DBUILD_JAVA_JVM_LIBRARY=\"\" -DHAS_AUTHENTICATION=1 -DHAVE_LIBZ -DLIBDIR=\"/usr/local/libmesos\" -DPICOJSON_USE_INT64 -DPKGDATADIR=\"/usr/local/share/mesos\" -DPKGLIBEXECDIR=\"/usr/local/libexec/mesos\" -DPKGMODULEDIR=\"\" -DSBINDIR=\"\" -DSOURCE_DIR=\"/mesos\" -DTESTLIBEXECDIR=\"\" -DUSE_CMAKE_BUILD_CONFIG -DUSE_STATIC_LIB -DVERSION=\"1.5.0\" -DZOOKEEPER_VERSION=\"3.4.8\" -D__STDC_FORMAT_MACROS -I/mesos/include -I/mesos/build/include -I/mesos/build/include/mesos -I/mesos/build/src -I/mesos/src -I/mesos/3rdparty/libprocess/src/../include -I/mesos/3rdparty/stout/include -isystem /usr/include/apr-1.0 -isystem /mesos/build/3rdparty/boost-1.53.0/src/boost-1.53.0 -isystem /mesos/build/3rdparty/elfio-3.2/src/elfio-3.2 -isystem /mesos/build/3rdparty/glog-0.3.3/src/glog-0.3.3-build/include -isystem /mesos/build/3rdparty/picojson-1.3.0/src/picojson-1.3.0 -isystem /mesos/build/3rdparty/protobuf-3.3.0/src/protobuf-3.3.0/src -isystem /usr/include/subversion-1 -isystem /mesos/build/3rdparty/http_parser-2.6.2/src/http_parser-2.6.2 -isystem /mesos/build/3rdparty/zookeeper-3.4.8/src/zookeeper-3.4.8/src/c/include -isystem /mesos/build/3rdparty/zookeeper-3.4.8/src/zookeeper-3.4.8/src/c/generated -isystem /mesos/build/3rdparty/nvml-352.79/src/nvml-352.79 -isystem /mesos/build/3rdparty/leveldb-1.19/src/leveldb-1.19/include -isystem /mesos/build/3rdparty/googletest-1.8.0/src/googletest-1.8.0/googlemock/include -isystem /mesos/build/3rdparty/googletest-1.8.0/src/googletest-1.8.0/googletest/include  -std=c++11 -Wformat-security -fstack-protector -fPIE   -o CMakeFiles/mesos-tests.dir/default_executor_tests.cpp.o -c /mesos/src/tests/default_executor_tests.cpp
[ 85%] Building CXX object src/tests/CMakeFiles/mesos-tests.dir/exception_tests.cpp.o
cd /mesos/build/src/tests && /usr/bin/g++  -DBUILD_DIR=\"/mesos/build\" -DBUILD_FLAGS=\"\" -DBUILD_JAVA_JVM_LIBRARY=\"\" -DHAS_AUTHENTICATION=1 -DHAVE_LIBZ -DLIBDIR=\"/usr/local/libmesos\" -DPICOJSON_USE_INT64 -DPKGDATADIR=\"/usr/local/share/mesos\" -DPKGLIBEXECDIR=\"/usr/local/libexec/mesos\" -DPKGMODULEDIR=\"\" -DSBINDIR=\"\" -DSOURCE_DIR=\"/mesos\" -DTESTLIBEXECDIR=\"\" -DUSE_CMAKE_BUILD_CONFIG -DUSE_STATIC_LIB -DVERSION=\"1.5.0\" -DZOOKEEPER_VERSION=\"3.4.8\" -D__STDC_FORMAT_MACROS -I/mesos/include -I/mesos/build/include -I/mesos/build/include/mesos -I/mesos/build/src -I/mesos/src -I/mesos/3rdparty/libprocess/src/../include -I/mesos/3rdparty/stout/include -isystem /usr/include/apr-1.0 -isystem /mesos/build/3rdparty/boost-1.53.0/src/boost-1.53.0 -isystem /mesos/build/3rdparty/elfio-3.2/src/elfio-3.2 -isystem /mesos/build/3rdparty/glog-0.3.3/src/glog-0.3.3-build/include -isystem /mesos/build/3rdparty/picojson-1.3.0/src/picojson-1.3.0 -isystem /mesos/build/3rdparty/protobuf-3.3.0/src/protobuf-3.3.0/src -isystem /usr/include/subversion-1 -isystem /mesos/build/3rdparty/http_parser-2.6.2/src/http_parser-2.6.2 -isystem /mesos/build/3rdparty/zookeeper-3.4.8/src/zookeeper-3.4.8/src/c/include -isystem /mesos/build/3rdparty/zookeeper-3.4.8/src/zookeeper-3.4.8/src/c/generated -isystem /mesos/build/3rdparty/nvml-352.79/src/nvml-352.79 -isystem /mesos/build/3rdparty/leveldb-1.19/src/leveldb-1.19/include -isystem /mesos/build/3rdparty/googletest-1.8.0/src/googletest-1.8.0/googlemock/include -isystem /mesos/build/3rdparty/googletest-1.8.0/src/googletest-1.8.0/googletest/include  -std=c++11 -Wformat-security -fstack-protector -fPIE   -o CMakeFiles/mesos-tests.dir/exception_tests.cpp.o -c /mesos/src/tests/exception_tests.cpp
[ 85%] Building CXX object src/tests/CMakeFiles/mesos-tests.dir/executor_http_api_tests.cpp.o
cd /mesos/build/src/tests && /usr/bin/g++  -DBUILD_DIR=\"/mesos/build\" -DBUILD_FLAGS=\"\" -DBUILD_JAVA_JVM_LIBRARY=\"\" -DHAS_AUTHENTICATION=1 -DHAVE_LIBZ -DLIBDIR=\"/usr/local/libmesos\" -DPICOJSON_USE_INT64 -DPKGDATADIR=\"/usr/local/share/mesos\" -DPKGLIBEXECDIR=\"/usr/local/libexec/mesos\" -DPKGMODULEDIR=\"\" -DSBINDIR=\"\" -DSOURCE_DIR=\"/mesos\" -DTESTLIBEXECDIR=\"\" -DUSE_CMAKE_BUILD_CONFIG -DUSE_STATIC_LIB -DVERSION=\"1.5.0\" -DZOOKEEPER_VERSION=\"3.4.8\" -D__STDC_FORMAT_MACROS -I/mesos/include -I/mesos/build/include -I/mesos/build/include/mesos -I/mesos/build/src -I/mesos/src -I/mesos/3rdparty/libprocess/src/../include -I/mesos/3rdparty/stout/include -isystem /usr/include/apr-1.0 -isystem /mesos/build/3rdparty/boost-1.53.0/src/boost-1.53.0 -isystem /mesos/build/3rdparty/elfio-3.2/src/elfio-3.2 -isystem /mesos/build/3rdparty/glog-0.3.3/src/glog-0.3.3-build/include -isystem /mesos/build/3rdparty/picojson-1.3.0/src/picojson-1.3.0 -isystem /mesos/build/3rdparty/protobuf-3.3.0/src/protobuf-3.3.0/src -isystem /usr/include/subversion-1 -isystem /mesos/build/3rdparty/http_parser-2.6.2/src/http_parser-2.6.2 -isystem /mesos/build/3rdparty/zookeeper-3.4.8/src/zookeeper-3.4.8/src/c/include -isystem /mesos/build/3rdparty/zookeeper-3.4.8/src/zookeeper-3.4.8/src/c/generated -isystem /mesos/build/3rdparty/nvml-352.79/src/nvml-352.79 -isystem /mesos/build/3rdparty/leveldb-1.19/src/leveldb-1.19/include -isystem /mesos/build/3rdparty/googletest-1.8.0/src/googletest-1.8.0/googlemock/include -isystem /mesos/build/3rdparty/googletest-1.8.0/src/googletest-1.8.0/googletest/include  -std=c++11 -Wformat-security -fstack-protector -fPIE   -o CMakeFiles/mesos-tests.dir/executor_http_api_tests.cpp.o -c /mesos/src/tests/executor_http_api_tests.cpp
[ 85%] Building CXX object src/tests/CMakeFiles/mesos-tests.dir/fault_tolerance_tests.cpp.o
cd /mesos/build/src/tests && /usr/bin/g++  -DBUILD_DIR=\"/mesos/build\" -DBUILD_FLAGS=\"\" -DBUILD_JAVA_JVM_LIBRARY=\"\" -DHAS_AUTHENTICATION=1 -DHAVE_LIBZ -DLIBDIR=\"/usr/local/libmesos\" -DPICOJSON_USE_INT64 -DPKGDATADIR=\"/usr/local/share/mesos\" -DPKGLIBEXECDIR=\"/usr/local/libexec/mesos\" -DPKGMODULEDIR=\"\" -DSBINDIR=\"\" -DSOURCE_DIR=\"/mesos\" -DTESTLIBEXECDIR=\"\" -DUSE_CMAKE_BUILD_CONFIG -DUSE_STATIC_LIB -DVERSION=\"1.5.0\" -DZOOKEEPER_VERSION=\"3.4.8\" -D__STDC_FORMAT_MACROS -I/mesos/include -I/mesos/build/include -I/mesos/build/include/mesos -I/mesos/build/src -I/mesos/src -I/mesos/3rdparty/libprocess/src/../include -I/mesos/3rdparty/stout/include -isystem /usr/include/apr-1.0 -isystem /mesos/build/3rdparty/boost-1.53.0/src/boost-1.53.0 -isystem /mesos/build/3rdparty/elfio-3.2/src/elfio-3.2 -isystem /mesos/build/3rdparty/glog-0.3.3/src/glog-0.3.3-build/include -isystem /mesos/build/3rdparty/picojson-1.3.0/src/picojson-1.3.0 -isystem /mesos/build/3rdparty/protobuf-3.3.0/src/protobuf-3.3.0/src -isystem /usr/include/subversion-1 -isystem /mesos/build/3rdparty/http_parser-2.6.2/src/http_parser-2.6.2 -isystem /mesos/build/3rdparty/zookeeper-3.4.8/src/zookeeper-3.4.8/src/c/include -isystem /mesos/build/3rdparty/zookeeper-3.4.8/src/zookeeper-3.4.8/src/c/generated -isystem /mesos/build/3rdparty/nvml-352.79/src/nvml-352.79 -isystem /mesos/build/3rdparty/leveldb-1.19/src/leveldb-1.19/include -isystem /mesos/build/3rdparty/googletest-1.8.0/src/googletest-1.8.0/googlemock/include -isystem /mesos/build/3rdparty/googletest-1.8.0/src/googletest-1.8.0/googletest/include  -std=c++11 -Wformat-security -fstack-protector -fPIE   -o CMakeFiles/mesos-tests.dir/fault_tolerance_tests.cpp.o -c /mesos/src/tests/fault_tolerance_tests.cpp
[ 85%] Building CXX object src/tests/CMakeFiles/mesos-tests.dir/fetcher_tests.cpp.o
cd /mesos/build/src/tests && /usr/bin/g++  -DBUILD_DIR=\"/mesos/build\" -DBUILD_FLAGS=\"\" -DBUILD_JAVA_JVM_LIBRARY=\"\" -DHAS_AUTHENTICATION=1 -DHAVE_LIBZ -DLIBDIR=\"/usr/local/libmesos\" -DPICOJSON_USE_INT64 -DPKGDATADIR=\"/usr/local/share/mesos\" -DPKGLIBEXECDIR=\"/usr/local/libexec/mesos\" -DPKGMODULEDIR=\"\" -DSBINDIR=\"\" -DSOURCE_DIR=\"/mesos\" -DTESTLIBEXECDIR=\"\" -DUSE_CMAKE_BUILD_CONFIG -DUSE_STATIC_LIB -DVERSION=\"1.5.0\" -DZOOKEEPER_VERSION=\"3.4.8\" -D__STDC_FORMAT_MACROS -I/mesos/include -I/mesos/build/include -I/mesos/build/include/mesos -I/mesos/build/src -I/mesos/src -I/mesos/3rdparty/libprocess/src/../include -I/mesos/3rdparty/stout/include -isystem /usr/include/apr-1.0 -isystem /mesos/build/3rdparty/boost-1.53.0/src/boost-1.53.0 -isystem /mesos/build/3rdparty/elfio-3.2/src/elfio-3.2 -isystem /mesos/build/3rdparty/glog-0.3.3/src/glog-0.3.3-build/include -isystem /mesos/build/3rdparty/picojson-1.3.0/src/picojson-1.3.0 -isystem /mesos/build/3rdparty/protobuf-3.3.0/src/protobuf-3.3.0/src -isystem /usr/include/subversion-1 -isystem /mesos/build/3rdparty/http_parser-2.6.2/src/http_parser-2.6.2 -isystem /mesos/build/3rdparty/zookeeper-3.4.8/src/zookeeper-3.4.8/src/c/include -isystem /mesos/build/3rdparty/zookeeper-3.4.8/src/zookeeper-3.4.8/src/c/generated -isystem /mesos/build/3rdparty/nvml-352.79/src/nvml-352.79 -isystem /mesos/build/3rdparty/leveldb-1.19/src/leveldb-1.19/include -isystem /mesos/build/3rdparty/googletest-1.8.0/src/googletest-1.8.0/googlemock/include -isystem /mesos/build/3rdparty/googletest-1.8.0/src/googletest-1.8.0/googletest/include  -std=c++11 -Wformat-security -fstack-protector -fPIE   -o CMakeFiles/mesos-tests.dir/fetcher_tests.cpp.o -c /mesos/src/tests/fetcher_tests.cpp
[ 85%] Building CXX object src/tests/CMakeFiles/mesos-tests.dir/files_tests.cpp.o
cd /mesos/build/src/tests && /usr/bin/g++  -DBUILD_DIR=\"/mesos/build\" -DBUILD_FLAGS=\"\" -DBUILD_JAVA_JVM_LIBRARY=\"\" -DHAS_AUTHENTICATION=1 -DHAVE_LIBZ -DLIBDIR=\"/usr/local/libmesos\" -DPICOJSON_USE_INT64 -DPKGDATADIR=\"/usr/local/share/mesos\" -DPKGLIBEXECDIR=\"/usr/local/libexec/mesos\" -DPKGMODULEDIR=\"\" -DSBINDIR=\"\" -DSOURCE_DIR=\"/mesos\" -DTESTLIBEXECDIR=\"\" -DUSE_CMAKE_BUILD_CONFIG -DUSE_STATIC_LIB -DVERSION=\"1.5.0\" -DZOOKEEPER_VERSION=\"3.4.8\" -D__STDC_FORMAT_MACROS -I/mesos/include -I/mesos/build/include -I/mesos/build/include/mesos -I/mesos/build/src -I/mesos/src -I/mesos/3rdparty/libprocess/src/../include -I/mesos/3rdparty/stout/include -isystem /usr/include/apr-1.0 -isystem /mesos/build/3rdparty/boost-1.53.0/src/boost-1.53.0 -isystem /mesos/build/3rdparty/elfio-3.2/src/elfio-3.2 -isystem /mesos/build/3rdparty/glog-0.3.3/src/glog-0.3.3-build/include -isystem /mesos/build/3rdparty/picojson-1.3.0/src/picojson-1.3.0 -isystem /mesos/build/3rdparty/protobuf-3.3.0/src/protobuf-3.3.0/src -isystem /usr/include/subversion-1 -isystem /mesos/build/3rdparty/http_parser-2.6.2/src/http_parser-2.6.2 -isystem /mesos/build/3rdparty/zookeeper-3.4.8/src/zookeeper-3.4.8/src/c/include -isystem /mesos/build/3rdparty/zookeeper-3.4.8/src/zookeeper-3.4.8/src/c/generated -isystem /mesos/build/3rdparty/nvml-352.79/src/nvml-352.79 -isystem /mesos/build/3rdparty/leveldb-1.19/src/leveldb-1.19/include -isystem /mesos/build/3rdparty/googletest-1.8.0/src/googletest-1.8.0/googlemock/include -isystem /mesos/build/3rdparty/googletest-1.8.0/src/googletest-1.8.0/googletest/include  -std=c++11 -Wformat-security -fstack-protector -fPIE   -o CMakeFiles/mesos-tests.dir/files_tests.cpp.o -c /mesos/src/tests/files_tests.cpp
[ 85%] Building CXX object src/tests/CMakeFiles/mesos-tests.dir/gc_tests.cpp.o
cd /mesos/build/src/tests && /usr/bin/g++  -DBUILD_DIR=\"/mesos/build\" -DBUILD_FLAGS=\"\" -DBUILD_JAVA_JVM_LIBRARY=\"\" -DHAS_AUTHENTICATION=1 -DHAVE_LIBZ -DLIBDIR=\"/usr/local/libmesos\" -DPICOJSON_USE_INT64 -DPKGDATADIR=\"/usr/local/share/mesos\" -DPKGLIBEXECDIR=\"/usr/local/libexec/mesos\" -DPKGMODULEDIR=\"\" -DSBINDIR=\"\" -DSOURCE_DIR=\"/mesos\" -DTESTLIBEXECDIR=\"\" -DUSE_CMAKE_BUILD_CONFIG -DUSE_STATIC_LIB -DVERSION=\"1.5.0\" -DZOOKEEPER_VERSION=\"3.4.8\" -D__STDC_FORMAT_MACROS -I/mesos/include -I/mesos/build/include -I/mesos/build/include/mesos -I/mesos/build/src -I/mesos/src -I/mesos/3rdparty/libprocess/src/../include -I/mesos/3rdparty/stout/include -isystem /usr/include/apr-1.0 -isystem /mesos/build/3rdparty/boost-1.53.0/src/boost-1.53.0 -isystem /mesos/build/3rdparty/elfio-3.2/src/elfio-3.2 -isystem /mesos/build/3rdparty/glog-0.3.3/src/glog-0.3.3-build/include -isystem /mesos/build/3rdparty/picojson-1.3.0/src/picojson-1.3.0 -isystem /mesos/build/3rdparty/protobuf-3.3.0/src/protobuf-3.3.0/src -isystem /usr/include/subversion-1 -isystem /mesos/build/3rdparty/http_parser-2.6.2/src/http_parser-2.6.2 -isystem /mesos/build/3rdparty/zookeeper-3.4.8/src/zookeeper-3.4.8/src/c/include -isystem /mesos/build/3rdparty/zookeeper-3.4.8/src/zookeeper-3.4.8/src/c/generated -isystem /mesos/build/3rdparty/nvml-352.79/src/nvml-352.79 -isystem /mesos/build/3rdparty/leveldb-1.19/src/leveldb-1.19/include -isystem /mesos/build/3rdparty/googletest-1.8.0/src/googletest-1.8.0/googlemock/include -isystem /mesos/build/3rdparty/googletest-1.8.0/src/googletest-1.8.0/googletest/include  -std=c++11 -Wformat-security -fstack-protector -fPIE   -o CMakeFiles/mesos-tests.dir/gc_tests.cpp.o -c /mesos/src/tests/gc_tests.cpp
[ 86%] Building CXX object src/tests/CMakeFiles/mesos-tests.dir/health_check_tests.cpp.o
cd /mesos/build/src/tests && /usr/bin/g++  -DBUILD_DIR=\"/mesos/build\" -DBUILD_FLAGS=\"\" -DBUILD_JAVA_JVM_LIBRARY=\"\" -DHAS_AUTHENTICATION=1 -DHAVE_LIBZ -DLIBDIR=\"/usr/local/libmesos\" -DPICOJSON_USE_INT64 -DPKGDATADIR=\"/usr/local/share/mesos\" -DPKGLIBEXECDIR=\"/usr/local/libexec/mesos\" -DPKGMODULEDIR=\"\" -DSBINDIR=\"\" -DSOURCE_DIR=\"/mesos\" -DTESTLIBEXECDIR=\"\" -DUSE_CMAKE_BUILD_CONFIG -DUSE_STATIC_LIB -DVERSION=\"1.5.0\" -DZOOKEEPER_VERSION=\"3.4.8\" -D__STDC_FORMAT_MACROS -I/mesos/include -I/mesos/build/include -I/mesos/build/include/mesos -I/mesos/build/src -I/mesos/src -I/mesos/3rdparty/libprocess/src/../include -I/mesos/3rdparty/stout/include -isystem /usr/include/apr-1.0 -isystem /mesos/build/3rdparty/boost-1.53.0/src/boost-1.53.0 -isystem /mesos/build/3rdparty/elfio-3.2/src/elfio-3.2 -isystem /mesos/build/3rdparty/glog-0.3.3/src/glog-0.3.3-build/include -isystem /mesos/build/3rdparty/picojson-1.3.0/src/picojson-1.3.0 -isystem /mesos/build/3rdparty/protobuf-3.3.0/src/protobuf-3.3.0/src -isystem /usr/include/subversion-1 -isystem /mesos/build/3rdparty/http_parser-2.6.2/src/http_parser-2.6.2 -isystem /mesos/build/3rdparty/zookeeper-3.4.8/src/zookeeper-3.4.8/src/c/include -isystem /mesos/build/3rdparty/zookeeper-3.4.8/src/zookeeper-3.4.8/src/c/generated -isystem /mesos/build/3rdparty/nvml-352.79/src/nvml-352.79 -isystem /mesos/build/3rdparty/leveldb-1.19/src/leveldb-1.19/include -isystem /mesos/build/3rdparty/googletest-1.8.0/src/googletest-1.8.0/googlemock/include -isystem /mesos/build/3rdparty/googletest-1.8.0/src/googletest-1.8.0/googletest/include  -std=c++11 -Wformat-security -fstack-protector -fPIE   -o CMakeFiles/mesos-tests.dir/health_check_tests.cpp.o -c /mesos/src/tests/health_check_tests.cpp
[ 86%] Building CXX object src/tests/CMakeFiles/mesos-tests.dir/hierarchical_allocator_tests.cpp.o
cd /mesos/build/src/tests && /usr/bin/g++  -DBUILD_DIR=\"/mesos/build\" -DBUILD_FLAGS=\"\" -DBUILD_JAVA_JVM_LIBRARY=\"\" -DHAS_AUTHENTICATION=1 -DHAVE_LIBZ -DLIBDIR=\"/usr/local/libmesos\" -DPICOJSON_USE_INT64 -DPKGDATADIR=\"/usr/local/share/mesos\" -DPKGLIBEXECDIR=\"/usr/local/libexec/mesos\" -DPKGMODULEDIR=\"\" -DSBINDIR=\"\" -DSOURCE_DIR=\"/mesos\" -DTESTLIBEXECDIR=\"\" -DUSE_CMAKE_BUILD_CONFIG -DUSE_STATIC_LIB -DVERSION=\"1.5.0\" -DZOOKEEPER_VERSION=\"3.4.8\" -D__STDC_FORMAT_MACROS -I/mesos/include -I/mesos/build/include -I/mesos/build/include/mesos -I/mesos/build/src -I/mesos/src -I/mesos/3rdparty/libprocess/src/../include -I/mesos/3rdparty/stout/include -isystem /usr/include/apr-1.0 -isystem /mesos/build/3rdparty/boost-1.53.0/src/boost-1.53.0 -isystem /mesos/build/3rdparty/elfio-3.2/src/elfio-3.2 -isystem /mesos/build/3rdparty/glog-0.3.3/src/glog-0.3.3-build/include -isystem /mesos/build/3rdparty/picojson-1.3.0/src/picojson-1.3.0 -isystem /mesos/build/3rdparty/protobuf-3.3.0/src/protobuf-3.3.0/src -isystem /usr/include/subversion-1 -isystem /mesos/build/3rdparty/http_parser-2.6.2/src/http_parser-2.6.2 -isystem /mesos/build/3rdparty/zookeeper-3.4.8/src/zookeeper-3.4.8/src/c/include -isystem /mesos/build/3rdparty/zookeeper-3.4.8/src/zookeeper-3.4.8/src/c/generated -isystem /mesos/build/3rdparty/nvml-352.79/src/nvml-352.79 -isystem /mesos/build/3rdparty/leveldb-1.19/src/leveldb-1.19/include -isystem /mesos/build/3rdparty/googletest-1.8.0/src/googletest-1.8.0/googlemock/include -isystem /mesos/build/3rdparty/googletest-1.8.0/src/googletest-1.8.0/googletest/include  -std=c++11 -Wformat-security -fstack-protector -fPIE   -o CMakeFiles/mesos-tests.dir/hierarchical_allocator_tests.cpp.o -c /mesos/src/tests/hierarchical_allocator_tests.cpp
[ 86%] Building CXX object src/tests/CMakeFiles/mesos-tests.dir/hook_tests.cpp.o
cd /mesos/build/src/tests && /usr/bin/g++  -DBUILD_DIR=\"/mesos/build\" -DBUILD_FLAGS=\"\" -DBUILD_JAVA_JVM_LIBRARY=\"\" -DHAS_AUTHENTICATION=1 -DHAVE_LIBZ -DLIBDIR=\"/usr/local/libmesos\" -DPICOJSON_USE_INT64 -DPKGDATADIR=\"/usr/local/share/mesos\" -DPKGLIBEXECDIR=\"/usr/local/libexec/mesos\" -DPKGMODULEDIR=\"\" -DSBINDIR=\"\" -DSOURCE_DIR=\"/mesos\" -DTESTLIBEXECDIR=\"\" -DUSE_CMAKE_BUILD_CONFIG -DUSE_STATIC_LIB -DVERSION=\"1.5.0\" -DZOOKEEPER_VERSION=\"3.4.8\" -D__STDC_FORMAT_MACROS -I/mesos/include -I/mesos/build/include -I/mesos/build/include/mesos -I/mesos/build/src -I/mesos/src -I/mesos/3rdparty/libprocess/src/../include -I/mesos/3rdparty/stout/include -isystem /usr/include/apr-1.0 -isystem /mesos/build/3rdparty/boost-1.53.0/src/boost-1.53.0 -isystem /mesos/build/3rdparty/elfio-3.2/src/elfio-3.2 -isystem /mesos/build/3rdparty/glog-0.3.3/src/glog-0.3.3-build/include -isystem /mesos/build/3rdparty/picojson-1.3.0/src/picojson-1.3.0 -isystem /mesos/build/3rdparty/protobuf-3.3.0/src/protobuf-3.3.0/src -isystem /usr/include/subversion-1 -isystem /mesos/build/3rdparty/http_parser-2.6.2/src/http_parser-2.6.2 -isystem /mesos/build/3rdparty/zookeeper-3.4.8/src/zookeeper-3.4.8/src/c/include -isystem /mesos/build/3rdparty/zookeeper-3.4.8/src/zookeeper-3.4.8/src/c/generated -isystem /mesos/build/3rdparty/nvml-352.79/src/nvml-352.79 -isystem /mesos/build/3rdparty/leveldb-1.19/src/leveldb-1.19/include -isystem /mesos/build/3rdparty/googletest-1.8.0/src/googletest-1.8.0/googlemock/include -isystem /mesos/build/3rdparty/googletest-1.8.0/src/googletest-1.8.0/googletest/include  -std=c++11 -Wformat-security -fstack-protector -fPIE   -o CMakeFiles/mesos-tests.dir/hook_tests.cpp.o -c /mesos/src/tests/hook_tests.cpp
[ 86%] Building CXX object src/tests/CMakeFiles/mesos-tests.dir/http_authentication_tests.cpp.o
cd /mesos/build/src/tests && /usr/bin/g++  -DBUILD_DIR=\"/mesos/build\" -DBUILD_FLAGS=\"\" -DBUILD_JAVA_JVM_LIBRARY=\"\" -DHAS_AUTHENTICATION=1 -DHAVE_LIBZ -DLIBDIR=\"/usr/local/libmesos\" -DPICOJSON_USE_INT64 -DPKGDATADIR=\"/usr/local/share/mesos\" -DPKGLIBEXECDIR=\"/usr/local/libexec/mesos\" -DPKGMODULEDIR=\"\" -DSBINDIR=\"\" -DSOURCE_DIR=\"/mesos\" -DTESTLIBEXECDIR=\"\" -DUSE_CMAKE_BUILD_CONFIG -DUSE_STATIC_LIB -DVERSION=\"1.5.0\" -DZOOKEEPER_VERSION=\"3.4.8\" -D__STDC_FORMAT_MACROS -I/mesos/include -I/mesos/build/include -I/mesos/build/include/mesos -I/mesos/build/src -I/mesos/src -I/mesos/3rdparty/libprocess/src/../include -I/mesos/3rdparty/stout/include -isystem /usr/include/apr-1.0 -isystem /mesos/build/3rdparty/boost-1.53.0/src/boost-1.53.0 -isystem /mesos/build/3rdparty/elfio-3.2/src/elfio-3.2 -isystem /mesos/build/3rdparty/glog-0.3.3/src/glog-0.3.3-build/include -isystem /mesos/build/3rdparty/picojson-1.3.0/src/picojson-1.3.0 -isystem /mesos/build/3rdparty/protobuf-3.3.0/src/protobuf-3.3.0/src -isystem /usr/include/subversion-1 -isystem /mesos/build/3rdparty/http_parser-2.6.2/src/http_parser-2.6.2 -isystem /mesos/build/3rdparty/zookeeper-3.4.8/src/zookeeper-3.4.8/src/c/include -isystem /mesos/build/3rdparty/zookeeper-3.4.8/src/zookeeper-3.4.8/src/c/generated -isystem /mesos/build/3rdparty/nvml-352.79/src/nvml-352.79 -isystem /mesos/build/3rdparty/leveldb-1.19/src/leveldb-1.19/include -isystem /mesos/build/3rdparty/googletest-1.8.0/src/googletest-1.8.0/googlemock/include -isystem /mesos/build/3rdparty/googletest-1.8.0/src/googletest-1.8.0/googletest/include  -std=c++11 -Wformat-security -fstack-protector -fPIE   -o CMakeFiles/mesos-tests.dir/http_authentication_tests.cpp.o -c /mesos/src/tests/http_authentication_tests.cpp
[ 86%] Building CXX object src/tests/CMakeFiles/mesos-tests.dir/http_fault_tolerance_tests.cpp.o
cd /mesos/build/src/tests && /usr/bin/g++  -DBUILD_DIR=\"/mesos/build\" -DBUILD_FLAGS=\"\" -DBUILD_JAVA_JVM_LIBRARY=\"\" -DHAS_AUTHENTICATION=1 -DHAVE_LIBZ -DLIBDIR=\"/usr/local/libmesos\" -DPICOJSON_USE_INT64 -DPKGDATADIR=\"/usr/local/share/mesos\" -DPKGLIBEXECDIR=\"/usr/local/libexec/mesos\" -DPKGMODULEDIR=\"\" -DSBINDIR=\"\" -DSOURCE_DIR=\"/mesos\" -DTESTLIBEXECDIR=\"\" -DUSE_CMAKE_BUILD_CONFIG -DUSE_STATIC_LIB -DVERSION=\"1.5.0\" -DZOOKEEPER_VERSION=\"3.4.8\" -D__STDC_FORMAT_MACROS -I/mesos/include -I/mesos/build/include -I/mesos/build/include/mesos -I/mesos/build/src -I/mesos/src -I/mesos/3rdparty/libprocess/src/../include -I/mesos/3rdparty/stout/include -isystem /usr/include/apr-1.0 -isystem /mesos/build/3rdparty/boost-1.53.0/src/boost-1.53.0 -isystem /mesos/build/3rdparty/elfio-3.2/src/elfio-3.2 -isystem /mesos/build/3rdparty/glog-0.3.3/src/glog-0.3.3-build/include -isystem /mesos/build/3rdparty/picojson-1.3.0/src/picojson-1.3.0 -isystem /mesos/build/3rdparty/protobuf-3.3.0/src/protobuf-3.3.0/src -isystem /usr/include/subversion-1 -isystem /mesos/build/3rdparty/http_parser-2.6.2/src/http_parser-2.6.2 -isystem /mesos/build/3rdparty/zookeeper-3.4.8/src/zookeeper-3.4.8/src/c/include -isystem /mesos/build/3rdparty/zookeeper-3.4.8/src/zookeeper-3.4.8/src/c/generated -isystem /mesos/build/3rdparty/nvml-352.79/src/nvml-352.79 -isystem /mesos/build/3rdparty/leveldb-1.19/src/leveldb-1.19/include -isystem /mesos/build/3rdparty/googletest-1.8.0/src/googletest-1.8.0/googlemock/include -isystem /mesos/build/3rdparty/googletest-1.8.0/src/googletest-1.8.0/googletest/include  -std=c++11 -Wformat-security -fstack-protector -fPIE   -o CMakeFiles/mesos-tests.dir/http_fault_tolerance_tests.cpp.o -c /mesos/src/tests/http_fault_tolerance_tests.cpp
[ 86%] Building CXX object src/tests/CMakeFiles/mesos-tests.dir/master_maintenance_tests.cpp.o
cd /mesos/build/src/tests && /usr/bin/g++  -DBUILD_DIR=\"/mesos/build\" -DBUILD_FLAGS=\"\" -DBUILD_JAVA_JVM_LIBRARY=\"\" -DHAS_AUTHENTICATION=1 -DHAVE_LIBZ -DLIBDIR=\"/usr/local/libmesos\" -DPICOJSON_USE_INT64 -DPKGDATADIR=\"/usr/local/share/mesos\" -DPKGLIBEXECDIR=\"/usr/local/libexec/mesos\" -DPKGMODULEDIR=\"\" -DSBINDIR=\"\" -DSOURCE_DIR=\"/mesos\" -DTESTLIBEXECDIR=\"\" -DUSE_CMAKE_BUILD_CONFIG -DUSE_STATIC_LIB -DVERSION=\"1.5.0\" -DZOOKEEPER_VERSION=\"3.4.8\" -D__STDC_FORMAT_MACROS -I/mesos/include -I/mesos/build/include -I/mesos/build/include/mesos -I/mesos/build/src -I/mesos/src -I/mesos/3rdparty/libprocess/src/../include -I/mesos/3rdparty/stout/include -isystem /usr/include/apr-1.0 -isystem /mesos/build/3rdparty/boost-1.53.0/src/boost-1.53.0 -isystem /mesos/build/3rdparty/elfio-3.2/src/elfio-3.2 -isystem /mesos/build/3rdparty/glog-0.3.3/src/glog-0.3.3-build/include -isystem /mesos/build/3rdparty/picojson-1.3.0/src/picojson-1.3.0 -isystem /mesos/build/3rdparty/protobuf-3.3.0/src/protobuf-3.3.0/src -isystem /usr/include/subversion-1 -isystem /mesos/build/3rdparty/http_parser-2.6.2/src/http_parser-2.6.2 -isystem /mesos/build/3rdparty/zookeeper-3.4.8/src/zookeeper-3.4.8/src/c/include -isystem /mesos/build/3rdparty/zookeeper-3.4.8/src/zookeeper-3.4.8/src/c/generated -isystem /mesos/build/3rdparty/nvml-352.79/src/nvml-352.79 -isystem /mesos/build/3rdparty/leveldb-1.19/src/leveldb-1.19/include -isystem /mesos/build/3rdparty/googletest-1.8.0/src/googletest-1.8.0/googlemock/include -isystem /mesos/build/3rdparty/googletest-1.8.0/src/googletest-1.8.0/googletest/include  -std=c++11 -Wformat-security -fstack-protector -fPIE   -o CMakeFiles/mesos-tests.dir/master_maintenance_tests.cpp.o -c /mesos/src/tests/master_maintenance_tests.cpp
[ 86%] Building CXX object src/tests/CMakeFiles/mesos-tests.dir/master_slave_reconciliation_tests.cpp.o
cd /mesos/build/src/tests && /usr/bin/g++  -DBUILD_DIR=\"/mesos/build\" -DBUILD_FLAGS=\"\" -DBUILD_JAVA_JVM_LIBRARY=\"\" -DHAS_AUTHENTICATION=1 -DHAVE_LIBZ -DLIBDIR=\"/usr/local/libmesos\" -DPICOJSON_USE_INT64 -DPKGDATADIR=\"/usr/local/share/mesos\" -DPKGLIBEXECDIR=\"/usr/local/libexec/mesos\" -DPKGMODULEDIR=\"\" -DSBINDIR=\"\" -DSOURCE_DIR=\"/mesos\" -DTESTLIBEXECDIR=\"\" -DUSE_CMAKE_BUILD_CONFIG -DUSE_STATIC_LIB -DVERSION=\"1.5.0\" -DZOOKEEPER_VERSION=\"3.4.8\" -D__STDC_FORMAT_MACROS -I/mesos/include -I/mesos/build/include -I/mesos/build/include/mesos -I/mesos/build/src -I/mesos/src -I/mesos/3rdparty/libprocess/src/../include -I/mesos/3rdparty/stout/include -isystem /usr/include/apr-1.0 -isystem /mesos/build/3rdparty/boost-1.53.0/src/boost-1.53.0 -isystem /mesos/build/3rdparty/elfio-3.2/src/elfio-3.2 -isystem /mesos/build/3rdparty/glog-0.3.3/src/glog-0.3.3-build/include -isystem /mesos/build/3rdparty/picojson-1.3.0/src/picojson-1.3.0 -isystem /mesos/build/3rdparty/protobuf-3.3.0/src/protobuf-3.3.0/src -isystem /usr/include/subversion-1 -isystem /mesos/build/3rdparty/http_parser-2.6.2/src/http_parser-2.6.2 -isystem /mesos/build/3rdparty/zookeeper-3.4.8/src/zookeeper-3.4.8/src/c/include -isystem /mesos/build/3rdparty/zookeeper-3.4.8/src/zookeeper-3.4.8/src/c/generated -isystem /mesos/build/3rdparty/nvml-352.79/src/nvml-352.79 -isystem /mesos/build/3rdparty/leveldb-1.19/src/leveldb-1.19/include -isystem /mesos/build/3rdparty/googletest-1.8.0/src/googletest-1.8.0/googlemock/include -isystem /mesos/build/3rdparty/googletest-1.8.0/src/googletest-1.8.0/googletest/include  -std=c++11 -Wformat-security -fstack-protector -fPIE   -o CMakeFiles/mesos-tests.dir/master_slave_reconciliation_tests.cpp.o -c /mesos/src/tests/master_slave_reconciliation_tests.cpp
[ 87%] Building CXX object src/tests/CMakeFiles/mesos-tests.dir/partition_tests.cpp.o
cd /mesos/build/src/tests && /usr/bin/g++  -DBUILD_DIR=\"/mesos/build\" -DBUILD_FLAGS=\"\" -DBUILD_JAVA_JVM_LIBRARY=\"\" -DHAS_AUTHENTICATION=1 -DHAVE_LIBZ -DLIBDIR=\"/usr/local/libmesos\" -DPICOJSON_USE_INT64 -DPKGDATADIR=\"/usr/local/share/mesos\" -DPKGLIBEXECDIR=\"/usr/local/libexec/mesos\" -DPKGMODULEDIR=\"\" -DSBINDIR=\"\" -DSOURCE_DIR=\"/mesos\" -DTESTLIBEXECDIR=\"\" -DUSE_CMAKE_BUILD_CONFIG -DUSE_STATIC_LIB -DVERSION=\"1.5.0\" -DZOOKEEPER_VERSION=\"3.4.8\" -D__STDC_FORMAT_MACROS -I/mesos/include -I/mesos/build/include -I/mesos/build/include/mesos -I/mesos/build/src -I/mesos/src -I/mesos/3rdparty/libprocess/src/../include -I/mesos/3rdparty/stout/include -isystem /usr/include/apr-1.0 -isystem /mesos/build/3rdparty/boost-1.53.0/src/boost-1.53.0 -isystem /mesos/build/3rdparty/elfio-3.2/src/elfio-3.2 -isystem /mesos/build/3rdparty/glog-0.3.3/src/glog-0.3.3-build/include -isystem /mesos/build/3rdparty/picojson-1.3.0/src/picojson-1.3.0 -isystem /mesos/build/3rdparty/protobuf-3.3.0/src/protobuf-3.3.0/src -isystem /usr/include/subversion-1 -isystem /mesos/build/3rdparty/http_parser-2.6.2/src/http_parser-2.6.2 -isystem /mesos/build/3rdparty/zookeeper-3.4.8/src/zookeeper-3.4.8/src/c/include -isystem /mesos/build/3rdparty/zookeeper-3.4.8/src/zookeeper-3.4.8/src/c/generated -isystem /mesos/build/3rdparty/nvml-352.79/src/nvml-352.79 -isystem /mesos/build/3rdparty/leveldb-1.19/src/leveldb-1.19/include -isystem /mesos/build/3rdparty/googletest-1.8.0/src/googletest-1.8.0/googlemock/include -isystem /mesos/build/3rdparty/googletest-1.8.0/src/googletest-1.8.0/googletest/include  -std=c++11 -Wformat-security -fstack-protector -fPIE   -o CMakeFiles/mesos-tests.dir/partition_tests.cpp.o -c /mesos/src/tests/partition_tests.cpp
[ 87%] Building CXX object src/tests/CMakeFiles/mesos-tests.dir/paths_tests.cpp.o
cd /mesos/build/src/tests && /usr/bin/g++  -DBUILD_DIR=\"/mesos/build\" -DBUILD_FLAGS=\"\" -DBUILD_JAVA_JVM_LIBRARY=\"\" -DHAS_AUTHENTICATION=1 -DHAVE_LIBZ -DLIBDIR=\"/usr/local/libmesos\" -DPICOJSON_USE_INT64 -DPKGDATADIR=\"/usr/local/share/mesos\" -DPKGLIBEXECDIR=\"/usr/local/libexec/mesos\" -DPKGMODULEDIR=\"\" -DSBINDIR=\"\" -DSOURCE_DIR=\"/mesos\" -DTESTLIBEXECDIR=\"\" -DUSE_CMAKE_BUILD_CONFIG -DUSE_STATIC_LIB -DVERSION=\"1.5.0\" -DZOOKEEPER_VERSION=\"3.4.8\" -D__STDC_FORMAT_MACROS -I/mesos/include -I/mesos/build/include -I/mesos/build/include/mesos -I/mesos/build/src -I/mesos/src -I/mesos/3rdparty/libprocess/src/../include -I/mesos/3rdparty/stout/include -isystem /usr/include/apr-1.0 -isystem /mesos/build/3rdparty/boost-1.53.0/src/boost-1.53.0 -isystem /mesos/build/3rdparty/elfio-3.2/src/elfio-3.2 -isystem /mesos/build/3rdparty/glog-0.3.3/src/glog-0.3.3-build/include -isystem /mesos/build/3rdparty/picojson-1.3.0/src/picojson-1.3.0 -isystem /mesos/build/3rdparty/protobuf-3.3.0/src/protobuf-3.3.0/src -isystem /usr/include/subversion-1 -isystem /mesos/build/3rdparty/http_parser-2.6.2/src/http_parser-2.6.2 -isystem /mesos/build/3rdparty/zookeeper-3.4.8/src/zookeeper-3.4.8/src/c/include -isystem /mesos/build/3rdparty/zookeeper-3.4.8/src/zookeeper-3.4.8/src/c/generated -isystem /mesos/build/3rdparty/nvml-352.79/src/nvml-352.79 -isystem /mesos/build/3rdparty/leveldb-1.19/src/leveldb-1.19/include -isystem /mesos/build/3rdparty/googletest-1.8.0/src/googletest-1.8.0/googlemock/include -isystem /mesos/build/3rdparty/googletest-1.8.0/src/googletest-1.8.0/googletest/include  -std=c++11 -Wformat-security -fstack-protector -fPIE   -o CMakeFiles/mesos-tests.dir/paths_tests.cpp.o -c /mesos/src/tests/paths_tests.cpp
[ 87%] Building CXX object src/tests/CMakeFiles/mesos-tests.dir/protobuf_io_tests.cpp.o
cd /mesos/build/src/tests && /usr/bin/g++  -DBUILD_DIR=\"/mesos/build\" -DBUILD_FLAGS=\"\" -DBUILD_JAVA_JVM_LIBRARY=\"\" -DHAS_AUTHENTICATION=1 -DHAVE_LIBZ -DLIBDIR=\"/usr/local/libmesos\" -DPICOJSON_USE_INT64 -DPKGDATADIR=\"/usr/local/share/mesos\" -DPKGLIBEXECDIR=\"/usr/local/libexec/mesos\" -DPKGMODULEDIR=\"\" -DSBINDIR=\"\" -DSOURCE_DIR=\"/mesos\" -DTESTLIBEXECDIR=\"\" -DUSE_CMAKE_BUILD_CONFIG -DUSE_STATIC_LIB -DVERSION=\"1.5.0\" -DZOOKEEPER_VERSION=\"3.4.8\" -D__STDC_FORMAT_MACROS -I/mesos/include -I/mesos/build/include -I/mesos/build/include/mesos -I/mesos/build/src -I/mesos/src -I/mesos/3rdparty/libprocess/src/../include -I/mesos/3rdparty/stout/include -isystem /usr/include/apr-1.0 -isystem /mesos/build/3rdparty/boost-1.53.0/src/boost-1.53.0 -isystem /mesos/build/3rdparty/elfio-3.2/src/elfio-3.2 -isystem /mesos/build/3rdparty/glog-0.3.3/src/glog-0.3.3-build/include -isystem /mesos/build/3rdparty/picojson-1.3.0/src/picojson-1.3.0 -isystem /mesos/build/3rdparty/protobuf-3.3.0/src/protobuf-3.3.0/src -isystem /usr/include/subversion-1 -isystem /mesos/build/3rdparty/http_parser-2.6.2/src/http_parser-2.6.2 -isystem /mesos/build/3rdparty/zookeeper-3.4.8/src/zookeeper-3.4.8/src/c/include -isystem /mesos/build/3rdparty/zookeeper-3.4.8/src/zookeeper-3.4.8/src/c/generated -isystem /mesos/build/3rdparty/nvml-352.79/src/nvml-352.79 -isystem /mesos/build/3rdparty/leveldb-1.19/src/leveldb-1.19/include -isystem /mesos/build/3rdparty/googletest-1.8.0/src/googletest-1.8.0/googlemock/include -isystem /mesos/build/3rdparty/googletest-1.8.0/src/googletest-1.8.0/googletest/include  -std=c++11 -Wformat-security -fstack-protector -fPIE   -o CMakeFiles/mesos-tests.dir/protobuf_io_tests.cpp.o -c /mesos/src/tests/protobuf_io_tests.cpp
[ 87%] Building CXX object src/tests/CMakeFiles/mesos-tests.dir/rate_limiting_tests.cpp.o
cd /mesos/build/src/tests && /usr/bin/g++  -DBUILD_DIR=\"/mesos/build\" -DBUILD_FLAGS=\"\" -DBUILD_JAVA_JVM_LIBRARY=\"\" -DHAS_AUTHENTICATION=1 -DHAVE_LIBZ -DLIBDIR=\"/usr/local/libmesos\" -DPICOJSON_USE_INT64 -DPKGDATADIR=\"/usr/local/share/mesos\" -DPKGLIBEXECDIR=\"/usr/local/libexec/mesos\" -DPKGMODULEDIR=\"\" -DSBINDIR=\"\" -DSOURCE_DIR=\"/mesos\" -DTESTLIBEXECDIR=\"\" -DUSE_CMAKE_BUILD_CONFIG -DUSE_STATIC_LIB -DVERSION=\"1.5.0\" -DZOOKEEPER_VERSION=\"3.4.8\" -D__STDC_FORMAT_MACROS -I/mesos/include -I/mesos/build/include -I/mesos/build/include/mesos -I/mesos/build/src -I/mesos/src -I/mesos/3rdparty/libprocess/src/../include -I/mesos/3rdparty/stout/include -isystem /usr/include/apr-1.0 -isystem /mesos/build/3rdparty/boost-1.53.0/src/boost-1.53.0 -isystem /mesos/build/3rdparty/elfio-3.2/src/elfio-3.2 -isystem /mesos/build/3rdparty/glog-0.3.3/src/glog-0.3.3-build/include -isystem /mesos/build/3rdparty/picojson-1.3.0/src/picojson-1.3.0 -isystem /mesos/build/3rdparty/protobuf-3.3.0/src/protobuf-3.3.0/src -isystem /usr/include/subversion-1 -isystem /mesos/build/3rdparty/http_parser-2.6.2/src/http_parser-2.6.2 -isystem /mesos/build/3rdparty/zookeeper-3.4.8/src/zookeeper-3.4.8/src/c/include -isystem /mesos/build/3rdparty/zookeeper-3.4.8/src/zookeeper-3.4.8/src/c/generated -isystem /mesos/build/3rdparty/nvml-352.79/src/nvml-352.79 -isystem /mesos/build/3rdparty/leveldb-1.19/src/leveldb-1.19/include -isystem /mesos/build/3rdparty/googletest-1.8.0/src/googletest-1.8.0/googlemock/include -isystem /mesos/build/3rdparty/googletest-1.8.0/src/googletest-1.8.0/googletest/include  -std=c++11 -Wformat-security -fstack-protector -fPIE   -o CMakeFiles/mesos-tests.dir/rate_limiting_tests.cpp.o -c /mesos/src/tests/rate_limiting_tests.cpp
[ 87%] Building CXX object src/tests/CMakeFiles/mesos-tests.dir/resource_offers_tests.cpp.o
cd /mesos/build/src/tests && /usr/bin/g++  -DBUILD_DIR=\"/mesos/build\" -DBUILD_FLAGS=\"\" -DBUILD_JAVA_JVM_LIBRARY=\"\" -DHAS_AUTHENTICATION=1 -DHAVE_LIBZ -DLIBDIR=\"/usr/local/libmesos\" -DPICOJSON_USE_INT64 -DPKGDATADIR=\"/usr/local/share/mesos\" -DPKGLIBEXECDIR=\"/usr/local/libexec/mesos\" -DPKGMODULEDIR=\"\" -DSBINDIR=\"\" -DSOURCE_DIR=\"/mesos\" -DTESTLIBEXECDIR=\"\" -DUSE_CMAKE_BUILD_CONFIG -DUSE_STATIC_LIB -DVERSION=\"1.5.0\" -DZOOKEEPER_VERSION=\"3.4.8\" -D__STDC_FORMAT_MACROS -I/mesos/include -I/mesos/build/include -I/mesos/build/include/mesos -I/mesos/build/src -I/mesos/src -I/mesos/3rdparty/libprocess/src/../include -I/mesos/3rdparty/stout/include -isystem /usr/include/apr-1.0 -isystem /mesos/build/3rdparty/boost-1.53.0/src/boost-1.53.0 -isystem /mesos/build/3rdparty/elfio-3.2/src/elfio-3.2 -isystem /mesos/build/3rdparty/glog-0.3.3/src/glog-0.3.3-build/include -isystem /mesos/build/3rdparty/picojson-1.3.0/src/picojson-1.3.0 -isystem /mesos/build/3rdparty/protobuf-3.3.0/src/protobuf-3.3.0/src -isystem /usr/include/subversion-1 -isystem /mesos/build/3rdparty/http_parser-2.6.2/src/http_parser-2.6.2 -isystem /mesos/build/3rdparty/zookeeper-3.4.8/src/zookeeper-3.4.8/src/c/include -isystem /mesos/build/3rdparty/zookeeper-3.4.8/src/zookeeper-3.4.8/src/c/generated -isystem /mesos/build/3rdparty/nvml-352.79/src/nvml-352.79 -isystem /mesos/build/3rdparty/leveldb-1.19/src/leveldb-1.19/include -isystem /mesos/build/3rdparty/googletest-1.8.0/src/googletest-1.8.0/googlemock/include -isystem /mesos/build/3rdparty/googletest-1.8.0/src/googletest-1.8.0/googletest/include  -std=c++11 -Wformat-security -fstack-protector -fPIE   -o CMakeFiles/mesos-tests.dir/resource_offers_tests.cpp.o -c /mesos/src/tests/resource_offers_tests.cpp
[ 87%] Building CXX object src/tests/CMakeFiles/mesos-tests.dir/resource_provider_manager_tests.cpp.o
cd /mesos/build/src/tests && /usr/bin/g++  -DBUILD_DIR=\"/mesos/build\" -DBUILD_FLAGS=\"\" -DBUILD_JAVA_JVM_LIBRARY=\"\" -DHAS_AUTHENTICATION=1 -DHAVE_LIBZ -DLIBDIR=\"/usr/local/libmesos\" -DPICOJSON_USE_INT64 -DPKGDATADIR=\"/usr/local/share/mesos\" -DPKGLIBEXECDIR=\"/usr/local/libexec/mesos\" -DPKGMODULEDIR=\"\" -DSBINDIR=\"\" -DSOURCE_DIR=\"/mesos\" -DTESTLIBEXECDIR=\"\" -DUSE_CMAKE_BUILD_CONFIG -DUSE_STATIC_LIB -DVERSION=\"1.5.0\" -DZOOKEEPER_VERSION=\"3.4.8\" -D__STDC_FORMAT_MACROS -I/mesos/include -I/mesos/build/include -I/mesos/build/include/mesos -I/mesos/build/src -I/mesos/src -I/mesos/3rdparty/libprocess/src/../include -I/mesos/3rdparty/stout/include -isystem /usr/include/apr-1.0 -isystem /mesos/build/3rdparty/boost-1.53.0/src/boost-1.53.0 -isystem /mesos/build/3rdparty/elfio-3.2/src/elfio-3.2 -isystem /mesos/build/3rdparty/glog-0.3.3/src/glog-0.3.3-build/include -isystem /mesos/build/3rdparty/picojson-1.3.0/src/picojson-1.3.0 -isystem /mesos/build/3rdparty/protobuf-3.3.0/src/protobuf-3.3.0/src -isystem /usr/include/subversion-1 -isystem /mesos/build/3rdparty/http_parser-2.6.2/src/http_parser-2.6.2 -isystem /mesos/build/3rdparty/zookeeper-3.4.8/src/zookeeper-3.4.8/src/c/include -isystem /mesos/build/3rdparty/zookeeper-3.4.8/src/zookeeper-3.4.8/src/c/generated -isystem /mesos/build/3rdparty/nvml-352.79/src/nvml-352.79 -isystem /mesos/build/3rdparty/leveldb-1.19/src/leveldb-1.19/include -isystem /mesos/build/3rdparty/googletest-1.8.0/src/googletest-1.8.0/googlemock/include -isystem /mesos/build/3rdparty/googletest-1.8.0/src/googletest-1.8.0/googletest/include  -std=c++11 -Wformat-security -fstack-protector -fPIE   -o CMakeFiles/mesos-tests.dir/resource_provider_manager_tests.cpp.o -c /mesos/src/tests/resource_provider_manager_tests.cpp
[ 87%] Building CXX object src/tests/CMakeFiles/mesos-tests.dir/resource_provider_validation_tests.cpp.o
cd /mesos/build/src/tests && /usr/bin/g++  -DBUILD_DIR=\"/mesos/build\" -DBUILD_FLAGS=\"\" -DBUILD_JAVA_JVM_LIBRARY=\"\" -DHAS_AUTHENTICATION=1 -DHAVE_LIBZ -DLIBDIR=\"/usr/local/libmesos\" -DPICOJSON_USE_INT64 -DPKGDATADIR=\"/usr/local/share/mesos\" -DPKGLIBEXECDIR=\"/usr/local/libexec/mesos\" -DPKGMODULEDIR=\"\" -DSBINDIR=\"\" -DSOURCE_DIR=\"/mesos\" -DTESTLIBEXECDIR=\"\" -DUSE_CMAKE_BUILD_CONFIG -DUSE_STATIC_LIB -DVERSION=\"1.5.0\" -DZOOKEEPER_VERSION=\"3.4.8\" -D__STDC_FORMAT_MACROS -I/mesos/include -I/mesos/build/include -I/mesos/build/include/mesos -I/mesos/build/src -I/mesos/src -I/mesos/3rdparty/libprocess/src/../include -I/mesos/3rdparty/stout/include -isystem /usr/include/apr-1.0 -isystem /mesos/build/3rdparty/boost-1.53.0/src/boost-1.53.0 -isystem /mesos/build/3rdparty/elfio-3.2/src/elfio-3.2 -isystem /mesos/build/3rdparty/glog-0.3.3/src/glog-0.3.3-build/include -isystem /mesos/build/3rdparty/picojson-1.3.0/src/picojson-1.3.0 -isystem /mesos/build/3rdparty/protobuf-3.3.0/src/protobuf-3.3.0/src -isystem /usr/include/subversion-1 -isystem /mesos/build/3rdparty/http_parser-2.6.2/src/http_parser-2.6.2 -isystem /mesos/build/3rdparty/zookeeper-3.4.8/src/zookeeper-3.4.8/src/c/include -isystem /mesos/build/3rdparty/zookeeper-3.4.8/src/zookeeper-3.4.8/src/c/generated -isystem /mesos/build/3rdparty/nvml-352.79/src/nvml-352.79 -isystem /mesos/build/3rdparty/leveldb-1.19/src/leveldb-1.19/include -isystem /mesos/build/3rdparty/googletest-1.8.0/src/googletest-1.8.0/googlemock/include -isystem /mesos/build/3rdparty/googletest-1.8.0/src/googletest-1.8.0/googletest/include  -std=c++11 -Wformat-security -fstack-protector -fPIE   -o CMakeFiles/mesos-tests.dir/resource_provider_validation_tests.cpp.o -c /mesos/src/tests/resource_provider_validation_tests.cpp
[ 88%] Building CXX object src/tests/CMakeFiles/mesos-tests.dir/resources_tests.cpp.o
cd /mesos/build/src/tests && /usr/bin/g++  -DBUILD_DIR=\"/mesos/build\" -DBUILD_FLAGS=\"\" -DBUILD_JAVA_JVM_LIBRARY=\"\" -DHAS_AUTHENTICATION=1 -DHAVE_LIBZ -DLIBDIR=\"/usr/local/libmesos\" -DPICOJSON_USE_INT64 -DPKGDATADIR=\"/usr/local/share/mesos\" -DPKGLIBEXECDIR=\"/usr/local/libexec/mesos\" -DPKGMODULEDIR=\"\" -DSBINDIR=\"\" -DSOURCE_DIR=\"/mesos\" -DTESTLIBEXECDIR=\"\" -DUSE_CMAKE_BUILD_CONFIG -DUSE_STATIC_LIB -DVERSION=\"1.5.0\" -DZOOKEEPER_VERSION=\"3.4.8\" -D__STDC_FORMAT_MACROS -I/mesos/include -I/mesos/build/include -I/mesos/build/include/mesos -I/mesos/build/src -I/mesos/src -I/mesos/3rdparty/libprocess/src/../include -I/mesos/3rdparty/stout/include -isystem /usr/include/apr-1.0 -isystem /mesos/build/3rdparty/boost-1.53.0/src/boost-1.53.0 -isystem /mesos/build/3rdparty/elfio-3.2/src/elfio-3.2 -isystem /mesos/build/3rdparty/glog-0.3.3/src/glog-0.3.3-build/include -isystem /mesos/build/3rdparty/picojson-1.3.0/src/picojson-1.3.0 -isystem /mesos/build/3rdparty/protobuf-3.3.0/src/protobuf-3.3.0/src -isystem /usr/include/subversion-1 -isystem /mesos/build/3rdparty/http_parser-2.6.2/src/http_parser-2.6.2 -isystem /mesos/build/3rdparty/zookeeper-3.4.8/src/zookeeper-3.4.8/src/c/include -isystem /mesos/build/3rdparty/zookeeper-3.4.8/src/zookeeper-3.4.8/src/c/generated -isystem /mesos/build/3rdparty/nvml-352.79/src/nvml-352.79 -isystem /mesos/build/3rdparty/leveldb-1.19/src/leveldb-1.19/include -isystem /mesos/build/3rdparty/googletest-1.8.0/src/googletest-1.8.0/googlemock/include -isystem /mesos/build/3rdparty/googletest-1.8.0/src/googletest-1.8.0/googletest/include  -std=c++11 -Wformat-security -fstack-protector -fPIE   -o CMakeFiles/mesos-tests.dir/resources_tests.cpp.o -c /mesos/src/tests/resources_tests.cpp
[ 88%] Building CXX object src/tests/CMakeFiles/mesos-tests.dir/role_tests.cpp.o
cd /mesos/build/src/tests && /usr/bin/g++  -DBUILD_DIR=\"/mesos/build\" -DBUILD_FLAGS=\"\" -DBUILD_JAVA_JVM_LIBRARY=\"\" -DHAS_AUTHENTICATION=1 -DHAVE_LIBZ -DLIBDIR=\"/usr/local/libmesos\" -DPICOJSON_USE_INT64 -DPKGDATADIR=\"/usr/local/share/mesos\" -DPKGLIBEXECDIR=\"/usr/local/libexec/mesos\" -DPKGMODULEDIR=\"\" -DSBINDIR=\"\" -DSOURCE_DIR=\"/mesos\" -DTESTLIBEXECDIR=\"\" -DUSE_CMAKE_BUILD_CONFIG -DUSE_STATIC_LIB -DVERSION=\"1.5.0\" -DZOOKEEPER_VERSION=\"3.4.8\" -D__STDC_FORMAT_MACROS -I/mesos/include -I/mesos/build/include -I/mesos/build/include/mesos -I/mesos/build/src -I/mesos/src -I/mesos/3rdparty/libprocess/src/../include -I/mesos/3rdparty/stout/include -isystem /usr/include/apr-1.0 -isystem /mesos/build/3rdparty/boost-1.53.0/src/boost-1.53.0 -isystem /mesos/build/3rdparty/elfio-3.2/src/elfio-3.2 -isystem /mesos/build/3rdparty/glog-0.3.3/src/glog-0.3.3-build/include -isystem /mesos/build/3rdparty/picojson-1.3.0/src/picojson-1.3.0 -isystem /mesos/build/3rdparty/protobuf-3.3.0/src/protobuf-3.3.0/src -isystem /usr/include/subversion-1 -isystem /mesos/build/3rdparty/http_parser-2.6.2/src/http_parser-2.6.2 -isystem /mesos/build/3rdparty/zookeeper-3.4.8/src/zookeeper-3.4.8/src/c/include -isystem /mesos/build/3rdparty/zookeeper-3.4.8/src/zookeeper-3.4.8/src/c/generated -isystem /mesos/build/3rdparty/nvml-352.79/src/nvml-352.79 -isystem /mesos/build/3rdparty/leveldb-1.19/src/leveldb-1.19/include -isystem /mesos/build/3rdparty/googletest-1.8.0/src/googletest-1.8.0/googlemock/include -isystem /mesos/build/3rdparty/googletest-1.8.0/src/googletest-1.8.0/googletest/include  -std=c++11 -Wformat-security -fstack-protector -fPIE   -o CMakeFiles/mesos-tests.dir/role_tests.cpp.o -c /mesos/src/tests/role_tests.cpp
[ 88%] Building CXX object src/tests/CMakeFiles/mesos-tests.dir/scheduler_driver_tests.cpp.o
cd /mesos/build/src/tests && /usr/bin/g++  -DBUILD_DIR=\"/mesos/build\" -DBUILD_FLAGS=\"\" -DBUILD_JAVA_JVM_LIBRARY=\"\" -DHAS_AUTHENTICATION=1 -DHAVE_LIBZ -DLIBDIR=\"/usr/local/libmesos\" -DPICOJSON_USE_INT64 -DPKGDATADIR=\"/usr/local/share/mesos\" -DPKGLIBEXECDIR=\"/usr/local/libexec/mesos\" -DPKGMODULEDIR=\"\" -DSBINDIR=\"\" -DSOURCE_DIR=\"/mesos\" -DTESTLIBEXECDIR=\"\" -DUSE_CMAKE_BUILD_CONFIG -DUSE_STATIC_LIB -DVERSION=\"1.5.0\" -DZOOKEEPER_VERSION=\"3.4.8\" -D__STDC_FORMAT_MACROS -I/mesos/include -I/mesos/build/include -I/mesos/build/include/mesos -I/mesos/build/src -I/mesos/src -I/mesos/3rdparty/libprocess/src/../include -I/mesos/3rdparty/stout/include -isystem /usr/include/apr-1.0 -isystem /mesos/build/3rdparty/boost-1.53.0/src/boost-1.53.0 -isystem /mesos/build/3rdparty/elfio-3.2/src/elfio-3.2 -isystem /mesos/build/3rdparty/glog-0.3.3/src/glog-0.3.3-build/include -isystem /mesos/build/3rdparty/picojson-1.3.0/src/picojson-1.3.0 -isystem /mesos/build/3rdparty/protobuf-3.3.0/src/protobuf-3.3.0/src -isystem /usr/include/subversion-1 -isystem /mesos/build/3rdparty/http_parser-2.6.2/src/http_parser-2.6.2 -isystem /mesos/build/3rdparty/zookeeper-3.4.8/src/zookeeper-3.4.8/src/c/include -isystem /mesos/build/3rdparty/zookeeper-3.4.8/src/zookeeper-3.4.8/src/c/generated -isystem /mesos/build/3rdparty/nvml-352.79/src/nvml-352.79 -isystem /mesos/build/3rdparty/leveldb-1.19/src/leveldb-1.19/include -isystem /mesos/build/3rdparty/googletest-1.8.0/src/googletest-1.8.0/googlemock/include -isystem /mesos/build/3rdparty/googletest-1.8.0/src/googletest-1.8.0/googletest/include  -std=c++11 -Wformat-security -fstack-protector -fPIE   -o CMakeFiles/mesos-tests.dir/scheduler_driver_tests.cpp.o -c /mesos/src/tests/scheduler_driver_tests.cpp
[ 88%] Building CXX object src/tests/CMakeFiles/mesos-tests.dir/scheduler_event_call_tests.cpp.o
cd /mesos/build/src/tests && /usr/bin/g++  -DBUILD_DIR=\"/mesos/build\" -DBUILD_FLAGS=\"\" -DBUILD_JAVA_JVM_LIBRARY=\"\" -DHAS_AUTHENTICATION=1 -DHAVE_LIBZ -DLIBDIR=\"/usr/local/libmesos\" -DPICOJSON_USE_INT64 -DPKGDATADIR=\"/usr/local/share/mesos\" -DPKGLIBEXECDIR=\"/usr/local/libexec/mesos\" -DPKGMODULEDIR=\"\" -DSBINDIR=\"\" -DSOURCE_DIR=\"/mesos\" -DTESTLIBEXECDIR=\"\" -DUSE_CMAKE_BUILD_CONFIG -DUSE_STATIC_LIB -DVERSION=\"1.5.0\" -DZOOKEEPER_VERSION=\"3.4.8\" -D__STDC_FORMAT_MACROS -I/mesos/include -I/mesos/build/include -I/mesos/build/include/mesos -I/mesos/build/src -I/mesos/src -I/mesos/3rdparty/libprocess/src/../include -I/mesos/3rdparty/stout/include -isystem /usr/include/apr-1.0 -isystem /mesos/build/3rdparty/boost-1.53.0/src/boost-1.53.0 -isystem /mesos/build/3rdparty/elfio-3.2/src/elfio-3.2 -isystem /mesos/build/3rdparty/glog-0.3.3/src/glog-0.3.3-build/include -isystem /mesos/build/3rdparty/picojson-1.3.0/src/picojson-1.3.0 -isystem /mesos/build/3rdparty/protobuf-3.3.0/src/protobuf-3.3.0/src -isystem /usr/include/subversion-1 -isystem /mesos/build/3rdparty/http_parser-2.6.2/src/http_parser-2.6.2 -isystem /mesos/build/3rdparty/zookeeper-3.4.8/src/zookeeper-3.4.8/src/c/include -isystem /mesos/build/3rdparty/zookeeper-3.4.8/src/zookeeper-3.4.8/src/c/generated -isystem /mesos/build/3rdparty/nvml-352.79/src/nvml-352.79 -isystem /mesos/build/3rdparty/leveldb-1.19/src/leveldb-1.19/include -isystem /mesos/build/3rdparty/googletest-1.8.0/src/googletest-1.8.0/googlemock/include -isystem /mesos/build/3rdparty/googletest-1.8.0/src/googletest-1.8.0/googletest/include  -std=c++11 -Wformat-security -fstack-protector -fPIE   -o CMakeFiles/mesos-tests.dir/scheduler_event_call_tests.cpp.o -c /mesos/src/tests/scheduler_event_call_tests.cpp
[ 88%] Building CXX object src/tests/CMakeFiles/mesos-tests.dir/scheduler_http_api_tests.cpp.o
cd /mesos/build/src/tests && /usr/bin/g++  -DBUILD_DIR=\"/mesos/build\" -DBUILD_FLAGS=\"\" -DBUILD_JAVA_JVM_LIBRARY=\"\" -DHAS_AUTHENTICATION=1 -DHAVE_LIBZ -DLIBDIR=\"/usr/local/libmesos\" -DPICOJSON_USE_INT64 -DPKGDATADIR=\"/usr/local/share/mesos\" -DPKGLIBEXECDIR=\"/usr/local/libexec/mesos\" -DPKGMODULEDIR=\"\" -DSBINDIR=\"\" -DSOURCE_DIR=\"/mesos\" -DTESTLIBEXECDIR=\"\" -DUSE_CMAKE_BUILD_CONFIG -DUSE_STATIC_LIB -DVERSION=\"1.5.0\" -DZOOKEEPER_VERSION=\"3.4.8\" -D__STDC_FORMAT_MACROS -I/mesos/include -I/mesos/build/include -I/mesos/build/include/mesos -I/mesos/build/src -I/mesos/src -I/mesos/3rdparty/libprocess/src/../include -I/mesos/3rdparty/stout/include -isystem /usr/include/apr-1.0 -isystem /mesos/build/3rdparty/boost-1.53.0/src/boost-1.53.0 -isystem /mesos/build/3rdparty/elfio-3.2/src/elfio-3.2 -isystem /mesos/build/3rdparty/glog-0.3.3/src/glog-0.3.3-build/include -isystem /mesos/build/3rdparty/picojson-1.3.0/src/picojson-1.3.0 -isystem /mesos/build/3rdparty/protobuf-3.3.0/src/protobuf-3.3.0/src -isystem /usr/include/subversion-1 -isystem /mesos/build/3rdparty/http_parser-2.6.2/src/http_parser-2.6.2 -isystem /mesos/build/3rdparty/zookeeper-3.4.8/src/zookeeper-3.4.8/src/c/include -isystem /mesos/build/3rdparty/zookeeper-3.4.8/src/zookeeper-3.4.8/src/c/generated -isystem /mesos/build/3rdparty/nvml-352.79/src/nvml-352.79 -isystem /mesos/build/3rdparty/leveldb-1.19/src/leveldb-1.19/include -isystem /mesos/build/3rdparty/googletest-1.8.0/src/googletest-1.8.0/googlemock/include -isystem /mesos/build/3rdparty/googletest-1.8.0/src/googletest-1.8.0/googletest/include  -std=c++11 -Wformat-security -fstack-protector -fPIE   -o CMakeFiles/mesos-tests.dir/scheduler_http_api_tests.cpp.o -c /mesos/src/tests/scheduler_http_api_tests.cpp
[ 88%] Building CXX object src/tests/CMakeFiles/mesos-tests.dir/scheduler_tests.cpp.o
cd /mesos/build/src/tests && /usr/bin/g++  -DBUILD_DIR=\"/mesos/build\" -DBUILD_FLAGS=\"\" -DBUILD_JAVA_JVM_LIBRARY=\"\" -DHAS_AUTHENTICATION=1 -DHAVE_LIBZ -DLIBDIR=\"/usr/local/libmesos\" -DPICOJSON_USE_INT64 -DPKGDATADIR=\"/usr/local/share/mesos\" -DPKGLIBEXECDIR=\"/usr/local/libexec/mesos\" -DPKGMODULEDIR=\"\" -DSBINDIR=\"\" -DSOURCE_DIR=\"/mesos\" -DTESTLIBEXECDIR=\"\" -DUSE_CMAKE_BUILD_CONFIG -DUSE_STATIC_LIB -DVERSION=\"1.5.0\" -DZOOKEEPER_VERSION=\"3.4.8\" -D__STDC_FORMAT_MACROS -I/mesos/include -I/mesos/build/include -I/mesos/build/include/mesos -I/mesos/build/src -I/mesos/src -I/mesos/3rdparty/libprocess/src/../include -I/mesos/3rdparty/stout/include -isystem /usr/include/apr-1.0 -isystem /mesos/build/3rdparty/boost-1.53.0/src/boost-1.53.0 -isystem /mesos/build/3rdparty/elfio-3.2/src/elfio-3.2 -isystem /mesos/build/3rdparty/glog-0.3.3/src/glog-0.3.3-build/include -isystem /mesos/build/3rdparty/picojson-1.3.0/src/picojson-1.3.0 -isystem /mesos/build/3rdparty/protobuf-3.3.0/src/protobuf-3.3.0/src -isystem /usr/include/subversion-1 -isystem /mesos/build/3rdparty/http_parser-2.6.2/src/http_parser-2.6.2 -isystem /mesos/build/3rdparty/zookeeper-3.4.8/src/zookeeper-3.4.8/src/c/include -isystem /mesos/build/3rdparty/zookeeper-3.4.8/src/zookeeper-3.4.8/src/c/generated -isystem /mesos/build/3rdparty/nvml-352.79/src/nvml-352.79 -isystem /mesos/build/3rdparty/leveldb-1.19/src/leveldb-1.19/include -isystem /mesos/build/3rdparty/googletest-1.8.0/src/googletest-1.8.0/googlemock/include -isystem /mesos/build/3rdparty/googletest-1.8.0/src/googletest-1.8.0/googletest/include  -std=c++11 -Wformat-security -fstack-protector -fPIE   -o CMakeFiles/mesos-tests.dir/scheduler_tests.cpp.o -c /mesos/src/tests/scheduler_tests.cpp
[ 88%] Building CXX object src/tests/CMakeFiles/mesos-tests.dir/slave_tests.cpp.o
cd /mesos/build/src/tests && /usr/bin/g++  -DBUILD_DIR=\"/mesos/build\" -DBUILD_FLAGS=\"\" -DBUILD_JAVA_JVM_LIBRARY=\"\" -DHAS_AUTHENTICATION=1 -DHAVE_LIBZ -DLIBDIR=\"/usr/local/libmesos\" -DPICOJSON_USE_INT64 -DPKGDATADIR=\"/usr/local/share/mesos\" -DPKGLIBEXECDIR=\"/usr/local/libexec/mesos\" -DPKGMODULEDIR=\"\" -DSBINDIR=\"\" -DSOURCE_DIR=\"/mesos\" -DTESTLIBEXECDIR=\"\" -DUSE_CMAKE_BUILD_CONFIG -DUSE_STATIC_LIB -DVERSION=\"1.5.0\" -DZOOKEEPER_VERSION=\"3.4.8\" -D__STDC_FORMAT_MACROS -I/mesos/include -I/mesos/build/include -I/mesos/build/include/mesos -I/mesos/build/src -I/mesos/src -I/mesos/3rdparty/libprocess/src/../include -I/mesos/3rdparty/stout/include -isystem /usr/include/apr-1.0 -isystem /mesos/build/3rdparty/boost-1.53.0/src/boost-1.53.0 -isystem /mesos/build/3rdparty/elfio-3.2/src/elfio-3.2 -isystem /mesos/build/3rdparty/glog-0.3.3/src/glog-0.3.3-build/include -isystem /mesos/build/3rdparty/picojson-1.3.0/src/picojson-1.3.0 -isystem /mesos/build/3rdparty/protobuf-3.3.0/src/protobuf-3.3.0/src -isystem /usr/include/subversion-1 -isystem /mesos/build/3rdparty/http_parser-2.6.2/src/http_parser-2.6.2 -isystem /mesos/build/3rdparty/zookeeper-3.4.8/src/zookeeper-3.4.8/src/c/include -isystem /mesos/build/3rdparty/zookeeper-3.4.8/src/zookeeper-3.4.8/src/c/generated -isystem /mesos/build/3rdparty/nvml-352.79/src/nvml-352.79 -isystem /mesos/build/3rdparty/leveldb-1.19/src/leveldb-1.19/include -isystem /mesos/build/3rdparty/googletest-1.8.0/src/googletest-1.8.0/googlemock/include -isystem /mesos/build/3rdparty/googletest-1.8.0/src/googletest-1.8.0/googletest/include  -std=c++11 -Wformat-security -fstack-protector -fPIE   -o CMakeFiles/mesos-tests.dir/slave_tests.cpp.o -c /mesos/src/tests/slave_tests.cpp
[ 88%] Building CXX object src/tests/CMakeFiles/mesos-tests.dir/slave_validation_tests.cpp.o
cd /mesos/build/src/tests && /usr/bin/g++  -DBUILD_DIR=\"/mesos/build\" -DBUILD_FLAGS=\"\" -DBUILD_JAVA_JVM_LIBRARY=\"\" -DHAS_AUTHENTICATION=1 -DHAVE_LIBZ -DLIBDIR=\"/usr/local/libmesos\" -DPICOJSON_USE_INT64 -DPKGDATADIR=\"/usr/local/share/mesos\" -DPKGLIBEXECDIR=\"/usr/local/libexec/mesos\" -DPKGMODULEDIR=\"\" -DSBINDIR=\"\" -DSOURCE_DIR=\"/mesos\" -DTESTLIBEXECDIR=\"\" -DUSE_CMAKE_BUILD_CONFIG -DUSE_STATIC_LIB -DVERSION=\"1.5.0\" -DZOOKEEPER_VERSION=\"3.4.8\" -D__STDC_FORMAT_MACROS -I/mesos/include -I/mesos/build/include -I/mesos/build/include/mesos -I/mesos/build/src -I/mesos/src -I/mesos/3rdparty/libprocess/src/../include -I/mesos/3rdparty/stout/include -isystem /usr/include/apr-1.0 -isystem /mesos/build/3rdparty/boost-1.53.0/src/boost-1.53.0 -isystem /mesos/build/3rdparty/elfio-3.2/src/elfio-3.2 -isystem /mesos/build/3rdparty/glog-0.3.3/src/glog-0.3.3-build/include -isystem /mesos/build/3rdparty/picojson-1.3.0/src/picojson-1.3.0 -isystem /mesos/build/3rdparty/protobuf-3.3.0/src/protobuf-3.3.0/src -isystem /usr/include/subversion-1 -isystem /mesos/build/3rdparty/http_parser-2.6.2/src/http_parser-2.6.2 -isystem /mesos/build/3rdparty/zookeeper-3.4.8/src/zookeeper-3.4.8/src/c/include -isystem /mesos/build/3rdparty/zookeeper-3.4.8/src/zookeeper-3.4.8/src/c/generated -isystem /mesos/build/3rdparty/nvml-352.79/src/nvml-352.79 -isystem /mesos/build/3rdparty/leveldb-1.19/src/leveldb-1.19/include -isystem /mesos/build/3rdparty/googletest-1.8.0/src/googletest-1.8.0/googlemock/include -isystem /mesos/build/3rdparty/googletest-1.8.0/src/googletest-1.8.0/googletest/include  -std=c++11 -Wformat-security -fstack-protector -fPIE   -o CMakeFiles/mesos-tests.dir/slave_validation_tests.cpp.o -c /mesos/src/tests/slave_validation_tests.cpp
[ 89%] Building CXX object src/tests/CMakeFiles/mesos-tests.dir/sorter_tests.cpp.o
cd /mesos/build/src/tests && /usr/bin/g++  -DBUILD_DIR=\"/mesos/build\" -DBUILD_FLAGS=\"\" -DBUILD_JAVA_JVM_LIBRARY=\"\" -DHAS_AUTHENTICATION=1 -DHAVE_LIBZ -DLIBDIR=\"/usr/local/libmesos\" -DPICOJSON_USE_INT64 -DPKGDATADIR=\"/usr/local/share/mesos\" -DPKGLIBEXECDIR=\"/usr/local/libexec/mesos\" -DPKGMODULEDIR=\"\" -DSBINDIR=\"\" -DSOURCE_DIR=\"/mesos\" -DTESTLIBEXECDIR=\"\" -DUSE_CMAKE_BUILD_CONFIG -DUSE_STATIC_LIB -DVERSION=\"1.5.0\" -DZOOKEEPER_VERSION=\"3.4.8\" -D__STDC_FORMAT_MACROS -I/mesos/include -I/mesos/build/include -I/mesos/build/include/mesos -I/mesos/build/src -I/mesos/src -I/mesos/3rdparty/libprocess/src/../include -I/mesos/3rdparty/stout/include -isystem /usr/include/apr-1.0 -isystem /mesos/build/3rdparty/boost-1.53.0/src/boost-1.53.0 -isystem /mesos/build/3rdparty/elfio-3.2/src/elfio-3.2 -isystem /mesos/build/3rdparty/glog-0.3.3/src/glog-0.3.3-build/include -isystem /mesos/build/3rdparty/picojson-1.3.0/src/picojson-1.3.0 -isystem /mesos/build/3rdparty/protobuf-3.3.0/src/protobuf-3.3.0/src -isystem /usr/include/subversion-1 -isystem /mesos/build/3rdparty/http_parser-2.6.2/src/http_parser-2.6.2 -isystem /mesos/build/3rdparty/zookeeper-3.4.8/src/zookeeper-3.4.8/src/c/include -isystem /mesos/build/3rdparty/zookeeper-3.4.8/src/zookeeper-3.4.8/src/c/generated -isystem /mesos/build/3rdparty/nvml-352.79/src/nvml-352.79 -isystem /mesos/build/3rdparty/leveldb-1.19/src/leveldb-1.19/include -isystem /mesos/build/3rdparty/googletest-1.8.0/src/googletest-1.8.0/googlemock/include -isystem /mesos/build/3rdparty/googletest-1.8.0/src/googletest-1.8.0/googletest/include  -std=c++11 -Wformat-security -fstack-protector -fPIE   -o CMakeFiles/mesos-tests.dir/sorter_tests.cpp.o -c /mesos/src/tests/sorter_tests.cpp
[ 89%] Building CXX object src/tests/CMakeFiles/mesos-tests.dir/status_update_manager_tests.cpp.o
cd /mesos/build/src/tests && /usr/bin/g++  -DBUILD_DIR=\"/mesos/build\" -DBUILD_FLAGS=\"\" -DBUILD_JAVA_JVM_LIBRARY=\"\" -DHAS_AUTHENTICATION=1 -DHAVE_LIBZ -DLIBDIR=\"/usr/local/libmesos\" -DPICOJSON_USE_INT64 -DPKGDATADIR=\"/usr/local/share/mesos\" -DPKGLIBEXECDIR=\"/usr/local/libexec/mesos\" -DPKGMODULEDIR=\"\" -DSBINDIR=\"\" -DSOURCE_DIR=\"/mesos\" -DTESTLIBEXECDIR=\"\" -DUSE_CMAKE_BUILD_CONFIG -DUSE_STATIC_LIB -DVERSION=\"1.5.0\" -DZOOKEEPER_VERSION=\"3.4.8\" -D__STDC_FORMAT_MACROS -I/mesos/include -I/mesos/build/include -I/mesos/build/include/mesos -I/mesos/build/src -I/mesos/src -I/mesos/3rdparty/libprocess/src/../include -I/mesos/3rdparty/stout/include -isystem /usr/include/apr-1.0 -isystem /mesos/build/3rdparty/boost-1.53.0/src/boost-1.53.0 -isystem /mesos/build/3rdparty/elfio-3.2/src/elfio-3.2 -isystem /mesos/build/3rdparty/glog-0.3.3/src/glog-0.3.3-build/include -isystem /mesos/build/3rdparty/picojson-1.3.0/src/picojson-1.3.0 -isystem /mesos/build/3rdparty/protobuf-3.3.0/src/protobuf-3.3.0/src -isystem /usr/include/subversion-1 -isystem /mesos/build/3rdparty/http_parser-2.6.2/src/http_parser-2.6.2 -isystem /mesos/build/3rdparty/zookeeper-3.4.8/src/zookeeper-3.4.8/src/c/include -isystem /mesos/build/3rdparty/zookeeper-3.4.8/src/zookeeper-3.4.8/src/c/generated -isystem /mesos/build/3rdparty/nvml-352.79/src/nvml-352.79 -isystem /mesos/build/3rdparty/leveldb-1.19/src/leveldb-1.19/include -isystem /mesos/build/3rdparty/googletest-1.8.0/src/googletest-1.8.0/googlemock/include -isystem /mesos/build/3rdparty/googletest-1.8.0/src/googletest-1.8.0/googletest/include  -std=c++11 -Wformat-security -fstack-protector -fPIE   -o CMakeFiles/mesos-tests.dir/status_update_manager_tests.cpp.o -c /mesos/src/tests/status_update_manager_tests.cpp
[ 89%] Building CXX object src/tests/CMakeFiles/mesos-tests.dir/uri_tests.cpp.o
cd /mesos/build/src/tests && /usr/bin/g++  -DBUILD_DIR=\"/mesos/build\" -DBUILD_FLAGS=\"\" -DBUILD_JAVA_JVM_LIBRARY=\"\" -DHAS_AUTHENTICATION=1 -DHAVE_LIBZ -DLIBDIR=\"/usr/local/libmesos\" -DPICOJSON_USE_INT64 -DPKGDATADIR=\"/usr/local/share/mesos\" -DPKGLIBEXECDIR=\"/usr/local/libexec/mesos\" -DPKGMODULEDIR=\"\" -DSBINDIR=\"\" -DSOURCE_DIR=\"/mesos\" -DTESTLIBEXECDIR=\"\" -DUSE_CMAKE_BUILD_CONFIG -DUSE_STATIC_LIB -DVERSION=\"1.5.0\" -DZOOKEEPER_VERSION=\"3.4.8\" -D__STDC_FORMAT_MACROS -I/mesos/include -I/mesos/build/include -I/mesos/build/include/mesos -I/mesos/build/src -I/mesos/src -I/mesos/3rdparty/libprocess/src/../include -I/mesos/3rdparty/stout/include -isystem /usr/include/apr-1.0 -isystem /mesos/build/3rdparty/boost-1.53.0/src/boost-1.53.0 -isystem /mesos/build/3rdparty/elfio-3.2/src/elfio-3.2 -isystem /mesos/build/3rdparty/glog-0.3.3/src/glog-0.3.3-build/include -isystem /mesos/build/3rdparty/picojson-1.3.0/src/picojson-1.3.0 -isystem /mesos/build/3rdparty/protobuf-3.3.0/src/protobuf-3.3.0/src -isystem /usr/include/subversion-1 -isystem /mesos/build/3rdparty/http_parser-2.6.2/src/http_parser-2.6.2 -isystem /mesos/build/3rdparty/zookeeper-3.4.8/src/zookeeper-3.4.8/src/c/include -isystem /mesos/build/3rdparty/zookeeper-3.4.8/src/zookeeper-3.4.8/src/c/generated -isystem /mesos/build/3rdparty/nvml-352.79/src/nvml-352.79 -isystem /mesos/build/3rdparty/leveldb-1.19/src/leveldb-1.19/include -isystem /mesos/build/3rdparty/googletest-1.8.0/src/googletest-1.8.0/googlemock/include -isystem /mesos/build/3rdparty/googletest-1.8.0/src/googletest-1.8.0/googletest/include  -std=c++11 -Wformat-security -fstack-protector -fPIE   -o CMakeFiles/mesos-tests.dir/uri_tests.cpp.o -c /mesos/src/tests/uri_tests.cpp
[ 89%] Building CXX object src/tests/CMakeFiles/mesos-tests.dir/uri_fetcher_tests.cpp.o
cd /mesos/build/src/tests && /usr/bin/g++  -DBUILD_DIR=\"/mesos/build\" -DBUILD_FLAGS=\"\" -DBUILD_JAVA_JVM_LIBRARY=\"\" -DHAS_AUTHENTICATION=1 -DHAVE_LIBZ -DLIBDIR=\"/usr/local/libmesos\" -DPICOJSON_USE_INT64 -DPKGDATADIR=\"/usr/local/share/mesos\" -DPKGLIBEXECDIR=\"/usr/local/libexec/mesos\" -DPKGMODULEDIR=\"\" -DSBINDIR=\"\" -DSOURCE_DIR=\"/mesos\" -DTESTLIBEXECDIR=\"\" -DUSE_CMAKE_BUILD_CONFIG -DUSE_STATIC_LIB -DVERSION=\"1.5.0\" -DZOOKEEPER_VERSION=\"3.4.8\" -D__STDC_FORMAT_MACROS -I/mesos/include -I/mesos/build/include -I/mesos/build/include/mesos -I/mesos/build/src -I/mesos/src -I/mesos/3rdparty/libprocess/src/../include -I/mesos/3rdparty/stout/include -isystem /usr/include/apr-1.0 -isystem /mesos/build/3rdparty/boost-1.53.0/src/boost-1.53.0 -isystem /mesos/build/3rdparty/elfio-3.2/src/elfio-3.2 -isystem /mesos/build/3rdparty/glog-0.3.3/src/glog-0.3.3-build/include -isystem /mesos/build/3rdparty/picojson-1.3.0/src/picojson-1.3.0 -isystem /mesos/build/3rdparty/protobuf-3.3.0/src/protobuf-3.3.0/src -isystem /usr/include/subversion-1 -isystem /mesos/build/3rdparty/http_parser-2.6.2/src/http_parser-2.6.2 -isystem /mesos/build/3rdparty/zookeeper-3.4.8/src/zookeeper-3.4.8/src/c/include -isystem /mesos/build/3rdparty/zookeeper-3.4.8/src/zookeeper-3.4.8/src/c/generated -isystem /mesos/build/3rdparty/nvml-352.79/src/nvml-352.79 -isystem /mesos/build/3rdparty/leveldb-1.19/src/leveldb-1.19/include -isystem /mesos/build/3rdparty/googletest-1.8.0/src/googletest-1.8.0/googlemock/include -isystem /mesos/build/3rdparty/googletest-1.8.0/src/googletest-1.8.0/googletest/include  -std=c++11 -Wformat-security -fstack-protector -fPIE   -o CMakeFiles/mesos-tests.dir/uri_fetcher_tests.cpp.o -c /mesos/src/tests/uri_fetcher_tests.cpp
[ 89%] Building CXX object src/tests/CMakeFiles/mesos-tests.dir/values_tests.cpp.o
cd /mesos/build/src/tests && /usr/bin/g++  -DBUILD_DIR=\"/mesos/build\" -DBUILD_FLAGS=\"\" -DBUILD_JAVA_JVM_LIBRARY=\"\" -DHAS_AUTHENTICATION=1 -DHAVE_LIBZ -DLIBDIR=\"/usr/local/libmesos\" -DPICOJSON_USE_INT64 -DPKGDATADIR=\"/usr/local/share/mesos\" -DPKGLIBEXECDIR=\"/usr/local/libexec/mesos\" -DPKGMODULEDIR=\"\" -DSBINDIR=\"\" -DSOURCE_DIR=\"/mesos\" -DTESTLIBEXECDIR=\"\" -DUSE_CMAKE_BUILD_CONFIG -DUSE_STATIC_LIB -DVERSION=\"1.5.0\" -DZOOKEEPER_VERSION=\"3.4.8\" -D__STDC_FORMAT_MACROS -I/mesos/include -I/mesos/build/include -I/mesos/build/include/mesos -I/mesos/build/src -I/mesos/src -I/mesos/3rdparty/libprocess/src/../include -I/mesos/3rdparty/stout/include -isystem /usr/include/apr-1.0 -isystem /mesos/build/3rdparty/boost-1.53.0/src/boost-1.53.0 -isystem /mesos/build/3rdparty/elfio-3.2/src/elfio-3.2 -isystem /mesos/build/3rdparty/glog-0.3.3/src/glog-0.3.3-build/include -isystem /mesos/build/3rdparty/picojson-1.3.0/src/picojson-1.3.0 -isystem /mesos/build/3rdparty/protobuf-3.3.0/src/protobuf-3.3.0/src -isystem /usr/include/subversion-1 -isystem /mesos/build/3rdparty/http_parser-2.6.2/src/http_parser-2.6.2 -isystem /mesos/build/3rdparty/zookeeper-3.4.8/src/zookeeper-3.4.8/src/c/include -isystem /mesos/build/3rdparty/zookeeper-3.4.8/src/zookeeper-3.4.8/src/c/generated -isystem /mesos/build/3rdparty/nvml-352.79/src/nvml-352.79 -isystem /mesos/build/3rdparty/leveldb-1.19/src/leveldb-1.19/include -isystem /mesos/build/3rdparty/googletest-1.8.0/src/googletest-1.8.0/googlemock/include -isystem /mesos/build/3rdparty/googletest-1.8.0/src/googletest-1.8.0/googletest/include  -std=c++11 -Wformat-security -fstack-protector -fPIE   -o CMakeFiles/mesos-tests.dir/values_tests.cpp.o -c /mesos/src/tests/values_tests.cpp
[ 89%] Building CXX object src/tests/CMakeFiles/mesos-tests.dir/zookeeper_url_tests.cpp.o
cd /mesos/build/src/tests && /usr/bin/g++  -DBUILD_DIR=\"/mesos/build\" -DBUILD_FLAGS=\"\" -DBUILD_JAVA_JVM_LIBRARY=\"\" -DHAS_AUTHENTICATION=1 -DHAVE_LIBZ -DLIBDIR=\"/usr/local/libmesos\" -DPICOJSON_USE_INT64 -DPKGDATADIR=\"/usr/local/share/mesos\" -DPKGLIBEXECDIR=\"/usr/local/libexec/mesos\" -DPKGMODULEDIR=\"\" -DSBINDIR=\"\" -DSOURCE_DIR=\"/mesos\" -DTESTLIBEXECDIR=\"\" -DUSE_CMAKE_BUILD_CONFIG -DUSE_STATIC_LIB -DVERSION=\"1.5.0\" -DZOOKEEPER_VERSION=\"3.4.8\" -D__STDC_FORMAT_MACROS -I/mesos/include -I/mesos/build/include -I/mesos/build/include/mesos -I/mesos/build/src -I/mesos/src -I/mesos/3rdparty/libprocess/src/../include -I/mesos/3rdparty/stout/include -isystem /usr/include/apr-1.0 -isystem /mesos/build/3rdparty/boost-1.53.0/src/boost-1.53.0 -isystem /mesos/build/3rdparty/elfio-3.2/src/elfio-3.2 -isystem /mesos/build/3rdparty/glog-0.3.3/src/glog-0.3.3-build/include -isystem /mesos/build/3rdparty/picojson-1.3.0/src/picojson-1.3.0 -isystem /mesos/build/3rdparty/protobuf-3.3.0/src/protobuf-3.3.0/src -isystem /usr/include/subversion-1 -isystem /mesos/build/3rdparty/http_parser-2.6.2/src/http_parser-2.6.2 -isystem /mesos/build/3rdparty/zookeeper-3.4.8/src/zookeeper-3.4.8/src/c/include -isystem /mesos/build/3rdparty/zookeeper-3.4.8/src/zookeeper-3.4.8/src/c/generated -isystem /mesos/build/3rdparty/nvml-352.79/src/nvml-352.79 -isystem /mesos/build/3rdparty/leveldb-1.19/src/leveldb-1.19/include -isystem /mesos/build/3rdparty/googletest-1.8.0/src/googletest-1.8.0/googlemock/include -isystem /mesos/build/3rdparty/googletest-1.8.0/src/googletest-1.8.0/googletest/include  -std=c++11 -Wformat-security -fstack-protector -fPIE   -o CMakeFiles/mesos-tests.dir/zookeeper_url_tests.cpp.o -c /mesos/src/tests/zookeeper_url_tests.cpp
[ 89%] Building CXX object src/tests/CMakeFiles/mesos-tests.dir/common/http_tests.cpp.o
cd /mesos/build/src/tests && /usr/bin/g++  -DBUILD_DIR=\"/mesos/build\" -DBUILD_FLAGS=\"\" -DBUILD_JAVA_JVM_LIBRARY=\"\" -DHAS_AUTHENTICATION=1 -DHAVE_LIBZ -DLIBDIR=\"/usr/local/libmesos\" -DPICOJSON_USE_INT64 -DPKGDATADIR=\"/usr/local/share/mesos\" -DPKGLIBEXECDIR=\"/usr/local/libexec/mesos\" -DPKGMODULEDIR=\"\" -DSBINDIR=\"\" -DSOURCE_DIR=\"/mesos\" -DTESTLIBEXECDIR=\"\" -DUSE_CMAKE_BUILD_CONFIG -DUSE_STATIC_LIB -DVERSION=\"1.5.0\" -DZOOKEEPER_VERSION=\"3.4.8\" -D__STDC_FORMAT_MACROS -I/mesos/include -I/mesos/build/include -I/mesos/build/include/mesos -I/mesos/build/src -I/mesos/src -I/mesos/3rdparty/libprocess/src/../include -I/mesos/3rdparty/stout/include -isystem /usr/include/apr-1.0 -isystem /mesos/build/3rdparty/boost-1.53.0/src/boost-1.53.0 -isystem /mesos/build/3rdparty/elfio-3.2/src/elfio-3.2 -isystem /mesos/build/3rdparty/glog-0.3.3/src/glog-0.3.3-build/include -isystem /mesos/build/3rdparty/picojson-1.3.0/src/picojson-1.3.0 -isystem /mesos/build/3rdparty/protobuf-3.3.0/src/protobuf-3.3.0/src -isystem /usr/include/subversion-1 -isystem /mesos/build/3rdparty/http_parser-2.6.2/src/http_parser-2.6.2 -isystem /mesos/build/3rdparty/zookeeper-3.4.8/src/zookeeper-3.4.8/src/c/include -isystem /mesos/build/3rdparty/zookeeper-3.4.8/src/zookeeper-3.4.8/src/c/generated -isystem /mesos/build/3rdparty/nvml-352.79/src/nvml-352.79 -isystem /mesos/build/3rdparty/leveldb-1.19/src/leveldb-1.19/include -isystem /mesos/build/3rdparty/googletest-1.8.0/src/googletest-1.8.0/googlemock/include -isystem /mesos/build/3rdparty/googletest-1.8.0/src/googletest-1.8.0/googletest/include  -std=c++11 -Wformat-security -fstack-protector -fPIE   -o CMakeFiles/mesos-tests.dir/common/http_tests.cpp.o -c /mesos/src/tests/common/http_tests.cpp
[ 90%] Building CXX object src/tests/CMakeFiles/mesos-tests.dir/common/recordio_tests.cpp.o
cd /mesos/build/src/tests && /usr/bin/g++  -DBUILD_DIR=\"/mesos/build\" -DBUILD_FLAGS=\"\" -DBUILD_JAVA_JVM_LIBRARY=\"\" -DHAS_AUTHENTICATION=1 -DHAVE_LIBZ -DLIBDIR=\"/usr/local/libmesos\" -DPICOJSON_USE_INT64 -DPKGDATADIR=\"/usr/local/share/mesos\" -DPKGLIBEXECDIR=\"/usr/local/libexec/mesos\" -DPKGMODULEDIR=\"\" -DSBINDIR=\"\" -DSOURCE_DIR=\"/mesos\" -DTESTLIBEXECDIR=\"\" -DUSE_CMAKE_BUILD_CONFIG -DUSE_STATIC_LIB -DVERSION=\"1.5.0\" -DZOOKEEPER_VERSION=\"3.4.8\" -D__STDC_FORMAT_MACROS -I/mesos/include -I/mesos/build/include -I/mesos/build/include/mesos -I/mesos/build/src -I/mesos/src -I/mesos/3rdparty/libprocess/src/../include -I/mesos/3rdparty/stout/include -isystem /usr/include/apr-1.0 -isystem /mesos/build/3rdparty/boost-1.53.0/src/boost-1.53.0 -isystem /mesos/build/3rdparty/elfio-3.2/src/elfio-3.2 -isystem /mesos/build/3rdparty/glog-0.3.3/src/glog-0.3.3-build/include -isystem /mesos/build/3rdparty/picojson-1.3.0/src/picojson-1.3.0 -isystem /mesos/build/3rdparty/protobuf-3.3.0/src/protobuf-3.3.0/src -isystem /usr/include/subversion-1 -isystem /mesos/build/3rdparty/http_parser-2.6.2/src/http_parser-2.6.2 -isystem /mesos/build/3rdparty/zookeeper-3.4.8/src/zookeeper-3.4.8/src/c/include -isystem /mesos/build/3rdparty/zookeeper-3.4.8/src/zookeeper-3.4.8/src/c/generated -isystem /mesos/build/3rdparty/nvml-352.79/src/nvml-352.79 -isystem /mesos/build/3rdparty/leveldb-1.19/src/leveldb-1.19/include -isystem /mesos/build/3rdparty/googletest-1.8.0/src/googletest-1.8.0/googlemock/include -isystem /mesos/build/3rdparty/googletest-1.8.0/src/googletest-1.8.0/googletest/include  -std=c++11 -Wformat-security -fstack-protector -fPIE   -o CMakeFiles/mesos-tests.dir/common/recordio_tests.cpp.o -c /mesos/src/tests/common/recordio_tests.cpp
[ 90%] Building CXX object src/tests/CMakeFiles/mesos-tests.dir/common/type_utils_tests.cpp.o
cd /mesos/build/src/tests && /usr/bin/g++  -DBUILD_DIR=\"/mesos/build\" -DBUILD_FLAGS=\"\" -DBUILD_JAVA_JVM_LIBRARY=\"\" -DHAS_AUTHENTICATION=1 -DHAVE_LIBZ -DLIBDIR=\"/usr/local/libmesos\" -DPICOJSON_USE_INT64 -DPKGDATADIR=\"/usr/local/share/mesos\" -DPKGLIBEXECDIR=\"/usr/local/libexec/mesos\" -DPKGMODULEDIR=\"\" -DSBINDIR=\"\" -DSOURCE_DIR=\"/mesos\" -DTESTLIBEXECDIR=\"\" -DUSE_CMAKE_BUILD_CONFIG -DUSE_STATIC_LIB -DVERSION=\"1.5.0\" -DZOOKEEPER_VERSION=\"3.4.8\" -D__STDC_FORMAT_MACROS -I/mesos/include -I/mesos/build/include -I/mesos/build/include/mesos -I/mesos/build/src -I/mesos/src -I/mesos/3rdparty/libprocess/src/../include -I/mesos/3rdparty/stout/include -isystem /usr/include/apr-1.0 -isystem /mesos/build/3rdparty/boost-1.53.0/src/boost-1.53.0 -isystem /mesos/build/3rdparty/elfio-3.2/src/elfio-3.2 -isystem /mesos/build/3rdparty/glog-0.3.3/src/glog-0.3.3-build/include -isystem /mesos/build/3rdparty/picojson-1.3.0/src/picojson-1.3.0 -isystem /mesos/build/3rdparty/protobuf-3.3.0/src/protobuf-3.3.0/src -isystem /usr/include/subversion-1 -isystem /mesos/build/3rdparty/http_parser-2.6.2/src/http_parser-2.6.2 -isystem /mesos/build/3rdparty/zookeeper-3.4.8/src/zookeeper-3.4.8/src/c/include -isystem /mesos/build/3rdparty/zookeeper-3.4.8/src/zookeeper-3.4.8/src/c/generated -isystem /mesos/build/3rdparty/nvml-352.79/src/nvml-352.79 -isystem /mesos/build/3rdparty/leveldb-1.19/src/leveldb-1.19/include -isystem /mesos/build/3rdparty/googletest-1.8.0/src/googletest-1.8.0/googlemock/include -isystem /mesos/build/3rdparty/googletest-1.8.0/src/googletest-1.8.0/googletest/include  -std=c++11 -Wformat-security -fstack-protector -fPIE   -o CMakeFiles/mesos-tests.dir/common/type_utils_tests.cpp.o -c /mesos/src/tests/common/type_utils_tests.cpp
[ 90%] Building CXX object src/tests/CMakeFiles/mesos-tests.dir/containerizer/containerizer_tests.cpp.o
cd /mesos/build/src/tests && /usr/bin/g++  -DBUILD_DIR=\"/mesos/build\" -DBUILD_FLAGS=\"\" -DBUILD_JAVA_JVM_LIBRARY=\"\" -DHAS_AUTHENTICATION=1 -DHAVE_LIBZ -DLIBDIR=\"/usr/local/libmesos\" -DPICOJSON_USE_INT64 -DPKGDATADIR=\"/usr/local/share/mesos\" -DPKGLIBEXECDIR=\"/usr/local/libexec/mesos\" -DPKGMODULEDIR=\"\" -DSBINDIR=\"\" -DSOURCE_DIR=\"/mesos\" -DTESTLIBEXECDIR=\"\" -DUSE_CMAKE_BUILD_CONFIG -DUSE_STATIC_LIB -DVERSION=\"1.5.0\" -DZOOKEEPER_VERSION=\"3.4.8\" -D__STDC_FORMAT_MACROS -I/mesos/include -I/mesos/build/include -I/mesos/build/include/mesos -I/mesos/build/src -I/mesos/src -I/mesos/3rdparty/libprocess/src/../include -I/mesos/3rdparty/stout/include -isystem /usr/include/apr-1.0 -isystem /mesos/build/3rdparty/boost-1.53.0/src/boost-1.53.0 -isystem /mesos/build/3rdparty/elfio-3.2/src/elfio-3.2 -isystem /mesos/build/3rdparty/glog-0.3.3/src/glog-0.3.3-build/include -isystem /mesos/build/3rdparty/picojson-1.3.0/src/picojson-1.3.0 -isystem /mesos/build/3rdparty/protobuf-3.3.0/src/protobuf-3.3.0/src -isystem /usr/include/subversion-1 -isystem /mesos/build/3rdparty/http_parser-2.6.2/src/http_parser-2.6.2 -isystem /mesos/build/3rdparty/zookeeper-3.4.8/src/zookeeper-3.4.8/src/c/include -isystem /mesos/build/3rdparty/zookeeper-3.4.8/src/zookeeper-3.4.8/src/c/generated -isystem /mesos/build/3rdparty/nvml-352.79/src/nvml-352.79 -isystem /mesos/build/3rdparty/leveldb-1.19/src/leveldb-1.19/include -isystem /mesos/build/3rdparty/googletest-1.8.0/src/googletest-1.8.0/googlemock/include -isystem /mesos/build/3rdparty/googletest-1.8.0/src/googletest-1.8.0/googletest/include  -std=c++11 -Wformat-security -fstack-protector -fPIE   -o CMakeFiles/mesos-tests.dir/containerizer/containerizer_tests.cpp.o -c /mesos/src/tests/containerizer/containerizer_tests.cpp
[ 90%] Building CXX object src/tests/CMakeFiles/mesos-tests.dir/containerizer/docker_tests.cpp.o
cd /mesos/build/src/tests && /usr/bin/g++  -DBUILD_DIR=\"/mesos/build\" -DBUILD_FLAGS=\"\" -DBUILD_JAVA_JVM_LIBRARY=\"\" -DHAS_AUTHENTICATION=1 -DHAVE_LIBZ -DLIBDIR=\"/usr/local/libmesos\" -DPICOJSON_USE_INT64 -DPKGDATADIR=\"/usr/local/share/mesos\" -DPKGLIBEXECDIR=\"/usr/local/libexec/mesos\" -DPKGMODULEDIR=\"\" -DSBINDIR=\"\" -DSOURCE_DIR=\"/mesos\" -DTESTLIBEXECDIR=\"\" -DUSE_CMAKE_BUILD_CONFIG -DUSE_STATIC_LIB -DVERSION=\"1.5.0\" -DZOOKEEPER_VERSION=\"3.4.8\" -D__STDC_FORMAT_MACROS -I/mesos/include -I/mesos/build/include -I/mesos/build/include/mesos -I/mesos/build/src -I/mesos/src -I/mesos/3rdparty/libprocess/src/../include -I/mesos/3rdparty/stout/include -isystem /usr/include/apr-1.0 -isystem /mesos/build/3rdparty/boost-1.53.0/src/boost-1.53.0 -isystem /mesos/build/3rdparty/elfio-3.2/src/elfio-3.2 -isystem /mesos/build/3rdparty/glog-0.3.3/src/glog-0.3.3-build/include -isystem /mesos/build/3rdparty/picojson-1.3.0/src/picojson-1.3.0 -isystem /mesos/build/3rdparty/protobuf-3.3.0/src/protobuf-3.3.0/src -isystem /usr/include/subversion-1 -isystem /mesos/build/3rdparty/http_parser-2.6.2/src/http_parser-2.6.2 -isystem /mesos/build/3rdparty/zookeeper-3.4.8/src/zookeeper-3.4.8/src/c/include -isystem /mesos/build/3rdparty/zookeeper-3.4.8/src/zookeeper-3.4.8/src/c/generated -isystem /mesos/build/3rdparty/nvml-352.79/src/nvml-352.79 -isystem /mesos/build/3rdparty/leveldb-1.19/src/leveldb-1.19/include -isystem /mesos/build/3rdparty/googletest-1.8.0/src/googletest-1.8.0/googlemock/include -isystem /mesos/build/3rdparty/googletest-1.8.0/src/googletest-1.8.0/googletest/include  -std=c++11 -Wformat-security -fstack-protector -fPIE   -o CMakeFiles/mesos-tests.dir/containerizer/docker_tests.cpp.o -c /mesos/src/tests/containerizer/docker_tests.cpp
[ 90%] Building CXX object src/tests/CMakeFiles/mesos-tests.dir/authorization_tests.cpp.o
cd /mesos/build/src/tests && /usr/bin/g++  -DBUILD_DIR=\"/mesos/build\" -DBUILD_FLAGS=\"\" -DBUILD_JAVA_JVM_LIBRARY=\"\" -DHAS_AUTHENTICATION=1 -DHAVE_LIBZ -DLIBDIR=\"/usr/local/libmesos\" -DPICOJSON_USE_INT64 -DPKGDATADIR=\"/usr/local/share/mesos\" -DPKGLIBEXECDIR=\"/usr/local/libexec/mesos\" -DPKGMODULEDIR=\"\" -DSBINDIR=\"\" -DSOURCE_DIR=\"/mesos\" -DTESTLIBEXECDIR=\"\" -DUSE_CMAKE_BUILD_CONFIG -DUSE_STATIC_LIB -DVERSION=\"1.5.0\" -DZOOKEEPER_VERSION=\"3.4.8\" -D__STDC_FORMAT_MACROS -I/mesos/include -I/mesos/build/include -I/mesos/build/include/mesos -I/mesos/build/src -I/mesos/src -I/mesos/3rdparty/libprocess/src/../include -I/mesos/3rdparty/stout/include -isystem /usr/include/apr-1.0 -isystem /mesos/build/3rdparty/boost-1.53.0/src/boost-1.53.0 -isystem /mesos/build/3rdparty/elfio-3.2/src/elfio-3.2 -isystem /mesos/build/3rdparty/glog-0.3.3/src/glog-0.3.3-build/include -isystem /mesos/build/3rdparty/picojson-1.3.0/src/picojson-1.3.0 -isystem /mesos/build/3rdparty/protobuf-3.3.0/src/protobuf-3.3.0/src -isystem /usr/include/subversion-1 -isystem /mesos/build/3rdparty/http_parser-2.6.2/src/http_parser-2.6.2 -isystem /mesos/build/3rdparty/zookeeper-3.4.8/src/zookeeper-3.4.8/src/c/include -isystem /mesos/build/3rdparty/zookeeper-3.4.8/src/zookeeper-3.4.8/src/c/generated -isystem /mesos/build/3rdparty/nvml-352.79/src/nvml-352.79 -isystem /mesos/build/3rdparty/leveldb-1.19/src/leveldb-1.19/include -isystem /mesos/build/3rdparty/googletest-1.8.0/src/googletest-1.8.0/googlemock/include -isystem /mesos/build/3rdparty/googletest-1.8.0/src/googletest-1.8.0/googletest/include  -std=c++11 -Wformat-security -fstack-protector -fPIE   -o CMakeFiles/mesos-tests.dir/authorization_tests.cpp.o -c /mesos/src/tests/authorization_tests.cpp
[ 90%] Building CXX object src/tests/CMakeFiles/mesos-tests.dir/container_logger_tests.cpp.o
cd /mesos/build/src/tests && /usr/bin/g++  -DBUILD_DIR=\"/mesos/build\" -DBUILD_FLAGS=\"\" -DBUILD_JAVA_JVM_LIBRARY=\"\" -DHAS_AUTHENTICATION=1 -DHAVE_LIBZ -DLIBDIR=\"/usr/local/libmesos\" -DPICOJSON_USE_INT64 -DPKGDATADIR=\"/usr/local/share/mesos\" -DPKGLIBEXECDIR=\"/usr/local/libexec/mesos\" -DPKGMODULEDIR=\"\" -DSBINDIR=\"\" -DSOURCE_DIR=\"/mesos\" -DTESTLIBEXECDIR=\"\" -DUSE_CMAKE_BUILD_CONFIG -DUSE_STATIC_LIB -DVERSION=\"1.5.0\" -DZOOKEEPER_VERSION=\"3.4.8\" -D__STDC_FORMAT_MACROS -I/mesos/include -I/mesos/build/include -I/mesos/build/include/mesos -I/mesos/build/src -I/mesos/src -I/mesos/3rdparty/libprocess/src/../include -I/mesos/3rdparty/stout/include -isystem /usr/include/apr-1.0 -isystem /mesos/build/3rdparty/boost-1.53.0/src/boost-1.53.0 -isystem /mesos/build/3rdparty/elfio-3.2/src/elfio-3.2 -isystem /mesos/build/3rdparty/glog-0.3.3/src/glog-0.3.3-build/include -isystem /mesos/build/3rdparty/picojson-1.3.0/src/picojson-1.3.0 -isystem /mesos/build/3rdparty/protobuf-3.3.0/src/protobuf-3.3.0/src -isystem /usr/include/subversion-1 -isystem /mesos/build/3rdparty/http_parser-2.6.2/src/http_parser-2.6.2 -isystem /mesos/build/3rdparty/zookeeper-3.4.8/src/zookeeper-3.4.8/src/c/include -isystem /mesos/build/3rdparty/zookeeper-3.4.8/src/zookeeper-3.4.8/src/c/generated -isystem /mesos/build/3rdparty/nvml-352.79/src/nvml-352.79 -isystem /mesos/build/3rdparty/leveldb-1.19/src/leveldb-1.19/include -isystem /mesos/build/3rdparty/googletest-1.8.0/src/googletest-1.8.0/googlemock/include -isystem /mesos/build/3rdparty/googletest-1.8.0/src/googletest-1.8.0/googletest/include  -std=c++11 -Wformat-security -fstack-protector -fPIE   -o CMakeFiles/mesos-tests.dir/container_logger_tests.cpp.o -c /mesos/src/tests/container_logger_tests.cpp
[ 90%] Building CXX object src/tests/CMakeFiles/mesos-tests.dir/cram_md5_authentication_tests.cpp.o
cd /mesos/build/src/tests && /usr/bin/g++  -DBUILD_DIR=\"/mesos/build\" -DBUILD_FLAGS=\"\" -DBUILD_JAVA_JVM_LIBRARY=\"\" -DHAS_AUTHENTICATION=1 -DHAVE_LIBZ -DLIBDIR=\"/usr/local/libmesos\" -DPICOJSON_USE_INT64 -DPKGDATADIR=\"/usr/local/share/mesos\" -DPKGLIBEXECDIR=\"/usr/local/libexec/mesos\" -DPKGMODULEDIR=\"\" -DSBINDIR=\"\" -DSOURCE_DIR=\"/mesos\" -DTESTLIBEXECDIR=\"\" -DUSE_CMAKE_BUILD_CONFIG -DUSE_STATIC_LIB -DVERSION=\"1.5.0\" -DZOOKEEPER_VERSION=\"3.4.8\" -D__STDC_FORMAT_MACROS -I/mesos/include -I/mesos/build/include -I/mesos/build/include/mesos -I/mesos/build/src -I/mesos/src -I/mesos/3rdparty/libprocess/src/../include -I/mesos/3rdparty/stout/include -isystem /usr/include/apr-1.0 -isystem /mesos/build/3rdparty/boost-1.53.0/src/boost-1.53.0 -isystem /mesos/build/3rdparty/elfio-3.2/src/elfio-3.2 -isystem /mesos/build/3rdparty/glog-0.3.3/src/glog-0.3.3-build/include -isystem /mesos/build/3rdparty/picojson-1.3.0/src/picojson-1.3.0 -isystem /mesos/build/3rdparty/protobuf-3.3.0/src/protobuf-3.3.0/src -isystem /usr/include/subversion-1 -isystem /mesos/build/3rdparty/http_parser-2.6.2/src/http_parser-2.6.2 -isystem /mesos/build/3rdparty/zookeeper-3.4.8/src/zookeeper-3.4.8/src/c/include -isystem /mesos/build/3rdparty/zookeeper-3.4.8/src/zookeeper-3.4.8/src/c/generated -isystem /mesos/build/3rdparty/nvml-352.79/src/nvml-352.79 -isystem /mesos/build/3rdparty/leveldb-1.19/src/leveldb-1.19/include -isystem /mesos/build/3rdparty/googletest-1.8.0/src/googletest-1.8.0/googlemock/include -isystem /mesos/build/3rdparty/googletest-1.8.0/src/googletest-1.8.0/googletest/include  -std=c++11 -Wformat-security -fstack-protector -fPIE   -o CMakeFiles/mesos-tests.dir/cram_md5_authentication_tests.cpp.o -c /mesos/src/tests/cram_md5_authentication_tests.cpp
[ 91%] Building CXX object src/tests/CMakeFiles/mesos-tests.dir/disk_quota_tests.cpp.o
cd /mesos/build/src/tests && /usr/bin/g++  -DBUILD_DIR=\"/mesos/build\" -DBUILD_FLAGS=\"\" -DBUILD_JAVA_JVM_LIBRARY=\"\" -DHAS_AUTHENTICATION=1 -DHAVE_LIBZ -DLIBDIR=\"/usr/local/libmesos\" -DPICOJSON_USE_INT64 -DPKGDATADIR=\"/usr/local/share/mesos\" -DPKGLIBEXECDIR=\"/usr/local/libexec/mesos\" -DPKGMODULEDIR=\"\" -DSBINDIR=\"\" -DSOURCE_DIR=\"/mesos\" -DTESTLIBEXECDIR=\"\" -DUSE_CMAKE_BUILD_CONFIG -DUSE_STATIC_LIB -DVERSION=\"1.5.0\" -DZOOKEEPER_VERSION=\"3.4.8\" -D__STDC_FORMAT_MACROS -I/mesos/include -I/mesos/build/include -I/mesos/build/include/mesos -I/mesos/build/src -I/mesos/src -I/mesos/3rdparty/libprocess/src/../include -I/mesos/3rdparty/stout/include -isystem /usr/include/apr-1.0 -isystem /mesos/build/3rdparty/boost-1.53.0/src/boost-1.53.0 -isystem /mesos/build/3rdparty/elfio-3.2/src/elfio-3.2 -isystem /mesos/build/3rdparty/glog-0.3.3/src/glog-0.3.3-build/include -isystem /mesos/build/3rdparty/picojson-1.3.0/src/picojson-1.3.0 -isystem /mesos/build/3rdparty/protobuf-3.3.0/src/protobuf-3.3.0/src -isystem /usr/include/subversion-1 -isystem /mesos/build/3rdparty/http_parser-2.6.2/src/http_parser-2.6.2 -isystem /mesos/build/3rdparty/zookeeper-3.4.8/src/zookeeper-3.4.8/src/c/include -isystem /mesos/build/3rdparty/zookeeper-3.4.8/src/zookeeper-3.4.8/src/c/generated -isystem /mesos/build/3rdparty/nvml-352.79/src/nvml-352.79 -isystem /mesos/build/3rdparty/leveldb-1.19/src/leveldb-1.19/include -isystem /mesos/build/3rdparty/googletest-1.8.0/src/googletest-1.8.0/googlemock/include -isystem /mesos/build/3rdparty/googletest-1.8.0/src/googletest-1.8.0/googletest/include  -std=c++11 -Wformat-security -fstack-protector -fPIE   -o CMakeFiles/mesos-tests.dir/disk_quota_tests.cpp.o -c /mesos/src/tests/disk_quota_tests.cpp
[ 91%] Building CXX object src/tests/CMakeFiles/mesos-tests.dir/dynamic_weights_tests.cpp.o
cd /mesos/build/src/tests && /usr/bin/g++  -DBUILD_DIR=\"/mesos/build\" -DBUILD_FLAGS=\"\" -DBUILD_JAVA_JVM_LIBRARY=\"\" -DHAS_AUTHENTICATION=1 -DHAVE_LIBZ -DLIBDIR=\"/usr/local/libmesos\" -DPICOJSON_USE_INT64 -DPKGDATADIR=\"/usr/local/share/mesos\" -DPKGLIBEXECDIR=\"/usr/local/libexec/mesos\" -DPKGMODULEDIR=\"\" -DSBINDIR=\"\" -DSOURCE_DIR=\"/mesos\" -DTESTLIBEXECDIR=\"\" -DUSE_CMAKE_BUILD_CONFIG -DUSE_STATIC_LIB -DVERSION=\"1.5.0\" -DZOOKEEPER_VERSION=\"3.4.8\" -D__STDC_FORMAT_MACROS -I/mesos/include -I/mesos/build/include -I/mesos/build/include/mesos -I/mesos/build/src -I/mesos/src -I/mesos/3rdparty/libprocess/src/../include -I/mesos/3rdparty/stout/include -isystem /usr/include/apr-1.0 -isystem /mesos/build/3rdparty/boost-1.53.0/src/boost-1.53.0 -isystem /mesos/build/3rdparty/elfio-3.2/src/elfio-3.2 -isystem /mesos/build/3rdparty/glog-0.3.3/src/glog-0.3.3-build/include -isystem /mesos/build/3rdparty/picojson-1.3.0/src/picojson-1.3.0 -isystem /mesos/build/3rdparty/protobuf-3.3.0/src/protobuf-3.3.0/src -isystem /usr/include/subversion-1 -isystem /mesos/build/3rdparty/http_parser-2.6.2/src/http_parser-2.6.2 -isystem /mesos/build/3rdparty/zookeeper-3.4.8/src/zookeeper-3.4.8/src/c/include -isystem /mesos/build/3rdparty/zookeeper-3.4.8/src/zookeeper-3.4.8/src/c/generated -isystem /mesos/build/3rdparty/nvml-352.79/src/nvml-352.79 -isystem /mesos/build/3rdparty/leveldb-1.19/src/leveldb-1.19/include -isystem /mesos/build/3rdparty/googletest-1.8.0/src/googletest-1.8.0/googlemock/include -isystem /mesos/build/3rdparty/googletest-1.8.0/src/googletest-1.8.0/googletest/include  -std=c++11 -Wformat-security -fstack-protector -fPIE   -o CMakeFiles/mesos-tests.dir/dynamic_weights_tests.cpp.o -c /mesos/src/tests/dynamic_weights_tests.cpp
[ 91%] Building CXX object src/tests/CMakeFiles/mesos-tests.dir/examples_tests.cpp.o
cd /mesos/build/src/tests && /usr/bin/g++  -DBUILD_DIR=\"/mesos/build\" -DBUILD_FLAGS=\"\" -DBUILD_JAVA_JVM_LIBRARY=\"\" -DHAS_AUTHENTICATION=1 -DHAVE_LIBZ -DLIBDIR=\"/usr/local/libmesos\" -DPICOJSON_USE_INT64 -DPKGDATADIR=\"/usr/local/share/mesos\" -DPKGLIBEXECDIR=\"/usr/local/libexec/mesos\" -DPKGMODULEDIR=\"\" -DSBINDIR=\"\" -DSOURCE_DIR=\"/mesos\" -DTESTLIBEXECDIR=\"\" -DUSE_CMAKE_BUILD_CONFIG -DUSE_STATIC_LIB -DVERSION=\"1.5.0\" -DZOOKEEPER_VERSION=\"3.4.8\" -D__STDC_FORMAT_MACROS -I/mesos/include -I/mesos/build/include -I/mesos/build/include/mesos -I/mesos/build/src -I/mesos/src -I/mesos/3rdparty/libprocess/src/../include -I/mesos/3rdparty/stout/include -isystem /usr/include/apr-1.0 -isystem /mesos/build/3rdparty/boost-1.53.0/src/boost-1.53.0 -isystem /mesos/build/3rdparty/elfio-3.2/src/elfio-3.2 -isystem /mesos/build/3rdparty/glog-0.3.3/src/glog-0.3.3-build/include -isystem /mesos/build/3rdparty/picojson-1.3.0/src/picojson-1.3.0 -isystem /mesos/build/3rdparty/protobuf-3.3.0/src/protobuf-3.3.0/src -isystem /usr/include/subversion-1 -isystem /mesos/build/3rdparty/http_parser-2.6.2/src/http_parser-2.6.2 -isystem /mesos/build/3rdparty/zookeeper-3.4.8/src/zookeeper-3.4.8/src/c/include -isystem /mesos/build/3rdparty/zookeeper-3.4.8/src/zookeeper-3.4.8/src/c/generated -isystem /mesos/build/3rdparty/nvml-352.79/src/nvml-352.79 -isystem /mesos/build/3rdparty/leveldb-1.19/src/leveldb-1.19/include -isystem /mesos/build/3rdparty/googletest-1.8.0/src/googletest-1.8.0/googlemock/include -isystem /mesos/build/3rdparty/googletest-1.8.0/src/googletest-1.8.0/googletest/include  -std=c++11 -Wformat-security -fstack-protector -fPIE   -o CMakeFiles/mesos-tests.dir/examples_tests.cpp.o -c /mesos/src/tests/examples_tests.cpp
[ 91%] Building CXX object src/tests/CMakeFiles/mesos-tests.dir/fetcher_cache_tests.cpp.o
cd /mesos/build/src/tests && /usr/bin/g++  -DBUILD_DIR=\"/mesos/build\" -DBUILD_FLAGS=\"\" -DBUILD_JAVA_JVM_LIBRARY=\"\" -DHAS_AUTHENTICATION=1 -DHAVE_LIBZ -DLIBDIR=\"/usr/local/libmesos\" -DPICOJSON_USE_INT64 -DPKGDATADIR=\"/usr/local/share/mesos\" -DPKGLIBEXECDIR=\"/usr/local/libexec/mesos\" -DPKGMODULEDIR=\"\" -DSBINDIR=\"\" -DSOURCE_DIR=\"/mesos\" -DTESTLIBEXECDIR=\"\" -DUSE_CMAKE_BUILD_CONFIG -DUSE_STATIC_LIB -DVERSION=\"1.5.0\" -DZOOKEEPER_VERSION=\"3.4.8\" -D__STDC_FORMAT_MACROS -I/mesos/include -I/mesos/build/include -I/mesos/build/include/mesos -I/mesos/build/src -I/mesos/src -I/mesos/3rdparty/libprocess/src/../include -I/mesos/3rdparty/stout/include -isystem /usr/include/apr-1.0 -isystem /mesos/build/3rdparty/boost-1.53.0/src/boost-1.53.0 -isystem /mesos/build/3rdparty/elfio-3.2/src/elfio-3.2 -isystem /mesos/build/3rdparty/glog-0.3.3/src/glog-0.3.3-build/include -isystem /mesos/build/3rdparty/picojson-1.3.0/src/picojson-1.3.0 -isystem /mesos/build/3rdparty/protobuf-3.3.0/src/protobuf-3.3.0/src -isystem /usr/include/subversion-1 -isystem /mesos/build/3rdparty/http_parser-2.6.2/src/http_parser-2.6.2 -isystem /mesos/build/3rdparty/zookeeper-3.4.8/src/zookeeper-3.4.8/src/c/include -isystem /mesos/build/3rdparty/zookeeper-3.4.8/src/zookeeper-3.4.8/src/c/generated -isystem /mesos/build/3rdparty/nvml-352.79/src/nvml-352.79 -isystem /mesos/build/3rdparty/leveldb-1.19/src/leveldb-1.19/include -isystem /mesos/build/3rdparty/googletest-1.8.0/src/googletest-1.8.0/googlemock/include -isystem /mesos/build/3rdparty/googletest-1.8.0/src/googletest-1.8.0/googletest/include  -std=c++11 -Wformat-security -fstack-protector -fPIE   -o CMakeFiles/mesos-tests.dir/fetcher_cache_tests.cpp.o -c /mesos/src/tests/fetcher_cache_tests.cpp
[ 91%] Building CXX object src/tests/CMakeFiles/mesos-tests.dir/hdfs_tests.cpp.o
cd /mesos/build/src/tests && /usr/bin/g++  -DBUILD_DIR=\"/mesos/build\" -DBUILD_FLAGS=\"\" -DBUILD_JAVA_JVM_LIBRARY=\"\" -DHAS_AUTHENTICATION=1 -DHAVE_LIBZ -DLIBDIR=\"/usr/local/libmesos\" -DPICOJSON_USE_INT64 -DPKGDATADIR=\"/usr/local/share/mesos\" -DPKGLIBEXECDIR=\"/usr/local/libexec/mesos\" -DPKGMODULEDIR=\"\" -DSBINDIR=\"\" -DSOURCE_DIR=\"/mesos\" -DTESTLIBEXECDIR=\"\" -DUSE_CMAKE_BUILD_CONFIG -DUSE_STATIC_LIB -DVERSION=\"1.5.0\" -DZOOKEEPER_VERSION=\"3.4.8\" -D__STDC_FORMAT_MACROS -I/mesos/include -I/mesos/build/include -I/mesos/build/include/mesos -I/mesos/build/src -I/mesos/src -I/mesos/3rdparty/libprocess/src/../include -I/mesos/3rdparty/stout/include -isystem /usr/include/apr-1.0 -isystem /mesos/build/3rdparty/boost-1.53.0/src/boost-1.53.0 -isystem /mesos/build/3rdparty/elfio-3.2/src/elfio-3.2 -isystem /mesos/build/3rdparty/glog-0.3.3/src/glog-0.3.3-build/include -isystem /mesos/build/3rdparty/picojson-1.3.0/src/picojson-1.3.0 -isystem /mesos/build/3rdparty/protobuf-3.3.0/src/protobuf-3.3.0/src -isystem /usr/include/subversion-1 -isystem /mesos/build/3rdparty/http_parser-2.6.2/src/http_parser-2.6.2 -isystem /mesos/build/3rdparty/zookeeper-3.4.8/src/zookeeper-3.4.8/src/c/include -isystem /mesos/build/3rdparty/zookeeper-3.4.8/src/zookeeper-3.4.8/src/c/generated -isystem /mesos/build/3rdparty/nvml-352.79/src/nvml-352.79 -isystem /mesos/build/3rdparty/leveldb-1.19/src/leveldb-1.19/include -isystem /mesos/build/3rdparty/googletest-1.8.0/src/googletest-1.8.0/googlemock/include -isystem /mesos/build/3rdparty/googletest-1.8.0/src/googletest-1.8.0/googletest/include  -std=c++11 -Wformat-security -fstack-protector -fPIE   -o CMakeFiles/mesos-tests.dir/hdfs_tests.cpp.o -c /mesos/src/tests/hdfs_tests.cpp
[ 91%] Building CXX object src/tests/CMakeFiles/mesos-tests.dir/log_tests.cpp.o
cd /mesos/build/src/tests && /usr/bin/g++  -DBUILD_DIR=\"/mesos/build\" -DBUILD_FLAGS=\"\" -DBUILD_JAVA_JVM_LIBRARY=\"\" -DHAS_AUTHENTICATION=1 -DHAVE_LIBZ -DLIBDIR=\"/usr/local/libmesos\" -DPICOJSON_USE_INT64 -DPKGDATADIR=\"/usr/local/share/mesos\" -DPKGLIBEXECDIR=\"/usr/local/libexec/mesos\" -DPKGMODULEDIR=\"\" -DSBINDIR=\"\" -DSOURCE_DIR=\"/mesos\" -DTESTLIBEXECDIR=\"\" -DUSE_CMAKE_BUILD_CONFIG -DUSE_STATIC_LIB -DVERSION=\"1.5.0\" -DZOOKEEPER_VERSION=\"3.4.8\" -D__STDC_FORMAT_MACROS -I/mesos/include -I/mesos/build/include -I/mesos/build/include/mesos -I/mesos/build/src -I/mesos/src -I/mesos/3rdparty/libprocess/src/../include -I/mesos/3rdparty/stout/include -isystem /usr/include/apr-1.0 -isystem /mesos/build/3rdparty/boost-1.53.0/src/boost-1.53.0 -isystem /mesos/build/3rdparty/elfio-3.2/src/elfio-3.2 -isystem /mesos/build/3rdparty/glog-0.3.3/src/glog-0.3.3-build/include -isystem /mesos/build/3rdparty/picojson-1.3.0/src/picojson-1.3.0 -isystem /mesos/build/3rdparty/protobuf-3.3.0/src/protobuf-3.3.0/src -isystem /usr/include/subversion-1 -isystem /mesos/build/3rdparty/http_parser-2.6.2/src/http_parser-2.6.2 -isystem /mesos/build/3rdparty/zookeeper-3.4.8/src/zookeeper-3.4.8/src/c/include -isystem /mesos/build/3rdparty/zookeeper-3.4.8/src/zookeeper-3.4.8/src/c/generated -isystem /mesos/build/3rdparty/nvml-352.79/src/nvml-352.79 -isystem /mesos/build/3rdparty/leveldb-1.19/src/leveldb-1.19/include -isystem /mesos/build/3rdparty/googletest-1.8.0/src/googletest-1.8.0/googlemock/include -isystem /mesos/build/3rdparty/googletest-1.8.0/src/googletest-1.8.0/googletest/include  -std=c++11 -Wformat-security -fstack-protector -fPIE   -o CMakeFiles/mesos-tests.dir/log_tests.cpp.o -c /mesos/src/tests/log_tests.cpp
[ 91%] Building CXX object src/tests/CMakeFiles/mesos-tests.dir/logging_tests.cpp.o
cd /mesos/build/src/tests && /usr/bin/g++  -DBUILD_DIR=\"/mesos/build\" -DBUILD_FLAGS=\"\" -DBUILD_JAVA_JVM_LIBRARY=\"\" -DHAS_AUTHENTICATION=1 -DHAVE_LIBZ -DLIBDIR=\"/usr/local/libmesos\" -DPICOJSON_USE_INT64 -DPKGDATADIR=\"/usr/local/share/mesos\" -DPKGLIBEXECDIR=\"/usr/local/libexec/mesos\" -DPKGMODULEDIR=\"\" -DSBINDIR=\"\" -DSOURCE_DIR=\"/mesos\" -DTESTLIBEXECDIR=\"\" -DUSE_CMAKE_BUILD_CONFIG -DUSE_STATIC_LIB -DVERSION=\"1.5.0\" -DZOOKEEPER_VERSION=\"3.4.8\" -D__STDC_FORMAT_MACROS -I/mesos/include -I/mesos/build/include -I/mesos/build/include/mesos -I/mesos/build/src -I/mesos/src -I/mesos/3rdparty/libprocess/src/../include -I/mesos/3rdparty/stout/include -isystem /usr/include/apr-1.0 -isystem /mesos/build/3rdparty/boost-1.53.0/src/boost-1.53.0 -isystem /mesos/build/3rdparty/elfio-3.2/src/elfio-3.2 -isystem /mesos/build/3rdparty/glog-0.3.3/src/glog-0.3.3-build/include -isystem /mesos/build/3rdparty/picojson-1.3.0/src/picojson-1.3.0 -isystem /mesos/build/3rdparty/protobuf-3.3.0/src/protobuf-3.3.0/src -isystem /usr/include/subversion-1 -isystem /mesos/build/3rdparty/http_parser-2.6.2/src/http_parser-2.6.2 -isystem /mesos/build/3rdparty/zookeeper-3.4.8/src/zookeeper-3.4.8/src/c/include -isystem /mesos/build/3rdparty/zookeeper-3.4.8/src/zookeeper-3.4.8/src/c/generated -isystem /mesos/build/3rdparty/nvml-352.79/src/nvml-352.79 -isystem /mesos/build/3rdparty/leveldb-1.19/src/leveldb-1.19/include -isystem /mesos/build/3rdparty/googletest-1.8.0/src/googletest-1.8.0/googlemock/include -isystem /mesos/build/3rdparty/googletest-1.8.0/src/googletest-1.8.0/googletest/include  -std=c++11 -Wformat-security -fstack-protector -fPIE   -o CMakeFiles/mesos-tests.dir/logging_tests.cpp.o -c /mesos/src/tests/logging_tests.cpp
[ 92%] Building CXX object src/tests/CMakeFiles/mesos-tests.dir/master_allocator_tests.cpp.o
cd /mesos/build/src/tests && /usr/bin/g++  -DBUILD_DIR=\"/mesos/build\" -DBUILD_FLAGS=\"\" -DBUILD_JAVA_JVM_LIBRARY=\"\" -DHAS_AUTHENTICATION=1 -DHAVE_LIBZ -DLIBDIR=\"/usr/local/libmesos\" -DPICOJSON_USE_INT64 -DPKGDATADIR=\"/usr/local/share/mesos\" -DPKGLIBEXECDIR=\"/usr/local/libexec/mesos\" -DPKGMODULEDIR=\"\" -DSBINDIR=\"\" -DSOURCE_DIR=\"/mesos\" -DTESTLIBEXECDIR=\"\" -DUSE_CMAKE_BUILD_CONFIG -DUSE_STATIC_LIB -DVERSION=\"1.5.0\" -DZOOKEEPER_VERSION=\"3.4.8\" -D__STDC_FORMAT_MACROS -I/mesos/include -I/mesos/build/include -I/mesos/build/include/mesos -I/mesos/build/src -I/mesos/src -I/mesos/3rdparty/libprocess/src/../include -I/mesos/3rdparty/stout/include -isystem /usr/include/apr-1.0 -isystem /mesos/build/3rdparty/boost-1.53.0/src/boost-1.53.0 -isystem /mesos/build/3rdparty/elfio-3.2/src/elfio-3.2 -isystem /mesos/build/3rdparty/glog-0.3.3/src/glog-0.3.3-build/include -isystem /mesos/build/3rdparty/picojson-1.3.0/src/picojson-1.3.0 -isystem /mesos/build/3rdparty/protobuf-3.3.0/src/protobuf-3.3.0/src -isystem /usr/include/subversion-1 -isystem /mesos/build/3rdparty/http_parser-2.6.2/src/http_parser-2.6.2 -isystem /mesos/build/3rdparty/zookeeper-3.4.8/src/zookeeper-3.4.8/src/c/include -isystem /mesos/build/3rdparty/zookeeper-3.4.8/src/zookeeper-3.4.8/src/c/generated -isystem /mesos/build/3rdparty/nvml-352.79/src/nvml-352.79 -isystem /mesos/build/3rdparty/leveldb-1.19/src/leveldb-1.19/include -isystem /mesos/build/3rdparty/googletest-1.8.0/src/googletest-1.8.0/googlemock/include -isystem /mesos/build/3rdparty/googletest-1.8.0/src/googletest-1.8.0/googletest/include  -std=c++11 -Wformat-security -fstack-protector -fPIE   -o CMakeFiles/mesos-tests.dir/master_allocator_tests.cpp.o -c /mesos/src/tests/master_allocator_tests.cpp
[ 92%] Building CXX object src/tests/CMakeFiles/mesos-tests.dir/master_authorization_tests.cpp.o
cd /mesos/build/src/tests && /usr/bin/g++  -DBUILD_DIR=\"/mesos/build\" -DBUILD_FLAGS=\"\" -DBUILD_JAVA_JVM_LIBRARY=\"\" -DHAS_AUTHENTICATION=1 -DHAVE_LIBZ -DLIBDIR=\"/usr/local/libmesos\" -DPICOJSON_USE_INT64 -DPKGDATADIR=\"/usr/local/share/mesos\" -DPKGLIBEXECDIR=\"/usr/local/libexec/mesos\" -DPKGMODULEDIR=\"\" -DSBINDIR=\"\" -DSOURCE_DIR=\"/mesos\" -DTESTLIBEXECDIR=\"\" -DUSE_CMAKE_BUILD_CONFIG -DUSE_STATIC_LIB -DVERSION=\"1.5.0\" -DZOOKEEPER_VERSION=\"3.4.8\" -D__STDC_FORMAT_MACROS -I/mesos/include -I/mesos/build/include -I/mesos/build/include/mesos -I/mesos/build/src -I/mesos/src -I/mesos/3rdparty/libprocess/src/../include -I/mesos/3rdparty/stout/include -isystem /usr/include/apr-1.0 -isystem /mesos/build/3rdparty/boost-1.53.0/src/boost-1.53.0 -isystem /mesos/build/3rdparty/elfio-3.2/src/elfio-3.2 -isystem /mesos/build/3rdparty/glog-0.3.3/src/glog-0.3.3-build/include -isystem /mesos/build/3rdparty/picojson-1.3.0/src/picojson-1.3.0 -isystem /mesos/build/3rdparty/protobuf-3.3.0/src/protobuf-3.3.0/src -isystem /usr/include/subversion-1 -isystem /mesos/build/3rdparty/http_parser-2.6.2/src/http_parser-2.6.2 -isystem /mesos/build/3rdparty/zookeeper-3.4.8/src/zookeeper-3.4.8/src/c/include -isystem /mesos/build/3rdparty/zookeeper-3.4.8/src/zookeeper-3.4.8/src/c/generated -isystem /mesos/build/3rdparty/nvml-352.79/src/nvml-352.79 -isystem /mesos/build/3rdparty/leveldb-1.19/src/leveldb-1.19/include -isystem /mesos/build/3rdparty/googletest-1.8.0/src/googletest-1.8.0/googlemock/include -isystem /mesos/build/3rdparty/googletest-1.8.0/src/googletest-1.8.0/googletest/include  -std=c++11 -Wformat-security -fstack-protector -fPIE   -o CMakeFiles/mesos-tests.dir/master_authorization_tests.cpp.o -c /mesos/src/tests/master_authorization_tests.cpp
[ 92%] Building CXX object src/tests/CMakeFiles/mesos-tests.dir/master_contender_detector_tests.cpp.o
cd /mesos/build/src/tests && /usr/bin/g++  -DBUILD_DIR=\"/mesos/build\" -DBUILD_FLAGS=\"\" -DBUILD_JAVA_JVM_LIBRARY=\"\" -DHAS_AUTHENTICATION=1 -DHAVE_LIBZ -DLIBDIR=\"/usr/local/libmesos\" -DPICOJSON_USE_INT64 -DPKGDATADIR=\"/usr/local/share/mesos\" -DPKGLIBEXECDIR=\"/usr/local/libexec/mesos\" -DPKGMODULEDIR=\"\" -DSBINDIR=\"\" -DSOURCE_DIR=\"/mesos\" -DTESTLIBEXECDIR=\"\" -DUSE_CMAKE_BUILD_CONFIG -DUSE_STATIC_LIB -DVERSION=\"1.5.0\" -DZOOKEEPER_VERSION=\"3.4.8\" -D__STDC_FORMAT_MACROS -I/mesos/include -I/mesos/build/include -I/mesos/build/include/mesos -I/mesos/build/src -I/mesos/src -I/mesos/3rdparty/libprocess/src/../include -I/mesos/3rdparty/stout/include -isystem /usr/include/apr-1.0 -isystem /mesos/build/3rdparty/boost-1.53.0/src/boost-1.53.0 -isystem /mesos/build/3rdparty/elfio-3.2/src/elfio-3.2 -isystem /mesos/build/3rdparty/glog-0.3.3/src/glog-0.3.3-build/include -isystem /mesos/build/3rdparty/picojson-1.3.0/src/picojson-1.3.0 -isystem /mesos/build/3rdparty/protobuf-3.3.0/src/protobuf-3.3.0/src -isystem /usr/include/subversion-1 -isystem /mesos/build/3rdparty/http_parser-2.6.2/src/http_parser-2.6.2 -isystem /mesos/build/3rdparty/zookeeper-3.4.8/src/zookeeper-3.4.8/src/c/include -isystem /mesos/build/3rdparty/zookeeper-3.4.8/src/zookeeper-3.4.8/src/c/generated -isystem /mesos/build/3rdparty/nvml-352.79/src/nvml-352.79 -isystem /mesos/build/3rdparty/leveldb-1.19/src/leveldb-1.19/include -isystem /mesos/build/3rdparty/googletest-1.8.0/src/googletest-1.8.0/googlemock/include -isystem /mesos/build/3rdparty/googletest-1.8.0/src/googletest-1.8.0/googletest/include  -std=c++11 -Wformat-security -fstack-protector -fPIE   -o CMakeFiles/mesos-tests.dir/master_contender_detector_tests.cpp.o -c /mesos/src/tests/master_contender_detector_tests.cpp
[ 92%] Building CXX object src/tests/CMakeFiles/mesos-tests.dir/master_quota_tests.cpp.o
cd /mesos/build/src/tests && /usr/bin/g++  -DBUILD_DIR=\"/mesos/build\" -DBUILD_FLAGS=\"\" -DBUILD_JAVA_JVM_LIBRARY=\"\" -DHAS_AUTHENTICATION=1 -DHAVE_LIBZ -DLIBDIR=\"/usr/local/libmesos\" -DPICOJSON_USE_INT64 -DPKGDATADIR=\"/usr/local/share/mesos\" -DPKGLIBEXECDIR=\"/usr/local/libexec/mesos\" -DPKGMODULEDIR=\"\" -DSBINDIR=\"\" -DSOURCE_DIR=\"/mesos\" -DTESTLIBEXECDIR=\"\" -DUSE_CMAKE_BUILD_CONFIG -DUSE_STATIC_LIB -DVERSION=\"1.5.0\" -DZOOKEEPER_VERSION=\"3.4.8\" -D__STDC_FORMAT_MACROS -I/mesos/include -I/mesos/build/include -I/mesos/build/include/mesos -I/mesos/build/src -I/mesos/src -I/mesos/3rdparty/libprocess/src/../include -I/mesos/3rdparty/stout/include -isystem /usr/include/apr-1.0 -isystem /mesos/build/3rdparty/boost-1.53.0/src/boost-1.53.0 -isystem /mesos/build/3rdparty/elfio-3.2/src/elfio-3.2 -isystem /mesos/build/3rdparty/glog-0.3.3/src/glog-0.3.3-build/include -isystem /mesos/build/3rdparty/picojson-1.3.0/src/picojson-1.3.0 -isystem /mesos/build/3rdparty/protobuf-3.3.0/src/protobuf-3.3.0/src -isystem /usr/include/subversion-1 -isystem /mesos/build/3rdparty/http_parser-2.6.2/src/http_parser-2.6.2 -isystem /mesos/build/3rdparty/zookeeper-3.4.8/src/zookeeper-3.4.8/src/c/include -isystem /mesos/build/3rdparty/zookeeper-3.4.8/src/zookeeper-3.4.8/src/c/generated -isystem /mesos/build/3rdparty/nvml-352.79/src/nvml-352.79 -isystem /mesos/build/3rdparty/leveldb-1.19/src/leveldb-1.19/include -isystem /mesos/build/3rdparty/googletest-1.8.0/src/googletest-1.8.0/googlemock/include -isystem /mesos/build/3rdparty/googletest-1.8.0/src/googletest-1.8.0/googletest/include  -std=c++11 -Wformat-security -fstack-protector -fPIE   -o CMakeFiles/mesos-tests.dir/master_quota_tests.cpp.o -c /mesos/src/tests/master_quota_tests.cpp
[ 92%] Building CXX object src/tests/CMakeFiles/mesos-tests.dir/master_tests.cpp.o
cd /mesos/build/src/tests && /usr/bin/g++  -DBUILD_DIR=\"/mesos/build\" -DBUILD_FLAGS=\"\" -DBUILD_JAVA_JVM_LIBRARY=\"\" -DHAS_AUTHENTICATION=1 -DHAVE_LIBZ -DLIBDIR=\"/usr/local/libmesos\" -DPICOJSON_USE_INT64 -DPKGDATADIR=\"/usr/local/share/mesos\" -DPKGLIBEXECDIR=\"/usr/local/libexec/mesos\" -DPKGMODULEDIR=\"\" -DSBINDIR=\"\" -DSOURCE_DIR=\"/mesos\" -DTESTLIBEXECDIR=\"\" -DUSE_CMAKE_BUILD_CONFIG -DUSE_STATIC_LIB -DVERSION=\"1.5.0\" -DZOOKEEPER_VERSION=\"3.4.8\" -D__STDC_FORMAT_MACROS -I/mesos/include -I/mesos/build/include -I/mesos/build/include/mesos -I/mesos/build/src -I/mesos/src -I/mesos/3rdparty/libprocess/src/../include -I/mesos/3rdparty/stout/include -isystem /usr/include/apr-1.0 -isystem /mesos/build/3rdparty/boost-1.53.0/src/boost-1.53.0 -isystem /mesos/build/3rdparty/elfio-3.2/src/elfio-3.2 -isystem /mesos/build/3rdparty/glog-0.3.3/src/glog-0.3.3-build/include -isystem /mesos/build/3rdparty/picojson-1.3.0/src/picojson-1.3.0 -isystem /mesos/build/3rdparty/protobuf-3.3.0/src/protobuf-3.3.0/src -isystem /usr/include/subversion-1 -isystem /mesos/build/3rdparty/http_parser-2.6.2/src/http_parser-2.6.2 -isystem /mesos/build/3rdparty/zookeeper-3.4.8/src/zookeeper-3.4.8/src/c/include -isystem /mesos/build/3rdparty/zookeeper-3.4.8/src/zookeeper-3.4.8/src/c/generated -isystem /mesos/build/3rdparty/nvml-352.79/src/nvml-352.79 -isystem /mesos/build/3rdparty/leveldb-1.19/src/leveldb-1.19/include -isystem /mesos/build/3rdparty/googletest-1.8.0/src/googletest-1.8.0/googlemock/include -isystem /mesos/build/3rdparty/googletest-1.8.0/src/googletest-1.8.0/googletest/include  -std=c++11 -Wformat-security -fstack-protector -fPIE   -o CMakeFiles/mesos-tests.dir/master_tests.cpp.o -c /mesos/src/tests/master_tests.cpp
[ 92%] Building CXX object src/tests/CMakeFiles/mesos-tests.dir/master_validation_tests.cpp.o
cd /mesos/build/src/tests && /usr/bin/g++  -DBUILD_DIR=\"/mesos/build\" -DBUILD_FLAGS=\"\" -DBUILD_JAVA_JVM_LIBRARY=\"\" -DHAS_AUTHENTICATION=1 -DHAVE_LIBZ -DLIBDIR=\"/usr/local/libmesos\" -DPICOJSON_USE_INT64 -DPKGDATADIR=\"/usr/local/share/mesos\" -DPKGLIBEXECDIR=\"/usr/local/libexec/mesos\" -DPKGMODULEDIR=\"\" -DSBINDIR=\"\" -DSOURCE_DIR=\"/mesos\" -DTESTLIBEXECDIR=\"\" -DUSE_CMAKE_BUILD_CONFIG -DUSE_STATIC_LIB -DVERSION=\"1.5.0\" -DZOOKEEPER_VERSION=\"3.4.8\" -D__STDC_FORMAT_MACROS -I/mesos/include -I/mesos/build/include -I/mesos/build/include/mesos -I/mesos/build/src -I/mesos/src -I/mesos/3rdparty/libprocess/src/../include -I/mesos/3rdparty/stout/include -isystem /usr/include/apr-1.0 -isystem /mesos/build/3rdparty/boost-1.53.0/src/boost-1.53.0 -isystem /mesos/build/3rdparty/elfio-3.2/src/elfio-3.2 -isystem /mesos/build/3rdparty/glog-0.3.3/src/glog-0.3.3-build/include -isystem /mesos/build/3rdparty/picojson-1.3.0/src/picojson-1.3.0 -isystem /mesos/build/3rdparty/protobuf-3.3.0/src/protobuf-3.3.0/src -isystem /usr/include/subversion-1 -isystem /mesos/build/3rdparty/http_parser-2.6.2/src/http_parser-2.6.2 -isystem /mesos/build/3rdparty/zookeeper-3.4.8/src/zookeeper-3.4.8/src/c/include -isystem /mesos/build/3rdparty/zookeeper-3.4.8/src/zookeeper-3.4.8/src/c/generated -isystem /mesos/build/3rdparty/nvml-352.79/src/nvml-352.79 -isystem /mesos/build/3rdparty/leveldb-1.19/src/leveldb-1.19/include -isystem /mesos/build/3rdparty/googletest-1.8.0/src/googletest-1.8.0/googlemock/include -isystem /mesos/build/3rdparty/googletest-1.8.0/src/googletest-1.8.0/googletest/include  -std=c++11 -Wformat-security -fstack-protector -fPIE   -o CMakeFiles/mesos-tests.dir/master_validation_tests.cpp.o -c /mesos/src/tests/master_validation_tests.cpp
[ 92%] Building CXX object src/tests/CMakeFiles/mesos-tests.dir/metrics_tests.cpp.o
cd /mesos/build/src/tests && /usr/bin/g++  -DBUILD_DIR=\"/mesos/build\" -DBUILD_FLAGS=\"\" -DBUILD_JAVA_JVM_LIBRARY=\"\" -DHAS_AUTHENTICATION=1 -DHAVE_LIBZ -DLIBDIR=\"/usr/local/libmesos\" -DPICOJSON_USE_INT64 -DPKGDATADIR=\"/usr/local/share/mesos\" -DPKGLIBEXECDIR=\"/usr/local/libexec/mesos\" -DPKGMODULEDIR=\"\" -DSBINDIR=\"\" -DSOURCE_DIR=\"/mesos\" -DTESTLIBEXECDIR=\"\" -DUSE_CMAKE_BUILD_CONFIG -DUSE_STATIC_LIB -DVERSION=\"1.5.0\" -DZOOKEEPER_VERSION=\"3.4.8\" -D__STDC_FORMAT_MACROS -I/mesos/include -I/mesos/build/include -I/mesos/build/include/mesos -I/mesos/build/src -I/mesos/src -I/mesos/3rdparty/libprocess/src/../include -I/mesos/3rdparty/stout/include -isystem /usr/include/apr-1.0 -isystem /mesos/build/3rdparty/boost-1.53.0/src/boost-1.53.0 -isystem /mesos/build/3rdparty/elfio-3.2/src/elfio-3.2 -isystem /mesos/build/3rdparty/glog-0.3.3/src/glog-0.3.3-build/include -isystem /mesos/build/3rdparty/picojson-1.3.0/src/picojson-1.3.0 -isystem /mesos/build/3rdparty/protobuf-3.3.0/src/protobuf-3.3.0/src -isystem /usr/include/subversion-1 -isystem /mesos/build/3rdparty/http_parser-2.6.2/src/http_parser-2.6.2 -isystem /mesos/build/3rdparty/zookeeper-3.4.8/src/zookeeper-3.4.8/src/c/include -isystem /mesos/build/3rdparty/zookeeper-3.4.8/src/zookeeper-3.4.8/src/c/generated -isystem /mesos/build/3rdparty/nvml-352.79/src/nvml-352.79 -isystem /mesos/build/3rdparty/leveldb-1.19/src/leveldb-1.19/include -isystem /mesos/build/3rdparty/googletest-1.8.0/src/googletest-1.8.0/googlemock/include -isystem /mesos/build/3rdparty/googletest-1.8.0/src/googletest-1.8.0/googletest/include  -std=c++11 -Wformat-security -fstack-protector -fPIE   -o CMakeFiles/mesos-tests.dir/metrics_tests.cpp.o -c /mesos/src/tests/metrics_tests.cpp
[ 92%] Building CXX object src/tests/CMakeFiles/mesos-tests.dir/module_tests.cpp.o
cd /mesos/build/src/tests && /usr/bin/g++  -DBUILD_DIR=\"/mesos/build\" -DBUILD_FLAGS=\"\" -DBUILD_JAVA_JVM_LIBRARY=\"\" -DHAS_AUTHENTICATION=1 -DHAVE_LIBZ -DLIBDIR=\"/usr/local/libmesos\" -DPICOJSON_USE_INT64 -DPKGDATADIR=\"/usr/local/share/mesos\" -DPKGLIBEXECDIR=\"/usr/local/libexec/mesos\" -DPKGMODULEDIR=\"\" -DSBINDIR=\"\" -DSOURCE_DIR=\"/mesos\" -DTESTLIBEXECDIR=\"\" -DUSE_CMAKE_BUILD_CONFIG -DUSE_STATIC_LIB -DVERSION=\"1.5.0\" -DZOOKEEPER_VERSION=\"3.4.8\" -D__STDC_FORMAT_MACROS -I/mesos/include -I/mesos/build/include -I/mesos/build/include/mesos -I/mesos/build/src -I/mesos/src -I/mesos/3rdparty/libprocess/src/../include -I/mesos/3rdparty/stout/include -isystem /usr/include/apr-1.0 -isystem /mesos/build/3rdparty/boost-1.53.0/src/boost-1.53.0 -isystem /mesos/build/3rdparty/elfio-3.2/src/elfio-3.2 -isystem /mesos/build/3rdparty/glog-0.3.3/src/glog-0.3.3-build/include -isystem /mesos/build/3rdparty/picojson-1.3.0/src/picojson-1.3.0 -isystem /mesos/build/3rdparty/protobuf-3.3.0/src/protobuf-3.3.0/src -isystem /usr/include/subversion-1 -isystem /mesos/build/3rdparty/http_parser-2.6.2/src/http_parser-2.6.2 -isystem /mesos/build/3rdparty/zookeeper-3.4.8/src/zookeeper-3.4.8/src/c/include -isystem /mesos/build/3rdparty/zookeeper-3.4.8/src/zookeeper-3.4.8/src/c/generated -isystem /mesos/build/3rdparty/nvml-352.79/src/nvml-352.79 -isystem /mesos/build/3rdparty/leveldb-1.19/src/leveldb-1.19/include -isystem /mesos/build/3rdparty/googletest-1.8.0/src/googletest-1.8.0/googlemock/include -isystem /mesos/build/3rdparty/googletest-1.8.0/src/googletest-1.8.0/googletest/include  -std=c++11 -Wformat-security -fstack-protector -fPIE   -o CMakeFiles/mesos-tests.dir/module_tests.cpp.o -c /mesos/src/tests/module_tests.cpp
[ 93%] Building CXX object src/tests/CMakeFiles/mesos-tests.dir/oversubscription_tests.cpp.o
cd /mesos/build/src/tests && /usr/bin/g++  -DBUILD_DIR=\"/mesos/build\" -DBUILD_FLAGS=\"\" -DBUILD_JAVA_JVM_LIBRARY=\"\" -DHAS_AUTHENTICATION=1 -DHAVE_LIBZ -DLIBDIR=\"/usr/local/libmesos\" -DPICOJSON_USE_INT64 -DPKGDATADIR=\"/usr/local/share/mesos\" -DPKGLIBEXECDIR=\"/usr/local/libexec/mesos\" -DPKGMODULEDIR=\"\" -DSBINDIR=\"\" -DSOURCE_DIR=\"/mesos\" -DTESTLIBEXECDIR=\"\" -DUSE_CMAKE_BUILD_CONFIG -DUSE_STATIC_LIB -DVERSION=\"1.5.0\" -DZOOKEEPER_VERSION=\"3.4.8\" -D__STDC_FORMAT_MACROS -I/mesos/include -I/mesos/build/include -I/mesos/build/include/mesos -I/mesos/build/src -I/mesos/src -I/mesos/3rdparty/libprocess/src/../include -I/mesos/3rdparty/stout/include -isystem /usr/include/apr-1.0 -isystem /mesos/build/3rdparty/boost-1.53.0/src/boost-1.53.0 -isystem /mesos/build/3rdparty/elfio-3.2/src/elfio-3.2 -isystem /mesos/build/3rdparty/glog-0.3.3/src/glog-0.3.3-build/include -isystem /mesos/build/3rdparty/picojson-1.3.0/src/picojson-1.3.0 -isystem /mesos/build/3rdparty/protobuf-3.3.0/src/protobuf-3.3.0/src -isystem /usr/include/subversion-1 -isystem /mesos/build/3rdparty/http_parser-2.6.2/src/http_parser-2.6.2 -isystem /mesos/build/3rdparty/zookeeper-3.4.8/src/zookeeper-3.4.8/src/c/include -isystem /mesos/build/3rdparty/zookeeper-3.4.8/src/zookeeper-3.4.8/src/c/generated -isystem /mesos/build/3rdparty/nvml-352.79/src/nvml-352.79 -isystem /mesos/build/3rdparty/leveldb-1.19/src/leveldb-1.19/include -isystem /mesos/build/3rdparty/googletest-1.8.0/src/googletest-1.8.0/googlemock/include -isystem /mesos/build/3rdparty/googletest-1.8.0/src/googletest-1.8.0/googletest/include  -std=c++11 -Wformat-security -fstack-protector -fPIE   -o CMakeFiles/mesos-tests.dir/oversubscription_tests.cpp.o -c /mesos/src/tests/oversubscription_tests.cpp
[ 93%] Building CXX object src/tests/CMakeFiles/mesos-tests.dir/persistent_volume_endpoints_tests.cpp.o
cd /mesos/build/src/tests && /usr/bin/g++  -DBUILD_DIR=\"/mesos/build\" -DBUILD_FLAGS=\"\" -DBUILD_JAVA_JVM_LIBRARY=\"\" -DHAS_AUTHENTICATION=1 -DHAVE_LIBZ -DLIBDIR=\"/usr/local/libmesos\" -DPICOJSON_USE_INT64 -DPKGDATADIR=\"/usr/local/share/mesos\" -DPKGLIBEXECDIR=\"/usr/local/libexec/mesos\" -DPKGMODULEDIR=\"\" -DSBINDIR=\"\" -DSOURCE_DIR=\"/mesos\" -DTESTLIBEXECDIR=\"\" -DUSE_CMAKE_BUILD_CONFIG -DUSE_STATIC_LIB -DVERSION=\"1.5.0\" -DZOOKEEPER_VERSION=\"3.4.8\" -D__STDC_FORMAT_MACROS -I/mesos/include -I/mesos/build/include -I/mesos/build/include/mesos -I/mesos/build/src -I/mesos/src -I/mesos/3rdparty/libprocess/src/../include -I/mesos/3rdparty/stout/include -isystem /usr/include/apr-1.0 -isystem /mesos/build/3rdparty/boost-1.53.0/src/boost-1.53.0 -isystem /mesos/build/3rdparty/elfio-3.2/src/elfio-3.2 -isystem /mesos/build/3rdparty/glog-0.3.3/src/glog-0.3.3-build/include -isystem /mesos/build/3rdparty/picojson-1.3.0/src/picojson-1.3.0 -isystem /mesos/build/3rdparty/protobuf-3.3.0/src/protobuf-3.3.0/src -isystem /usr/include/subversion-1 -isystem /mesos/build/3rdparty/http_parser-2.6.2/src/http_parser-2.6.2 -isystem /mesos/build/3rdparty/zookeeper-3.4.8/src/zookeeper-3.4.8/src/c/include -isystem /mesos/build/3rdparty/zookeeper-3.4.8/src/zookeeper-3.4.8/src/c/generated -isystem /mesos/build/3rdparty/nvml-352.79/src/nvml-352.79 -isystem /mesos/build/3rdparty/leveldb-1.19/src/leveldb-1.19/include -isystem /mesos/build/3rdparty/googletest-1.8.0/src/googletest-1.8.0/googlemock/include -isystem /mesos/build/3rdparty/googletest-1.8.0/src/googletest-1.8.0/googletest/include  -std=c++11 -Wformat-security -fstack-protector -fPIE   -o CMakeFiles/mesos-tests.dir/persistent_volume_endpoints_tests.cpp.o -c /mesos/src/tests/persistent_volume_endpoints_tests.cpp
[ 93%] Building CXX object src/tests/CMakeFiles/mesos-tests.dir/persistent_volume_tests.cpp.o
cd /mesos/build/src/tests && /usr/bin/g++  -DBUILD_DIR=\"/mesos/build\" -DBUILD_FLAGS=\"\" -DBUILD_JAVA_JVM_LIBRARY=\"\" -DHAS_AUTHENTICATION=1 -DHAVE_LIBZ -DLIBDIR=\"/usr/local/libmesos\" -DPICOJSON_USE_INT64 -DPKGDATADIR=\"/usr/local/share/mesos\" -DPKGLIBEXECDIR=\"/usr/local/libexec/mesos\" -DPKGMODULEDIR=\"\" -DSBINDIR=\"\" -DSOURCE_DIR=\"/mesos\" -DTESTLIBEXECDIR=\"\" -DUSE_CMAKE_BUILD_CONFIG -DUSE_STATIC_LIB -DVERSION=\"1.5.0\" -DZOOKEEPER_VERSION=\"3.4.8\" -D__STDC_FORMAT_MACROS -I/mesos/include -I/mesos/build/include -I/mesos/build/include/mesos -I/mesos/build/src -I/mesos/src -I/mesos/3rdparty/libprocess/src/../include -I/mesos/3rdparty/stout/include -isystem /usr/include/apr-1.0 -isystem /mesos/build/3rdparty/boost-1.53.0/src/boost-1.53.0 -isystem /mesos/build/3rdparty/elfio-3.2/src/elfio-3.2 -isystem /mesos/build/3rdparty/glog-0.3.3/src/glog-0.3.3-build/include -isystem /mesos/build/3rdparty/picojson-1.3.0/src/picojson-1.3.0 -isystem /mesos/build/3rdparty/protobuf-3.3.0/src/protobuf-3.3.0/src -isystem /usr/include/subversion-1 -isystem /mesos/build/3rdparty/http_parser-2.6.2/src/http_parser-2.6.2 -isystem /mesos/build/3rdparty/zookeeper-3.4.8/src/zookeeper-3.4.8/src/c/include -isystem /mesos/build/3rdparty/zookeeper-3.4.8/src/zookeeper-3.4.8/src/c/generated -isystem /mesos/build/3rdparty/nvml-352.79/src/nvml-352.79 -isystem /mesos/build/3rdparty/leveldb-1.19/src/leveldb-1.19/include -isystem /mesos/build/3rdparty/googletest-1.8.0/src/googletest-1.8.0/googlemock/include -isystem /mesos/build/3rdparty/googletest-1.8.0/src/googletest-1.8.0/googletest/include  -std=c++11 -Wformat-security -fstack-protector -fPIE   -o CMakeFiles/mesos-tests.dir/persistent_volume_tests.cpp.o -c /mesos/src/tests/persistent_volume_tests.cpp
[ 93%] Building CXX object src/tests/CMakeFiles/mesos-tests.dir/protobuf_utils_tests.cpp.o
cd /mesos/build/src/tests && /usr/bin/g++  -DBUILD_DIR=\"/mesos/build\" -DBUILD_FLAGS=\"\" -DBUILD_JAVA_JVM_LIBRARY=\"\" -DHAS_AUTHENTICATION=1 -DHAVE_LIBZ -DLIBDIR=\"/usr/local/libmesos\" -DPICOJSON_USE_INT64 -DPKGDATADIR=\"/usr/local/share/mesos\" -DPKGLIBEXECDIR=\"/usr/local/libexec/mesos\" -DPKGMODULEDIR=\"\" -DSBINDIR=\"\" -DSOURCE_DIR=\"/mesos\" -DTESTLIBEXECDIR=\"\" -DUSE_CMAKE_BUILD_CONFIG -DUSE_STATIC_LIB -DVERSION=\"1.5.0\" -DZOOKEEPER_VERSION=\"3.4.8\" -D__STDC_FORMAT_MACROS -I/mesos/include -I/mesos/build/include -I/mesos/build/include/mesos -I/mesos/build/src -I/mesos/src -I/mesos/3rdparty/libprocess/src/../include -I/mesos/3rdparty/stout/include -isystem /usr/include/apr-1.0 -isystem /mesos/build/3rdparty/boost-1.53.0/src/boost-1.53.0 -isystem /mesos/build/3rdparty/elfio-3.2/src/elfio-3.2 -isystem /mesos/build/3rdparty/glog-0.3.3/src/glog-0.3.3-build/include -isystem /mesos/build/3rdparty/picojson-1.3.0/src/picojson-1.3.0 -isystem /mesos/build/3rdparty/protobuf-3.3.0/src/protobuf-3.3.0/src -isystem /usr/include/subversion-1 -isystem /mesos/build/3rdparty/http_parser-2.6.2/src/http_parser-2.6.2 -isystem /mesos/build/3rdparty/zookeeper-3.4.8/src/zookeeper-3.4.8/src/c/include -isystem /mesos/build/3rdparty/zookeeper-3.4.8/src/zookeeper-3.4.8/src/c/generated -isystem /mesos/build/3rdparty/nvml-352.79/src/nvml-352.79 -isystem /mesos/build/3rdparty/leveldb-1.19/src/leveldb-1.19/include -isystem /mesos/build/3rdparty/googletest-1.8.0/src/googletest-1.8.0/googlemock/include -isystem /mesos/build/3rdparty/googletest-1.8.0/src/googletest-1.8.0/googletest/include  -std=c++11 -Wformat-security -fstack-protector -fPIE   -o CMakeFiles/mesos-tests.dir/protobuf_utils_tests.cpp.o -c /mesos/src/tests/protobuf_utils_tests.cpp
[ 93%] Building CXX object src/tests/CMakeFiles/mesos-tests.dir/reconciliation_tests.cpp.o
cd /mesos/build/src/tests && /usr/bin/g++  -DBUILD_DIR=\"/mesos/build\" -DBUILD_FLAGS=\"\" -DBUILD_JAVA_JVM_LIBRARY=\"\" -DHAS_AUTHENTICATION=1 -DHAVE_LIBZ -DLIBDIR=\"/usr/local/libmesos\" -DPICOJSON_USE_INT64 -DPKGDATADIR=\"/usr/local/share/mesos\" -DPKGLIBEXECDIR=\"/usr/local/libexec/mesos\" -DPKGMODULEDIR=\"\" -DSBINDIR=\"\" -DSOURCE_DIR=\"/mesos\" -DTESTLIBEXECDIR=\"\" -DUSE_CMAKE_BUILD_CONFIG -DUSE_STATIC_LIB -DVERSION=\"1.5.0\" -DZOOKEEPER_VERSION=\"3.4.8\" -D__STDC_FORMAT_MACROS -I/mesos/include -I/mesos/build/include -I/mesos/build/include/mesos -I/mesos/build/src -I/mesos/src -I/mesos/3rdparty/libprocess/src/../include -I/mesos/3rdparty/stout/include -isystem /usr/include/apr-1.0 -isystem /mesos/build/3rdparty/boost-1.53.0/src/boost-1.53.0 -isystem /mesos/build/3rdparty/elfio-3.2/src/elfio-3.2 -isystem /mesos/build/3rdparty/glog-0.3.3/src/glog-0.3.3-build/include -isystem /mesos/build/3rdparty/picojson-1.3.0/src/picojson-1.3.0 -isystem /mesos/build/3rdparty/protobuf-3.3.0/src/protobuf-3.3.0/src -isystem /usr/include/subversion-1 -isystem /mesos/build/3rdparty/http_parser-2.6.2/src/http_parser-2.6.2 -isystem /mesos/build/3rdparty/zookeeper-3.4.8/src/zookeeper-3.4.8/src/c/include -isystem /mesos/build/3rdparty/zookeeper-3.4.8/src/zookeeper-3.4.8/src/c/generated -isystem /mesos/build/3rdparty/nvml-352.79/src/nvml-352.79 -isystem /mesos/build/3rdparty/leveldb-1.19/src/leveldb-1.19/include -isystem /mesos/build/3rdparty/googletest-1.8.0/src/googletest-1.8.0/googlemock/include -isystem /mesos/build/3rdparty/googletest-1.8.0/src/googletest-1.8.0/googletest/include  -std=c++11 -Wformat-security -fstack-protector -fPIE   -o CMakeFiles/mesos-tests.dir/reconciliation_tests.cpp.o -c /mesos/src/tests/reconciliation_tests.cpp
[ 93%] Building CXX object src/tests/CMakeFiles/mesos-tests.dir/registrar_tests.cpp.o
cd /mesos/build/src/tests && /usr/bin/g++  -DBUILD_DIR=\"/mesos/build\" -DBUILD_FLAGS=\"\" -DBUILD_JAVA_JVM_LIBRARY=\"\" -DHAS_AUTHENTICATION=1 -DHAVE_LIBZ -DLIBDIR=\"/usr/local/libmesos\" -DPICOJSON_USE_INT64 -DPKGDATADIR=\"/usr/local/share/mesos\" -DPKGLIBEXECDIR=\"/usr/local/libexec/mesos\" -DPKGMODULEDIR=\"\" -DSBINDIR=\"\" -DSOURCE_DIR=\"/mesos\" -DTESTLIBEXECDIR=\"\" -DUSE_CMAKE_BUILD_CONFIG -DUSE_STATIC_LIB -DVERSION=\"1.5.0\" -DZOOKEEPER_VERSION=\"3.4.8\" -D__STDC_FORMAT_MACROS -I/mesos/include -I/mesos/build/include -I/mesos/build/include/mesos -I/mesos/build/src -I/mesos/src -I/mesos/3rdparty/libprocess/src/../include -I/mesos/3rdparty/stout/include -isystem /usr/include/apr-1.0 -isystem /mesos/build/3rdparty/boost-1.53.0/src/boost-1.53.0 -isystem /mesos/build/3rdparty/elfio-3.2/src/elfio-3.2 -isystem /mesos/build/3rdparty/glog-0.3.3/src/glog-0.3.3-build/include -isystem /mesos/build/3rdparty/picojson-1.3.0/src/picojson-1.3.0 -isystem /mesos/build/3rdparty/protobuf-3.3.0/src/protobuf-3.3.0/src -isystem /usr/include/subversion-1 -isystem /mesos/build/3rdparty/http_parser-2.6.2/src/http_parser-2.6.2 -isystem /mesos/build/3rdparty/zookeeper-3.4.8/src/zookeeper-3.4.8/src/c/include -isystem /mesos/build/3rdparty/zookeeper-3.4.8/src/zookeeper-3.4.8/src/c/generated -isystem /mesos/build/3rdparty/nvml-352.79/src/nvml-352.79 -isystem /mesos/build/3rdparty/leveldb-1.19/src/leveldb-1.19/include -isystem /mesos/build/3rdparty/googletest-1.8.0/src/googletest-1.8.0/googlemock/include -isystem /mesos/build/3rdparty/googletest-1.8.0/src/googletest-1.8.0/googletest/include  -std=c++11 -Wformat-security -fstack-protector -fPIE   -o CMakeFiles/mesos-tests.dir/registrar_tests.cpp.o -c /mesos/src/tests/registrar_tests.cpp
[ 93%] Building CXX object src/tests/CMakeFiles/mesos-tests.dir/reservation_endpoints_tests.cpp.o
cd /mesos/build/src/tests && /usr/bin/g++  -DBUILD_DIR=\"/mesos/build\" -DBUILD_FLAGS=\"\" -DBUILD_JAVA_JVM_LIBRARY=\"\" -DHAS_AUTHENTICATION=1 -DHAVE_LIBZ -DLIBDIR=\"/usr/local/libmesos\" -DPICOJSON_USE_INT64 -DPKGDATADIR=\"/usr/local/share/mesos\" -DPKGLIBEXECDIR=\"/usr/local/libexec/mesos\" -DPKGMODULEDIR=\"\" -DSBINDIR=\"\" -DSOURCE_DIR=\"/mesos\" -DTESTLIBEXECDIR=\"\" -DUSE_CMAKE_BUILD_CONFIG -DUSE_STATIC_LIB -DVERSION=\"1.5.0\" -DZOOKEEPER_VERSION=\"3.4.8\" -D__STDC_FORMAT_MACROS -I/mesos/include -I/mesos/build/include -I/mesos/build/include/mesos -I/mesos/build/src -I/mesos/src -I/mesos/3rdparty/libprocess/src/../include -I/mesos/3rdparty/stout/include -isystem /usr/include/apr-1.0 -isystem /mesos/build/3rdparty/boost-1.53.0/src/boost-1.53.0 -isystem /mesos/build/3rdparty/elfio-3.2/src/elfio-3.2 -isystem /mesos/build/3rdparty/glog-0.3.3/src/glog-0.3.3-build/include -isystem /mesos/build/3rdparty/picojson-1.3.0/src/picojson-1.3.0 -isystem /mesos/build/3rdparty/protobuf-3.3.0/src/protobuf-3.3.0/src -isystem /usr/include/subversion-1 -isystem /mesos/build/3rdparty/http_parser-2.6.2/src/http_parser-2.6.2 -isystem /mesos/build/3rdparty/zookeeper-3.4.8/src/zookeeper-3.4.8/src/c/include -isystem /mesos/build/3rdparty/zookeeper-3.4.8/src/zookeeper-3.4.8/src/c/generated -isystem /mesos/build/3rdparty/nvml-352.79/src/nvml-352.79 -isystem /mesos/build/3rdparty/leveldb-1.19/src/leveldb-1.19/include -isystem /mesos/build/3rdparty/googletest-1.8.0/src/googletest-1.8.0/googlemock/include -isystem /mesos/build/3rdparty/googletest-1.8.0/src/googletest-1.8.0/googletest/include  -std=c++11 -Wformat-security -fstack-protector -fPIE   -o CMakeFiles/mesos-tests.dir/reservation_endpoints_tests.cpp.o -c /mesos/src/tests/reservation_endpoints_tests.cpp
[ 94%] Building CXX object src/tests/CMakeFiles/mesos-tests.dir/reservation_tests.cpp.o
cd /mesos/build/src/tests && /usr/bin/g++  -DBUILD_DIR=\"/mesos/build\" -DBUILD_FLAGS=\"\" -DBUILD_JAVA_JVM_LIBRARY=\"\" -DHAS_AUTHENTICATION=1 -DHAVE_LIBZ -DLIBDIR=\"/usr/local/libmesos\" -DPICOJSON_USE_INT64 -DPKGDATADIR=\"/usr/local/share/mesos\" -DPKGLIBEXECDIR=\"/usr/local/libexec/mesos\" -DPKGMODULEDIR=\"\" -DSBINDIR=\"\" -DSOURCE_DIR=\"/mesos\" -DTESTLIBEXECDIR=\"\" -DUSE_CMAKE_BUILD_CONFIG -DUSE_STATIC_LIB -DVERSION=\"1.5.0\" -DZOOKEEPER_VERSION=\"3.4.8\" -D__STDC_FORMAT_MACROS -I/mesos/include -I/mesos/build/include -I/mesos/build/include/mesos -I/mesos/build/src -I/mesos/src -I/mesos/3rdparty/libprocess/src/../include -I/mesos/3rdparty/stout/include -isystem /usr/include/apr-1.0 -isystem /mesos/build/3rdparty/boost-1.53.0/src/boost-1.53.0 -isystem /mesos/build/3rdparty/elfio-3.2/src/elfio-3.2 -isystem /mesos/build/3rdparty/glog-0.3.3/src/glog-0.3.3-build/include -isystem /mesos/build/3rdparty/picojson-1.3.0/src/picojson-1.3.0 -isystem /mesos/build/3rdparty/protobuf-3.3.0/src/protobuf-3.3.0/src -isystem /usr/include/subversion-1 -isystem /mesos/build/3rdparty/http_parser-2.6.2/src/http_parser-2.6.2 -isystem /mesos/build/3rdparty/zookeeper-3.4.8/src/zookeeper-3.4.8/src/c/include -isystem /mesos/build/3rdparty/zookeeper-3.4.8/src/zookeeper-3.4.8/src/c/generated -isystem /mesos/build/3rdparty/nvml-352.79/src/nvml-352.79 -isystem /mesos/build/3rdparty/leveldb-1.19/src/leveldb-1.19/include -isystem /mesos/build/3rdparty/googletest-1.8.0/src/googletest-1.8.0/googlemock/include -isystem /mesos/build/3rdparty/googletest-1.8.0/src/googletest-1.8.0/googletest/include  -std=c++11 -Wformat-security -fstack-protector -fPIE   -o CMakeFiles/mesos-tests.dir/reservation_tests.cpp.o -c /mesos/src/tests/reservation_tests.cpp
[ 94%] Building CXX object src/tests/CMakeFiles/mesos-tests.dir/slave_authorization_tests.cpp.o
cd /mesos/build/src/tests && /usr/bin/g++  -DBUILD_DIR=\"/mesos/build\" -DBUILD_FLAGS=\"\" -DBUILD_JAVA_JVM_LIBRARY=\"\" -DHAS_AUTHENTICATION=1 -DHAVE_LIBZ -DLIBDIR=\"/usr/local/libmesos\" -DPICOJSON_USE_INT64 -DPKGDATADIR=\"/usr/local/share/mesos\" -DPKGLIBEXECDIR=\"/usr/local/libexec/mesos\" -DPKGMODULEDIR=\"\" -DSBINDIR=\"\" -DSOURCE_DIR=\"/mesos\" -DTESTLIBEXECDIR=\"\" -DUSE_CMAKE_BUILD_CONFIG -DUSE_STATIC_LIB -DVERSION=\"1.5.0\" -DZOOKEEPER_VERSION=\"3.4.8\" -D__STDC_FORMAT_MACROS -I/mesos/include -I/mesos/build/include -I/mesos/build/include/mesos -I/mesos/build/src -I/mesos/src -I/mesos/3rdparty/libprocess/src/../include -I/mesos/3rdparty/stout/include -isystem /usr/include/apr-1.0 -isystem /mesos/build/3rdparty/boost-1.53.0/src/boost-1.53.0 -isystem /mesos/build/3rdparty/elfio-3.2/src/elfio-3.2 -isystem /mesos/build/3rdparty/glog-0.3.3/src/glog-0.3.3-build/include -isystem /mesos/build/3rdparty/picojson-1.3.0/src/picojson-1.3.0 -isystem /mesos/build/3rdparty/protobuf-3.3.0/src/protobuf-3.3.0/src -isystem /usr/include/subversion-1 -isystem /mesos/build/3rdparty/http_parser-2.6.2/src/http_parser-2.6.2 -isystem /mesos/build/3rdparty/zookeeper-3.4.8/src/zookeeper-3.4.8/src/c/include -isystem /mesos/build/3rdparty/zookeeper-3.4.8/src/zookeeper-3.4.8/src/c/generated -isystem /mesos/build/3rdparty/nvml-352.79/src/nvml-352.79 -isystem /mesos/build/3rdparty/leveldb-1.19/src/leveldb-1.19/include -isystem /mesos/build/3rdparty/googletest-1.8.0/src/googletest-1.8.0/googlemock/include -isystem /mesos/build/3rdparty/googletest-1.8.0/src/googletest-1.8.0/googletest/include  -std=c++11 -Wformat-security -fstack-protector -fPIE   -o CMakeFiles/mesos-tests.dir/slave_authorization_tests.cpp.o -c /mesos/src/tests/slave_authorization_tests.cpp
[ 94%] Building CXX object src/tests/CMakeFiles/mesos-tests.dir/slave_recovery_tests.cpp.o
cd /mesos/build/src/tests && /usr/bin/g++  -DBUILD_DIR=\"/mesos/build\" -DBUILD_FLAGS=\"\" -DBUILD_JAVA_JVM_LIBRARY=\"\" -DHAS_AUTHENTICATION=1 -DHAVE_LIBZ -DLIBDIR=\"/usr/local/libmesos\" -DPICOJSON_USE_INT64 -DPKGDATADIR=\"/usr/local/share/mesos\" -DPKGLIBEXECDIR=\"/usr/local/libexec/mesos\" -DPKGMODULEDIR=\"\" -DSBINDIR=\"\" -DSOURCE_DIR=\"/mesos\" -DTESTLIBEXECDIR=\"\" -DUSE_CMAKE_BUILD_CONFIG -DUSE_STATIC_LIB -DVERSION=\"1.5.0\" -DZOOKEEPER_VERSION=\"3.4.8\" -D__STDC_FORMAT_MACROS -I/mesos/include -I/mesos/build/include -I/mesos/build/include/mesos -I/mesos/build/src -I/mesos/src -I/mesos/3rdparty/libprocess/src/../include -I/mesos/3rdparty/stout/include -isystem /usr/include/apr-1.0 -isystem /mesos/build/3rdparty/boost-1.53.0/src/boost-1.53.0 -isystem /mesos/build/3rdparty/elfio-3.2/src/elfio-3.2 -isystem /mesos/build/3rdparty/glog-0.3.3/src/glog-0.3.3-build/include -isystem /mesos/build/3rdparty/picojson-1.3.0/src/picojson-1.3.0 -isystem /mesos/build/3rdparty/protobuf-3.3.0/src/protobuf-3.3.0/src -isystem /usr/include/subversion-1 -isystem /mesos/build/3rdparty/http_parser-2.6.2/src/http_parser-2.6.2 -isystem /mesos/build/3rdparty/zookeeper-3.4.8/src/zookeeper-3.4.8/src/c/include -isystem /mesos/build/3rdparty/zookeeper-3.4.8/src/zookeeper-3.4.8/src/c/generated -isystem /mesos/build/3rdparty/nvml-352.79/src/nvml-352.79 -isystem /mesos/build/3rdparty/leveldb-1.19/src/leveldb-1.19/include -isystem /mesos/build/3rdparty/googletest-1.8.0/src/googletest-1.8.0/googlemock/include -isystem /mesos/build/3rdparty/googletest-1.8.0/src/googletest-1.8.0/googletest/include  -std=c++11 -Wformat-security -fstack-protector -fPIE   -o CMakeFiles/mesos-tests.dir/slave_recovery_tests.cpp.o -c /mesos/src/tests/slave_recovery_tests.cpp
[ 94%] Building CXX object src/tests/CMakeFiles/mesos-tests.dir/state_tests.cpp.o
cd /mesos/build/src/tests && /usr/bin/g++  -DBUILD_DIR=\"/mesos/build\" -DBUILD_FLAGS=\"\" -DBUILD_JAVA_JVM_LIBRARY=\"\" -DHAS_AUTHENTICATION=1 -DHAVE_LIBZ -DLIBDIR=\"/usr/local/libmesos\" -DPICOJSON_USE_INT64 -DPKGDATADIR=\"/usr/local/share/mesos\" -DPKGLIBEXECDIR=\"/usr/local/libexec/mesos\" -DPKGMODULEDIR=\"\" -DSBINDIR=\"\" -DSOURCE_DIR=\"/mesos\" -DTESTLIBEXECDIR=\"\" -DUSE_CMAKE_BUILD_CONFIG -DUSE_STATIC_LIB -DVERSION=\"1.5.0\" -DZOOKEEPER_VERSION=\"3.4.8\" -D__STDC_FORMAT_MACROS -I/mesos/include -I/mesos/build/include -I/mesos/build/include/mesos -I/mesos/build/src -I/mesos/src -I/mesos/3rdparty/libprocess/src/../include -I/mesos/3rdparty/stout/include -isystem /usr/include/apr-1.0 -isystem /mesos/build/3rdparty/boost-1.53.0/src/boost-1.53.0 -isystem /mesos/build/3rdparty/elfio-3.2/src/elfio-3.2 -isystem /mesos/build/3rdparty/glog-0.3.3/src/glog-0.3.3-build/include -isystem /mesos/build/3rdparty/picojson-1.3.0/src/picojson-1.3.0 -isystem /mesos/build/3rdparty/protobuf-3.3.0/src/protobuf-3.3.0/src -isystem /usr/include/subversion-1 -isystem /mesos/build/3rdparty/http_parser-2.6.2/src/http_parser-2.6.2 -isystem /mesos/build/3rdparty/zookeeper-3.4.8/src/zookeeper-3.4.8/src/c/include -isystem /mesos/build/3rdparty/zookeeper-3.4.8/src/zookeeper-3.4.8/src/c/generated -isystem /mesos/build/3rdparty/nvml-352.79/src/nvml-352.79 -isystem /mesos/build/3rdparty/leveldb-1.19/src/leveldb-1.19/include -isystem /mesos/build/3rdparty/googletest-1.8.0/src/googletest-1.8.0/googlemock/include -isystem /mesos/build/3rdparty/googletest-1.8.0/src/googletest-1.8.0/googletest/include  -std=c++11 -Wformat-security -fstack-protector -fPIE   -o CMakeFiles/mesos-tests.dir/state_tests.cpp.o -c /mesos/src/tests/state_tests.cpp
[ 94%] Building CXX object src/tests/CMakeFiles/mesos-tests.dir/teardown_tests.cpp.o
cd /mesos/build/src/tests && /usr/bin/g++  -DBUILD_DIR=\"/mesos/build\" -DBUILD_FLAGS=\"\" -DBUILD_JAVA_JVM_LIBRARY=\"\" -DHAS_AUTHENTICATION=1 -DHAVE_LIBZ -DLIBDIR=\"/usr/local/libmesos\" -DPICOJSON_USE_INT64 -DPKGDATADIR=\"/usr/local/share/mesos\" -DPKGLIBEXECDIR=\"/usr/local/libexec/mesos\" -DPKGMODULEDIR=\"\" -DSBINDIR=\"\" -DSOURCE_DIR=\"/mesos\" -DTESTLIBEXECDIR=\"\" -DUSE_CMAKE_BUILD_CONFIG -DUSE_STATIC_LIB -DVERSION=\"1.5.0\" -DZOOKEEPER_VERSION=\"3.4.8\" -D__STDC_FORMAT_MACROS -I/mesos/include -I/mesos/build/include -I/mesos/build/include/mesos -I/mesos/build/src -I/mesos/src -I/mesos/3rdparty/libprocess/src/../include -I/mesos/3rdparty/stout/include -isystem /usr/include/apr-1.0 -isystem /mesos/build/3rdparty/boost-1.53.0/src/boost-1.53.0 -isystem /mesos/build/3rdparty/elfio-3.2/src/elfio-3.2 -isystem /mesos/build/3rdparty/glog-0.3.3/src/glog-0.3.3-build/include -isystem /mesos/build/3rdparty/picojson-1.3.0/src/picojson-1.3.0 -isystem /mesos/build/3rdparty/protobuf-3.3.0/src/protobuf-3.3.0/src -isystem /usr/include/subversion-1 -isystem /mesos/build/3rdparty/http_parser-2.6.2/src/http_parser-2.6.2 -isystem /mesos/build/3rdparty/zookeeper-3.4.8/src/zookeeper-3.4.8/src/c/include -isystem /mesos/build/3rdparty/zookeeper-3.4.8/src/zookeeper-3.4.8/src/c/generated -isystem /mesos/build/3rdparty/nvml-352.79/src/nvml-352.79 -isystem /mesos/build/3rdparty/leveldb-1.19/src/leveldb-1.19/include -isystem /mesos/build/3rdparty/googletest-1.8.0/src/googletest-1.8.0/googlemock/include -isystem /mesos/build/3rdparty/googletest-1.8.0/src/googletest-1.8.0/googletest/include  -std=c++11 -Wformat-security -fstack-protector -fPIE   -o CMakeFiles/mesos-tests.dir/teardown_tests.cpp.o -c /mesos/src/tests/teardown_tests.cpp
[ 94%] Building CXX object src/tests/CMakeFiles/mesos-tests.dir/upgrade_tests.cpp.o
cd /mesos/build/src/tests && /usr/bin/g++  -DBUILD_DIR=\"/mesos/build\" -DBUILD_FLAGS=\"\" -DBUILD_JAVA_JVM_LIBRARY=\"\" -DHAS_AUTHENTICATION=1 -DHAVE_LIBZ -DLIBDIR=\"/usr/local/libmesos\" -DPICOJSON_USE_INT64 -DPKGDATADIR=\"/usr/local/share/mesos\" -DPKGLIBEXECDIR=\"/usr/local/libexec/mesos\" -DPKGMODULEDIR=\"\" -DSBINDIR=\"\" -DSOURCE_DIR=\"/mesos\" -DTESTLIBEXECDIR=\"\" -DUSE_CMAKE_BUILD_CONFIG -DUSE_STATIC_LIB -DVERSION=\"1.5.0\" -DZOOKEEPER_VERSION=\"3.4.8\" -D__STDC_FORMAT_MACROS -I/mesos/include -I/mesos/build/include -I/mesos/build/include/mesos -I/mesos/build/src -I/mesos/src -I/mesos/3rdparty/libprocess/src/../include -I/mesos/3rdparty/stout/include -isystem /usr/include/apr-1.0 -isystem /mesos/build/3rdparty/boost-1.53.0/src/boost-1.53.0 -isystem /mesos/build/3rdparty/elfio-3.2/src/elfio-3.2 -isystem /mesos/build/3rdparty/glog-0.3.3/src/glog-0.3.3-build/include -isystem /mesos/build/3rdparty/picojson-1.3.0/src/picojson-1.3.0 -isystem /mesos/build/3rdparty/protobuf-3.3.0/src/protobuf-3.3.0/src -isystem /usr/include/subversion-1 -isystem /mesos/build/3rdparty/http_parser-2.6.2/src/http_parser-2.6.2 -isystem /mesos/build/3rdparty/zookeeper-3.4.8/src/zookeeper-3.4.8/src/c/include -isystem /mesos/build/3rdparty/zookeeper-3.4.8/src/zookeeper-3.4.8/src/c/generated -isystem /mesos/build/3rdparty/nvml-352.79/src/nvml-352.79 -isystem /mesos/build/3rdparty/leveldb-1.19/src/leveldb-1.19/include -isystem /mesos/build/3rdparty/googletest-1.8.0/src/googletest-1.8.0/googlemock/include -isystem /mesos/build/3rdparty/googletest-1.8.0/src/googletest-1.8.0/googletest/include  -std=c++11 -Wformat-security -fstack-protector -fPIE   -o CMakeFiles/mesos-tests.dir/upgrade_tests.cpp.o -c /mesos/src/tests/upgrade_tests.cpp
[ 94%] Building CXX object src/tests/CMakeFiles/mesos-tests.dir/common/command_utils_tests.cpp.o
cd /mesos/build/src/tests && /usr/bin/g++  -DBUILD_DIR=\"/mesos/build\" -DBUILD_FLAGS=\"\" -DBUILD_JAVA_JVM_LIBRARY=\"\" -DHAS_AUTHENTICATION=1 -DHAVE_LIBZ -DLIBDIR=\"/usr/local/libmesos\" -DPICOJSON_USE_INT64 -DPKGDATADIR=\"/usr/local/share/mesos\" -DPKGLIBEXECDIR=\"/usr/local/libexec/mesos\" -DPKGMODULEDIR=\"\" -DSBINDIR=\"\" -DSOURCE_DIR=\"/mesos\" -DTESTLIBEXECDIR=\"\" -DUSE_CMAKE_BUILD_CONFIG -DUSE_STATIC_LIB -DVERSION=\"1.5.0\" -DZOOKEEPER_VERSION=\"3.4.8\" -D__STDC_FORMAT_MACROS -I/mesos/include -I/mesos/build/include -I/mesos/build/include/mesos -I/mesos/build/src -I/mesos/src -I/mesos/3rdparty/libprocess/src/../include -I/mesos/3rdparty/stout/include -isystem /usr/include/apr-1.0 -isystem /mesos/build/3rdparty/boost-1.53.0/src/boost-1.53.0 -isystem /mesos/build/3rdparty/elfio-3.2/src/elfio-3.2 -isystem /mesos/build/3rdparty/glog-0.3.3/src/glog-0.3.3-build/include -isystem /mesos/build/3rdparty/picojson-1.3.0/src/picojson-1.3.0 -isystem /mesos/build/3rdparty/protobuf-3.3.0/src/protobuf-3.3.0/src -isystem /usr/include/subversion-1 -isystem /mesos/build/3rdparty/http_parser-2.6.2/src/http_parser-2.6.2 -isystem /mesos/build/3rdparty/zookeeper-3.4.8/src/zookeeper-3.4.8/src/c/include -isystem /mesos/build/3rdparty/zookeeper-3.4.8/src/zookeeper-3.4.8/src/c/generated -isystem /mesos/build/3rdparty/nvml-352.79/src/nvml-352.79 -isystem /mesos/build/3rdparty/leveldb-1.19/src/leveldb-1.19/include -isystem /mesos/build/3rdparty/googletest-1.8.0/src/googletest-1.8.0/googlemock/include -isystem /mesos/build/3rdparty/googletest-1.8.0/src/googletest-1.8.0/googletest/include  -std=c++11 -Wformat-security -fstack-protector -fPIE   -o CMakeFiles/mesos-tests.dir/common/command_utils_tests.cpp.o -c /mesos/src/tests/common/command_utils_tests.cpp
[ 95%] Building CXX object src/tests/CMakeFiles/mesos-tests.dir/containerizer/appc_spec_tests.cpp.o
cd /mesos/build/src/tests && /usr/bin/g++  -DBUILD_DIR=\"/mesos/build\" -DBUILD_FLAGS=\"\" -DBUILD_JAVA_JVM_LIBRARY=\"\" -DHAS_AUTHENTICATION=1 -DHAVE_LIBZ -DLIBDIR=\"/usr/local/libmesos\" -DPICOJSON_USE_INT64 -DPKGDATADIR=\"/usr/local/share/mesos\" -DPKGLIBEXECDIR=\"/usr/local/libexec/mesos\" -DPKGMODULEDIR=\"\" -DSBINDIR=\"\" -DSOURCE_DIR=\"/mesos\" -DTESTLIBEXECDIR=\"\" -DUSE_CMAKE_BUILD_CONFIG -DUSE_STATIC_LIB -DVERSION=\"1.5.0\" -DZOOKEEPER_VERSION=\"3.4.8\" -D__STDC_FORMAT_MACROS -I/mesos/include -I/mesos/build/include -I/mesos/build/include/mesos -I/mesos/build/src -I/mesos/src -I/mesos/3rdparty/libprocess/src/../include -I/mesos/3rdparty/stout/include -isystem /usr/include/apr-1.0 -isystem /mesos/build/3rdparty/boost-1.53.0/src/boost-1.53.0 -isystem /mesos/build/3rdparty/elfio-3.2/src/elfio-3.2 -isystem /mesos/build/3rdparty/glog-0.3.3/src/glog-0.3.3-build/include -isystem /mesos/build/3rdparty/picojson-1.3.0/src/picojson-1.3.0 -isystem /mesos/build/3rdparty/protobuf-3.3.0/src/protobuf-3.3.0/src -isystem /usr/include/subversion-1 -isystem /mesos/build/3rdparty/http_parser-2.6.2/src/http_parser-2.6.2 -isystem /mesos/build/3rdparty/zookeeper-3.4.8/src/zookeeper-3.4.8/src/c/include -isystem /mesos/build/3rdparty/zookeeper-3.4.8/src/zookeeper-3.4.8/src/c/generated -isystem /mesos/build/3rdparty/nvml-352.79/src/nvml-352.79 -isystem /mesos/build/3rdparty/leveldb-1.19/src/leveldb-1.19/include -isystem /mesos/build/3rdparty/googletest-1.8.0/src/googletest-1.8.0/googlemock/include -isystem /mesos/build/3rdparty/googletest-1.8.0/src/googletest-1.8.0/googletest/include  -std=c++11 -Wformat-security -fstack-protector -fPIE   -o CMakeFiles/mesos-tests.dir/containerizer/appc_spec_tests.cpp.o -c /mesos/src/tests/containerizer/appc_spec_tests.cpp
[ 95%] Building CXX object src/tests/CMakeFiles/mesos-tests.dir/containerizer/composing_containerizer_tests.cpp.o
cd /mesos/build/src/tests && /usr/bin/g++  -DBUILD_DIR=\"/mesos/build\" -DBUILD_FLAGS=\"\" -DBUILD_JAVA_JVM_LIBRARY=\"\" -DHAS_AUTHENTICATION=1 -DHAVE_LIBZ -DLIBDIR=\"/usr/local/libmesos\" -DPICOJSON_USE_INT64 -DPKGDATADIR=\"/usr/local/share/mesos\" -DPKGLIBEXECDIR=\"/usr/local/libexec/mesos\" -DPKGMODULEDIR=\"\" -DSBINDIR=\"\" -DSOURCE_DIR=\"/mesos\" -DTESTLIBEXECDIR=\"\" -DUSE_CMAKE_BUILD_CONFIG -DUSE_STATIC_LIB -DVERSION=\"1.5.0\" -DZOOKEEPER_VERSION=\"3.4.8\" -D__STDC_FORMAT_MACROS -I/mesos/include -I/mesos/build/include -I/mesos/build/include/mesos -I/mesos/build/src -I/mesos/src -I/mesos/3rdparty/libprocess/src/../include -I/mesos/3rdparty/stout/include -isystem /usr/include/apr-1.0 -isystem /mesos/build/3rdparty/boost-1.53.0/src/boost-1.53.0 -isystem /mesos/build/3rdparty/elfio-3.2/src/elfio-3.2 -isystem /mesos/build/3rdparty/glog-0.3.3/src/glog-0.3.3-build/include -isystem /mesos/build/3rdparty/picojson-1.3.0/src/picojson-1.3.0 -isystem /mesos/build/3rdparty/protobuf-3.3.0/src/protobuf-3.3.0/src -isystem /usr/include/subversion-1 -isystem /mesos/build/3rdparty/http_parser-2.6.2/src/http_parser-2.6.2 -isystem /mesos/build/3rdparty/zookeeper-3.4.8/src/zookeeper-3.4.8/src/c/include -isystem /mesos/build/3rdparty/zookeeper-3.4.8/src/zookeeper-3.4.8/src/c/generated -isystem /mesos/build/3rdparty/nvml-352.79/src/nvml-352.79 -isystem /mesos/build/3rdparty/leveldb-1.19/src/leveldb-1.19/include -isystem /mesos/build/3rdparty/googletest-1.8.0/src/googletest-1.8.0/googlemock/include -isystem /mesos/build/3rdparty/googletest-1.8.0/src/googletest-1.8.0/googletest/include  -std=c++11 -Wformat-security -fstack-protector -fPIE   -o CMakeFiles/mesos-tests.dir/containerizer/composing_containerizer_tests.cpp.o -c /mesos/src/tests/containerizer/composing_containerizer_tests.cpp
[ 95%] Building CXX object src/tests/CMakeFiles/mesos-tests.dir/containerizer/cpu_isolator_tests.cpp.o
cd /mesos/build/src/tests && /usr/bin/g++  -DBUILD_DIR=\"/mesos/build\" -DBUILD_FLAGS=\"\" -DBUILD_JAVA_JVM_LIBRARY=\"\" -DHAS_AUTHENTICATION=1 -DHAVE_LIBZ -DLIBDIR=\"/usr/local/libmesos\" -DPICOJSON_USE_INT64 -DPKGDATADIR=\"/usr/local/share/mesos\" -DPKGLIBEXECDIR=\"/usr/local/libexec/mesos\" -DPKGMODULEDIR=\"\" -DSBINDIR=\"\" -DSOURCE_DIR=\"/mesos\" -DTESTLIBEXECDIR=\"\" -DUSE_CMAKE_BUILD_CONFIG -DUSE_STATIC_LIB -DVERSION=\"1.5.0\" -DZOOKEEPER_VERSION=\"3.4.8\" -D__STDC_FORMAT_MACROS -I/mesos/include -I/mesos/build/include -I/mesos/build/include/mesos -I/mesos/build/src -I/mesos/src -I/mesos/3rdparty/libprocess/src/../include -I/mesos/3rdparty/stout/include -isystem /usr/include/apr-1.0 -isystem /mesos/build/3rdparty/boost-1.53.0/src/boost-1.53.0 -isystem /mesos/build/3rdparty/elfio-3.2/src/elfio-3.2 -isystem /mesos/build/3rdparty/glog-0.3.3/src/glog-0.3.3-build/include -isystem /mesos/build/3rdparty/picojson-1.3.0/src/picojson-1.3.0 -isystem /mesos/build/3rdparty/protobuf-3.3.0/src/protobuf-3.3.0/src -isystem /usr/include/subversion-1 -isystem /mesos/build/3rdparty/http_parser-2.6.2/src/http_parser-2.6.2 -isystem /mesos/build/3rdparty/zookeeper-3.4.8/src/zookeeper-3.4.8/src/c/include -isystem /mesos/build/3rdparty/zookeeper-3.4.8/src/zookeeper-3.4.8/src/c/generated -isystem /mesos/build/3rdparty/nvml-352.79/src/nvml-352.79 -isystem /mesos/build/3rdparty/leveldb-1.19/src/leveldb-1.19/include -isystem /mesos/build/3rdparty/googletest-1.8.0/src/googletest-1.8.0/googlemock/include -isystem /mesos/build/3rdparty/googletest-1.8.0/src/googletest-1.8.0/googletest/include  -std=c++11 -Wformat-security -fstack-protector -fPIE   -o CMakeFiles/mesos-tests.dir/containerizer/cpu_isolator_tests.cpp.o -c /mesos/src/tests/containerizer/cpu_isolator_tests.cpp
[ 95%] Building CXX object src/tests/CMakeFiles/mesos-tests.dir/containerizer/docker_containerizer_tests.cpp.o
cd /mesos/build/src/tests && /usr/bin/g++  -DBUILD_DIR=\"/mesos/build\" -DBUILD_FLAGS=\"\" -DBUILD_JAVA_JVM_LIBRARY=\"\" -DHAS_AUTHENTICATION=1 -DHAVE_LIBZ -DLIBDIR=\"/usr/local/libmesos\" -DPICOJSON_USE_INT64 -DPKGDATADIR=\"/usr/local/share/mesos\" -DPKGLIBEXECDIR=\"/usr/local/libexec/mesos\" -DPKGMODULEDIR=\"\" -DSBINDIR=\"\" -DSOURCE_DIR=\"/mesos\" -DTESTLIBEXECDIR=\"\" -DUSE_CMAKE_BUILD_CONFIG -DUSE_STATIC_LIB -DVERSION=\"1.5.0\" -DZOOKEEPER_VERSION=\"3.4.8\" -D__STDC_FORMAT_MACROS -I/mesos/include -I/mesos/build/include -I/mesos/build/include/mesos -I/mesos/build/src -I/mesos/src -I/mesos/3rdparty/libprocess/src/../include -I/mesos/3rdparty/stout/include -isystem /usr/include/apr-1.0 -isystem /mesos/build/3rdparty/boost-1.53.0/src/boost-1.53.0 -isystem /mesos/build/3rdparty/elfio-3.2/src/elfio-3.2 -isystem /mesos/build/3rdparty/glog-0.3.3/src/glog-0.3.3-build/include -isystem /mesos/build/3rdparty/picojson-1.3.0/src/picojson-1.3.0 -isystem /mesos/build/3rdparty/protobuf-3.3.0/src/protobuf-3.3.0/src -isystem /usr/include/subversion-1 -isystem /mesos/build/3rdparty/http_parser-2.6.2/src/http_parser-2.6.2 -isystem /mesos/build/3rdparty/zookeeper-3.4.8/src/zookeeper-3.4.8/src/c/include -isystem /mesos/build/3rdparty/zookeeper-3.4.8/src/zookeeper-3.4.8/src/c/generated -isystem /mesos/build/3rdparty/nvml-352.79/src/nvml-352.79 -isystem /mesos/build/3rdparty/leveldb-1.19/src/leveldb-1.19/include -isystem /mesos/build/3rdparty/googletest-1.8.0/src/googletest-1.8.0/googlemock/include -isystem /mesos/build/3rdparty/googletest-1.8.0/src/googletest-1.8.0/googletest/include  -std=c++11 -Wformat-security -fstack-protector -fPIE   -o CMakeFiles/mesos-tests.dir/containerizer/docker_containerizer_tests.cpp.o -c /mesos/src/tests/containerizer/docker_containerizer_tests.cpp
[ 95%] Building CXX object src/tests/CMakeFiles/mesos-tests.dir/containerizer/docker_spec_tests.cpp.o
cd /mesos/build/src/tests && /usr/bin/g++  -DBUILD_DIR=\"/mesos/build\" -DBUILD_FLAGS=\"\" -DBUILD_JAVA_JVM_LIBRARY=\"\" -DHAS_AUTHENTICATION=1 -DHAVE_LIBZ -DLIBDIR=\"/usr/local/libmesos\" -DPICOJSON_USE_INT64 -DPKGDATADIR=\"/usr/local/share/mesos\" -DPKGLIBEXECDIR=\"/usr/local/libexec/mesos\" -DPKGMODULEDIR=\"\" -DSBINDIR=\"\" -DSOURCE_DIR=\"/mesos\" -DTESTLIBEXECDIR=\"\" -DUSE_CMAKE_BUILD_CONFIG -DUSE_STATIC_LIB -DVERSION=\"1.5.0\" -DZOOKEEPER_VERSION=\"3.4.8\" -D__STDC_FORMAT_MACROS -I/mesos/include -I/mesos/build/include -I/mesos/build/include/mesos -I/mesos/build/src -I/mesos/src -I/mesos/3rdparty/libprocess/src/../include -I/mesos/3rdparty/stout/include -isystem /usr/include/apr-1.0 -isystem /mesos/build/3rdparty/boost-1.53.0/src/boost-1.53.0 -isystem /mesos/build/3rdparty/elfio-3.2/src/elfio-3.2 -isystem /mesos/build/3rdparty/glog-0.3.3/src/glog-0.3.3-build/include -isystem /mesos/build/3rdparty/picojson-1.3.0/src/picojson-1.3.0 -isystem /mesos/build/3rdparty/protobuf-3.3.0/src/protobuf-3.3.0/src -isystem /usr/include/subversion-1 -isystem /mesos/build/3rdparty/http_parser-2.6.2/src/http_parser-2.6.2 -isystem /mesos/build/3rdparty/zookeeper-3.4.8/src/zookeeper-3.4.8/src/c/include -isystem /mesos/build/3rdparty/zookeeper-3.4.8/src/zookeeper-3.4.8/src/c/generated -isystem /mesos/build/3rdparty/nvml-352.79/src/nvml-352.79 -isystem /mesos/build/3rdparty/leveldb-1.19/src/leveldb-1.19/include -isystem /mesos/build/3rdparty/googletest-1.8.0/src/googletest-1.8.0/googlemock/include -isystem /mesos/build/3rdparty/googletest-1.8.0/src/googletest-1.8.0/googletest/include  -std=c++11 -Wformat-security -fstack-protector -fPIE   -o CMakeFiles/mesos-tests.dir/containerizer/docker_spec_tests.cpp.o -c /mesos/src/tests/containerizer/docker_spec_tests.cpp
/mesos/src/tests/upgrade_tests.cpp:941:1: fatal error: error writing to /tmp/ccKBcytm.s: No space left on device
 } // namespace mesos {
 ^
compilation terminated.
/mesos/src/tests/containerizer/docker_spec_tests.cpp:624:1: fatal error: error writing to /tmp/ccbLljTL.s: No space left on device
 } // namespace mesos {
 ^
compilation terminated.
/mesos/src/tests/slave_recovery_tests.cpp:4813:1: fatal error: error writing to /tmp/ccjtqftJ.s: No space left on device
 } // namespace mesos {
 ^
compilation terminated.
make[3]: *** [src/tests/CMakeFiles/mesos-tests.dir/containerizer/docker_spec_tests.cpp.o] Error 1
make[3]: *** Waiting for unfinished jobs....
/mesos/src/tests/containerizer/composing_containerizer_tests.cpp:296:1: fatal error: error writing to /tmp/ccuUuhYT.s: No space left on device
 } // namespace mesos {
 ^
compilation terminated.
/mesos/src/tests/containerizer/cpu_isolator_tests.cpp:251:1: fatal error: error writing to /tmp/ccP0RsoN.s: No space left on device
 } // namespace mesos {
 ^
compilation terminated.
/mesos/src/tests/containerizer/docker_containerizer_tests.cpp:4962:1: fatal error: error writing to /tmp/ccN6hjHh.s: No space left on device
 } // namespace mesos {
 ^
compilation terminated.
The bug is not reproducible, so it is likely a hardware or OS problem.
make[3]: *** [src/tests/CMakeFiles/mesos-tests.dir/upgrade_tests.cpp.o] Error 1
The bug is not reproducible, so it is likely a hardware or OS problem.
make[3]: *** [src/tests/CMakeFiles/mesos-tests.dir/containerizer/composing_containerizer_tests.cpp.o] Error 1
The bug is not reproducible, so it is likely a hardware or OS problem.
make[3]: *** [src/tests/CMakeFiles/mesos-tests.dir/containerizer/docker_containerizer_tests.cpp.o] Error 1
The bug is not reproducible, so it is likely a hardware or OS problem.
make[3]: *** [src/tests/CMakeFiles/mesos-tests.dir/containerizer/cpu_isolator_tests.cpp.o] Error 1
The bug is not reproducible, so it is likely a hardware or OS problem.
make[3]: *** [src/tests/CMakeFiles/mesos-tests.dir/slave_recovery_tests.cpp.o] Error 1
make[3]: Leaving directory `/mesos/build'
make[2]: *** [src/tests/CMakeFiles/mesos-tests.dir/all] Error 2
make[2]: Leaving directory `/mesos/build'
make[1]: *** [CMakeFiles/check.dir/rule] Error 2
make[1]: Leaving directory `/mesos/build'
make: *** [check] Error 2
+ docker rmi mesos-1505477235-18352
Untagged: mesos-1505477235-18352:latest
Deleted: sha256:3ffaf08f67520bdc17041533f66484f968b5032877a6078a15d39e82f0cc30a1
Deleted: sha256:bd7b4c3c5f1872402797256bb7d64f8b544e068e29aafa05ddd035510839b0eb
Deleted: sha256:ad1e67bdb98af3faa7dfc51074c8658d8199afa57577bd70f4d51e526ca10c24
Deleted: sha256:a6afa6444ea0ba2613df57d6055cee41739b45ab8483e59e7a0184e4b54eb1be
Deleted: sha256:be10edbac6bd73441e05757bba9d16b5768cfd5965c08c23d80516aeeb092d85
Deleted: sha256:fe7304a830952c9109172e0a3f67e9a95fbfd1a6c9af9f2d632e8c4406250961
Deleted: sha256:978a8b5d54db31f1b303de9a3dfe1cc30c6f16d76d6b54196ceec9bc6b438760
Deleted: sha256:0da5f8ff03735ca247d9a2708149139c0fb8f0eaf142977f69495cd0dab68932
Deleted: sha256:a3bfd2d8e0997a4fc022e11b8151a39936976e41277ebe9891d82f6342c307f5
Deleted: sha256:cba33e10d39955b93c3948ad8aaa0b014f3bc2329e8d67d228fc9d777d33fc91
Deleted: sha256:4751c9499c87707b6fdbf97381611629e9c72def710bd38fc06b915df164c203
Deleted: sha256:c7889d4faed0c47ad1e21b0cb6a7c6c76621d1a1278adf270256d37d2138d138
Deleted: sha256:f4a66053a032ebce9ba359c2d7a1c4ce35694c9ad0f9ecd190980bc36e84d78b
Deleted: sha256:158055adf2f732bef0c0aea9f3ffadc5d815b8a2ea0cf6d84933ffa289dc0751
Deleted: sha256:26bb9b980402d7394a990a3dd6b39eee54fccbc992f370fdee22e3f223aa60cc
Deleted: sha256:36aa5269bb37696183955598656017f004997d6f9dbc334b4d1ac1f35020c58b
Deleted: sha256:e302881275809206c411d21acb17dab38594131206f8d25eafb56b785a3faa60
Deleted: sha256:8c4353b2d6026bbadf574a15fe92d547962134158f28ccdfb0805a0ce001e972
Deleted: sha256:f527f59686274553fda5e8989824d3a4a5e04191b912b78cab752157ed5405f7
Deleted: sha256:071effd8ed7ae499b8dc0ca3e417536fb660b45e17510bec34bb585ab5f0e82f
Deleted: sha256:f65f4b64c0c28362cd39105d633d5db9524f33d91e3f9d3777024a42da0e7348
Deleted: sha256:8f7157e3ab058fb714e882a9a03f08f8ac4842f1d23f9cd4c065cc326bf02187
Deleted: sha256:c3d87a18af991001a0e12472c20714beb004138b56890c3a629f977120b0d08f
Deleted: sha256:8ecec408d1690a86529646ab7f41068fe8a63f53e692d24c4b01acb189f8a76a
Deleted: sha256:cfe85702ac8e07eac2d0bc4dd2aa8a58c014ec34c5a2808bfe89336d7ab3a135
Deleted: sha256:6d011328f347186ba97cd887e56333900a8348c2f632fba0c9fd02f549686db5
Deleted: sha256:9abdbb1f79d465804bec00009b99e4fc67491c1f75ab1c06c4ffb1a4ab6f06bb
Deleted: sha256:004cd75b48f77662618674bbca9452e70d5ab37f6730642c62b0ccfc0c930b75
Build step 'Execute shell' marked build as failure
Not sending mail to unregistered user benjamin.bannier@mesosphere.io

Mime
View raw message