mesos-builds mailing list archives

Site index · List index
Message view « Date » · « Thread »
Top « Date » · « Thread »
From Apache Jenkins Server <jenk...@builds.apache.org>
Subject Build failed in Jenkins: Mesos-Reviewbot #19612
Date Thu, 28 Sep 2017 18:30:05 GMT
See <https://builds.apache.org/job/Mesos-Reviewbot/19612/display/redirect>

------------------------------------------
[...truncated 31.80 MB...]
I0928 18:29:59.250910  5790 credentials.hpp:37] Loading credentials for authentication from
'/tmp/Endpoint_SlaveEndpointTest_AuthorizedRequest_2_fMFOHM/http_credentials'
I0928 18:29:59.251128  5790 http.cpp:1045] Creating default 'basic' HTTP authenticator for
realm 'mesos-agent-readonly'
I0928 18:29:59.251279  5790 http.cpp:1045] Creating default 'basic' HTTP authenticator for
realm 'mesos-agent-readwrite'
I0928 18:29:59.252596  5790 slave.cpp:585] Agent resources: [{"name":"cpus","scalar":{"value":2.0},"type":"SCALAR"},{"name":"mem","scalar":{"value":1024.0},"type":"SCALAR"},{"name":"disk","scalar":{"value":1024.0},"type":"SCALAR"},{"name":"ports","ranges":{"range":[{"begin":31000,"end":32000}]},"type":"RANGES"}]
I0928 18:29:59.252830  5790 slave.cpp:593] Agent attributes: [  ]
I0928 18:29:59.252846  5790 slave.cpp:602] Agent hostname: ff3f2b6b03bc
I0928 18:29:59.252984  5792 status_update_manager.cpp:177] Pausing sending status updates
I0928 18:29:59.254293  5784 state.cpp:64] Recovering state from '/tmp/Endpoint_SlaveEndpointTest_AuthorizedRequest_2_iQVvq1/meta'
I0928 18:29:59.254564  5784 status_update_manager.cpp:203] Recovering status update manager
I0928 18:29:59.254756  5807 containerizer.cpp:648] Recovering containerizer
I0928 18:29:59.256007  5799 provisioner.cpp:416] Provisioner recovery complete
I0928 18:29:59.256305  5801 slave.cpp:6322] Finished recovery
I0928 18:29:59.256767  5801 slave.cpp:6504] Querying resource estimator for oversubscribable
resources
I0928 18:29:59.256990  5793 slave.cpp:6518] Received oversubscribable resources {} from the
resource estimator
I0928 18:29:59.259325  5800 process.cpp:3929] Handling HTTP event for process 'slave(811)'
with path: '/slave(811)/containers'
I0928 18:29:59.260484  5791 http.cpp:1185] HTTP GET for /slave(811)/containers from 172.17.0.3:48426
I0928 18:29:59.260552  5791 http.cpp:976] Authorizing principal 'test-principal' to GET the
'/containers' endpoint
I0928 18:29:59.263504  5790 slave.cpp:869] Agent terminating
[       OK ] Endpoint/SlaveEndpointTest.AuthorizedRequest/2 (27 ms)
[ RUN      ] Endpoint/SlaveEndpointTest.UnauthorizedRequest/0
I0928 18:29:59.274204  5765 containerizer.cpp:292] Using isolation { environment_secret, posix/cpu,
posix/mem, filesystem/posix, network/cni }
W0928 18:29:59.274693  5765 backend.cpp:76] Failed to create 'aufs' backend: AufsBackend requires
root privileges
W0928 18:29:59.274803  5765 backend.cpp:76] Failed to create 'bind' backend: BindBackend requires
root privileges
I0928 18:29:59.274835  5765 provisioner.cpp:255] Using default backend 'copy'
I0928 18:29:59.278287  5797 slave.cpp:254] Mesos agent started on (812)@172.17.0.3:36368
I0928 18:29:59.278321  5797 slave.cpp:255] Flags at startup: --acls="" --appc_simple_discovery_uri_prefix="http://"
--appc_store_dir="/tmp/Endpoint_SlaveEndpointTest_UnauthorizedRequest_0_Tp782P/store/appc"
--authenticate_http_readonly="true" --authenticate_http_readwrite="true" --authenticatee="crammd5"
--authentication_backoff_factor="1secs" --authorizer="local" --cgroups_cpu_enable_pids_and_tids_count="false"
--cgroups_enable_cfs="false" --cgroups_hierarchy="/sys/fs/cgroup" --cgroups_limit_swap="false"
--cgroups_root="mesos" --container_disk_watch_interval="15secs" --containerizers="mesos" --credential="/tmp/Endpoint_SlaveEndpointTest_UnauthorizedRequest_0_Tp782P/credential"
--default_role="*" --disallow_sharing_agent_pid_namespace="false" --disk_watch_interval="1mins"
--docker="docker" --docker_kill_orphans="true" --docker_registry="https://registry-1.docker.io"
--docker_remove_delay="6hrs" --docker_socket="/var/run/docker.sock" --docker_stop_timeout="0ns"
--docker_store_dir="/tmp/Endpoint_SlaveEndpointTest_UnauthorizedRequest_0_Tp782P/store/docker"
--docker_volume_checkpoint_dir="/var/run/mesos/isolators/docker/volume" --enforce_container_disk_quota="false"
--executor_registration_timeout="1mins" --executor_reregistration_timeout="2secs" --executor_shutdown_grace_period="5secs"
--fetcher_cache_dir="/tmp/Endpoint_SlaveEndpointTest_UnauthorizedRequest_0_Tp782P/fetch" --fetcher_cache_size="2GB"
--frameworks_home="" --gc_delay="1weeks" --gc_disk_headroom="0.1" --hadoop_home="" --help="false"
--hostname_lookup="true" --http_command_executor="false" --http_credentials="/tmp/Endpoint_SlaveEndpointTest_UnauthorizedRequest_0_Tp782P/http_credentials"
--http_heartbeat_interval="30secs" --initialize_driver_logging="true" --isolation="posix/cpu,posix/mem"
--launcher="posix" --launcher_dir="/mesos/mesos-1.5.0/_build/src" --logbufsecs="0" --logging_level="INFO"
--max_completed_executors_per_framework="150" --oversubscribed_resources_interval="15secs"
--perf_duration="10secs" --perf_interval="1mins" --port="5051" --qos_correction_interval_min="0ns"
--quiet="false" --recover="reconnect" --recovery_timeout="15mins" --registration_backoff_factor="10ms"
--resources="cpus:2;gpus:0;mem:1024;disk:1024;ports:[31000-32000]" --revocable_cpu_low_priority="true"
--runtime_dir="/tmp/Endpoint_SlaveEndpointTest_UnauthorizedRequest_0_Tp782P" --sandbox_directory="/mnt/mesos/sandbox"
--strict="true" --switch_user="true" --systemd_enable_support="true" --systemd_runtime_directory="/run/systemd/system"
--version="false" --work_dir="/tmp/Endpoint_SlaveEndpointTest_UnauthorizedRequest_0_ynRFH4"
--zk_session_timeout="10secs"
I0928 18:29:59.278928  5797 credentials.hpp:86] Loading credential for authentication from
'/tmp/Endpoint_SlaveEndpointTest_UnauthorizedRequest_0_Tp782P/credential'
I0928 18:29:59.279140  5797 slave.cpp:287] Agent using credential for: test-principal
I0928 18:29:59.279171  5797 credentials.hpp:37] Loading credentials for authentication from
'/tmp/Endpoint_SlaveEndpointTest_UnauthorizedRequest_0_Tp782P/http_credentials'
I0928 18:29:59.279513  5797 http.cpp:1045] Creating default 'basic' HTTP authenticator for
realm 'mesos-agent-readonly'
I0928 18:29:59.279723  5797 http.cpp:1045] Creating default 'basic' HTTP authenticator for
realm 'mesos-agent-readwrite'
I0928 18:29:59.281976  5797 slave.cpp:585] Agent resources: [{"name":"cpus","scalar":{"value":2.0},"type":"SCALAR"},{"name":"mem","scalar":{"value":1024.0},"type":"SCALAR"},{"name":"disk","scalar":{"value":1024.0},"type":"SCALAR"},{"name":"ports","ranges":{"range":[{"begin":31000,"end":32000}]},"type":"RANGES"}]
I0928 18:29:59.282383  5797 slave.cpp:593] Agent attributes: [  ]
I0928 18:29:59.282410  5797 slave.cpp:602] Agent hostname: ff3f2b6b03bc
I0928 18:29:59.282567  5806 status_update_manager.cpp:177] Pausing sending status updates
I0928 18:29:59.284369  5801 state.cpp:64] Recovering state from '/tmp/Endpoint_SlaveEndpointTest_UnauthorizedRequest_0_ynRFH4/meta'
I0928 18:29:59.284649  5793 status_update_manager.cpp:203] Recovering status update manager
I0928 18:29:59.284850  5807 containerizer.cpp:648] Recovering containerizer
I0928 18:29:59.286078  5804 provisioner.cpp:416] Provisioner recovery complete
I0928 18:29:59.286366  5806 slave.cpp:6322] Finished recovery
I0928 18:29:59.286808  5806 slave.cpp:6504] Querying resource estimator for oversubscribable
resources
I0928 18:29:59.287071  5794 slave.cpp:6518] Received oversubscribable resources {} from the
resource estimator
I0928 18:29:59.289511  5786 process.cpp:3929] Handling HTTP event for process 'slave(812)'
with path: '/slave(812)/monitor/statistics'
I0928 18:29:59.290906  5792 http.cpp:1185] HTTP GET for /slave(812)/monitor/statistics from
172.17.0.3:48432
I0928 18:29:59.290974  5792 http.cpp:976] Authorizing principal 'test-principal' to GET the
'/monitor/statistics' endpoint
I0928 18:29:59.292659  5765 slave.cpp:869] Agent terminating
[       OK ] Endpoint/SlaveEndpointTest.UnauthorizedRequest/0 (28 ms)
[ RUN      ] Endpoint/SlaveEndpointTest.UnauthorizedRequest/1
I0928 18:29:59.303097  5765 containerizer.cpp:292] Using isolation { environment_secret, posix/cpu,
posix/mem, filesystem/posix, network/cni }
W0928 18:29:59.303589  5765 backend.cpp:76] Failed to create 'aufs' backend: AufsBackend requires
root privileges
W0928 18:29:59.303697  5765 backend.cpp:76] Failed to create 'bind' backend: BindBackend requires
root privileges
I0928 18:29:59.303730  5765 provisioner.cpp:255] Using default backend 'copy'
I0928 18:29:59.307152  5791 slave.cpp:254] Mesos agent started on (813)@172.17.0.3:36368
I0928 18:29:59.307179  5791 slave.cpp:255] Flags at startup: --acls="" --appc_simple_discovery_uri_prefix="http://"
--appc_store_dir="/tmp/Endpoint_SlaveEndpointTest_UnauthorizedRequest_1_3jVRFT/store/appc"
--authenticate_http_readonly="true" --authenticate_http_readwrite="true" --authenticatee="crammd5"
--authentication_backoff_factor="1secs" --authorizer="local" --cgroups_cpu_enable_pids_and_tids_count="false"
--cgroups_enable_cfs="false" --cgroups_hierarchy="/sys/fs/cgroup" --cgroups_limit_swap="false"
--cgroups_root="mesos" --container_disk_watch_interval="15secs" --containerizers="mesos" --credential="/tmp/Endpoint_SlaveEndpointTest_UnauthorizedRequest_1_3jVRFT/credential"
--default_role="*" --disallow_sharing_agent_pid_namespace="false" --disk_watch_interval="1mins"
--docker="docker" --docker_kill_orphans="true" --docker_registry="https://registry-1.docker.io"
--docker_remove_delay="6hrs" --docker_socket="/var/run/docker.sock" --docker_stop_timeout="0ns"
--docker_store_dir="/tmp/Endpoint_SlaveEndpointTest_UnauthorizedRequest_1_3jVRFT/store/docker"
--docker_volume_checkpoint_dir="/var/run/mesos/isolators/docker/volume" --enforce_container_disk_quota="false"
--executor_registration_timeout="1mins" --executor_reregistration_timeout="2secs" --executor_shutdown_grace_period="5secs"
--fetcher_cache_dir="/tmp/Endpoint_SlaveEndpointTest_UnauthorizedRequest_1_3jVRFT/fetch" --fetcher_cache_size="2GB"
--frameworks_home="" --gc_delay="1weeks" --gc_disk_headroom="0.1" --hadoop_home="" --help="false"
--hostname_lookup="true" --http_command_executor="false" --http_credentials="/tmp/Endpoint_SlaveEndpointTest_UnauthorizedRequest_1_3jVRFT/http_credentials"
--http_heartbeat_interval="30secs" --initialize_driver_logging="true" --isolation="posix/cpu,posix/mem"
--launcher="posix" --launcher_dir="/mesos/mesos-1.5.0/_build/src" --logbufsecs="0" --logging_level="INFO"
--max_completed_executors_per_framework="150" --oversubscribed_resources_interval="15secs"
--perf_duration="10secs" --perf_interval="1mins" --port="5051" --qos_correction_interval_min="0ns"
--quiet="false" --recover="reconnect" --recovery_timeout="15mins" --registration_backoff_factor="10ms"
--resources="cpus:2;gpus:0;mem:1024;disk:1024;ports:[31000-32000]" --revocable_cpu_low_priority="true"
--runtime_dir="/tmp/Endpoint_SlaveEndpointTest_UnauthorizedRequest_1_3jVRFT" --sandbox_directory="/mnt/mesos/sandbox"
--strict="true" --switch_user="true" --systemd_enable_support="true" --systemd_runtime_directory="/run/systemd/system"
--version="false" --work_dir="/tmp/Endpoint_SlaveEndpointTest_UnauthorizedRequest_1_weV5f8"
--zk_session_timeout="10secs"
I0928 18:29:59.307565  5791 credentials.hpp:86] Loading credential for authentication from
'/tmp/Endpoint_SlaveEndpointTest_UnauthorizedRequest_1_3jVRFT/credential'
I0928 18:29:59.307729  5791 slave.cpp:287] Agent using credential for: test-principal
I0928 18:29:59.307761  5791 credentials.hpp:37] Loading credentials for authentication from
'/tmp/Endpoint_SlaveEndpointTest_UnauthorizedRequest_1_3jVRFT/http_credentials'
I0928 18:29:59.308018  5791 http.cpp:1045] Creating default 'basic' HTTP authenticator for
realm 'mesos-agent-readonly'
I0928 18:29:59.308185  5791 http.cpp:1045] Creating default 'basic' HTTP authenticator for
realm 'mesos-agent-readwrite'
I0928 18:29:59.309509  5791 slave.cpp:585] Agent resources: [{"name":"cpus","scalar":{"value":2.0},"type":"SCALAR"},{"name":"mem","scalar":{"value":1024.0},"type":"SCALAR"},{"name":"disk","scalar":{"value":1024.0},"type":"SCALAR"},{"name":"ports","ranges":{"range":[{"begin":31000,"end":32000}]},"type":"RANGES"}]
I0928 18:29:59.309731  5791 slave.cpp:593] Agent attributes: [  ]
I0928 18:29:59.309746  5791 slave.cpp:602] Agent hostname: ff3f2b6b03bc
I0928 18:29:59.309881  5788 status_update_manager.cpp:177] Pausing sending status updates
I0928 18:29:59.311277  5787 state.cpp:64] Recovering state from '/tmp/Endpoint_SlaveEndpointTest_UnauthorizedRequest_1_weV5f8/meta'
I0928 18:29:59.311537  5802 status_update_manager.cpp:203] Recovering status update manager
I0928 18:29:59.311713  5798 containerizer.cpp:648] Recovering containerizer
I0928 18:29:59.312913  5805 provisioner.cpp:416] Provisioner recovery complete
I0928 18:29:59.313202  5788 slave.cpp:6322] Finished recovery
I0928 18:29:59.313611  5788 slave.cpp:6504] Querying resource estimator for oversubscribable
resources
I0928 18:29:59.313854  5796 slave.cpp:6518] Received oversubscribable resources {} from the
resource estimator
I0928 18:29:59.316148  5801 process.cpp:3929] Handling HTTP event for process 'slave(813)'
with path: '/slave(813)/monitor/statistics.json'
I0928 18:29:59.317454  5786 http.cpp:1185] HTTP GET for /slave(813)/monitor/statistics.json
from 172.17.0.3:48436
I0928 18:29:59.317520  5786 http.cpp:976] Authorizing principal 'test-principal' to GET the
'/monitor/statistics.json' endpoint
I0928 18:29:59.319484  5794 slave.cpp:869] Agent terminating
[       OK ] Endpoint/SlaveEndpointTest.UnauthorizedRequest/1 (26 ms)
[ RUN      ] Endpoint/SlaveEndpointTest.UnauthorizedRequest/2
I0928 18:29:59.330991  5765 containerizer.cpp:292] Using isolation { environment_secret, posix/cpu,
posix/mem, filesystem/posix, network/cni }
W0928 18:29:59.331523  5765 backend.cpp:76] Failed to create 'aufs' backend: AufsBackend requires
root privileges
W0928 18:29:59.331640  5765 backend.cpp:76] Failed to create 'bind' backend: BindBackend requires
root privileges
I0928 18:29:59.331684  5765 provisioner.cpp:255] Using default backend 'copy'
I0928 18:29:59.335206  5787 slave.cpp:254] Mesos agent started on (814)@172.17.0.3:36368
I0928 18:29:59.335228  5787 slave.cpp:255] Flags at startup: --acls="" --appc_simple_discovery_uri_prefix="http://"
--appc_store_dir="/tmp/Endpoint_SlaveEndpointTest_UnauthorizedRequest_2_W6HMyX/store/appc"
--authenticate_http_readonly="true" --authenticate_http_readwrite="true" --authenticatee="crammd5"
--authentication_backoff_factor="1secs" --authorizer="local" --cgroups_cpu_enable_pids_and_tids_count="false"
--cgroups_enable_cfs="false" --cgroups_hierarchy="/sys/fs/cgroup" --cgroups_limit_swap="false"
--cgroups_root="mesos" --container_disk_watch_interval="15secs" --containerizers="mesos" --credential="/tmp/Endpoint_SlaveEndpointTest_UnauthorizedRequest_2_W6HMyX/credential"
--default_role="*" --disallow_sharing_agent_pid_namespace="false" --disk_watch_interval="1mins"
--docker="docker" --docker_kill_orphans="true" --docker_registry="https://registry-1.docker.io"
--docker_remove_delay="6hrs" --docker_socket="/var/run/docker.sock" --docker_stop_timeout="0ns"
--docker_store_dir="/tmp/Endpoint_SlaveEndpointTest_UnauthorizedRequest_2_W6HMyX/store/docker"
--docker_volume_checkpoint_dir="/var/run/mesos/isolators/docker/volume" --enforce_container_disk_quota="false"
--executor_registration_timeout="1mins" --executor_reregistration_timeout="2secs" --executor_shutdown_grace_period="5secs"
--fetcher_cache_dir="/tmp/Endpoint_SlaveEndpointTest_UnauthorizedRequest_2_W6HMyX/fetch" --fetcher_cache_size="2GB"
--frameworks_home="" --gc_delay="1weeks" --gc_disk_headroom="0.1" --hadoop_home="" --help="false"
--hostname_lookup="true" --http_command_executor="false" --http_credentials="/tmp/Endpoint_SlaveEndpointTest_UnauthorizedRequest_2_W6HMyX/http_credentials"
--http_heartbeat_interval="30secs" --initialize_driver_logging="true" --isolation="posix/cpu,posix/mem"
--launcher="posix" --launcher_dir="/mesos/mesos-1.5.0/_build/src" --logbufsecs="0" --logging_level="INFO"
--max_completed_executors_per_framework="150" --oversubscribed_resources_interval="15secs"
--perf_duration="10secs" --perf_interval="1mins" --port="5051" --qos_correction_interval_min="0ns"
--quiet="false" --recover="reconnect" --recovery_timeout="15mins" --registration_backoff_factor="10ms"
--resources="cpus:2;gpus:0;mem:1024;disk:1024;ports:[31000-32000]" --revocable_cpu_low_priority="true"
--runtime_dir="/tmp/Endpoint_SlaveEndpointTest_UnauthorizedRequest_2_W6HMyX" --sandbox_directory="/mnt/mesos/sandbox"
--strict="true" --switch_user="true" --systemd_enable_support="true" --systemd_runtime_directory="/run/systemd/system"
--version="false" --work_dir="/tmp/Endpoint_SlaveEndpointTest_UnauthorizedRequest_2_MVbU4b"
--zk_session_timeout="10secs"
I0928 18:29:59.335589  5787 credentials.hpp:86] Loading credential for authentication from
'/tmp/Endpoint_SlaveEndpointTest_UnauthorizedRequest_2_W6HMyX/credential'
I0928 18:29:59.335736  5787 slave.cpp:287] Agent using credential for: test-principal
I0928 18:29:59.335758  5787 credentials.hpp:37] Loading credentials for authentication from
'/tmp/Endpoint_SlaveEndpointTest_UnauthorizedRequest_2_W6HMyX/http_credentials'
I0928 18:29:59.335995  5787 http.cpp:1045] Creating default 'basic' HTTP authenticator for
realm 'mesos-agent-readonly'
I0928 18:29:59.336154  5787 http.cpp:1045] Creating default 'basic' HTTP authenticator for
realm 'mesos-agent-readwrite'
I0928 18:29:59.337626  5787 slave.cpp:585] Agent resources: [{"name":"cpus","scalar":{"value":2.0},"type":"SCALAR"},{"name":"mem","scalar":{"value":1024.0},"type":"SCALAR"},{"name":"disk","scalar":{"value":1024.0},"type":"SCALAR"},{"name":"ports","ranges":{"range":[{"begin":31000,"end":32000}]},"type":"RANGES"}]
I0928 18:29:59.337857  5787 slave.cpp:593] Agent attributes: [  ]
I0928 18:29:59.337872  5787 slave.cpp:602] Agent hostname: ff3f2b6b03bc
I0928 18:29:59.337991  5789 status_update_manager.cpp:177] Pausing sending status updates
I0928 18:29:59.339399  5786 state.cpp:64] Recovering state from '/tmp/Endpoint_SlaveEndpointTest_UnauthorizedRequest_2_MVbU4b/meta'
I0928 18:29:59.339665  5786 status_update_manager.cpp:203] Recovering status update manager
I0928 18:29:59.339844  5804 containerizer.cpp:648] Recovering containerizer
I0928 18:29:59.341140  5798 provisioner.cpp:416] Provisioner recovery complete
I0928 18:29:59.341476  5800 slave.cpp:6322] Finished recovery
I0928 18:29:59.341913  5800 slave.cpp:6504] Querying resource estimator for oversubscribable
resources
I0928 18:29:59.342133  5794 slave.cpp:6518] Received oversubscribable resources {} from the
resource estimator
I0928 18:29:59.344462  5802 process.cpp:3929] Handling HTTP event for process 'slave(814)'
with path: '/slave(814)/containers'
I0928 18:29:59.345708  5795 http.cpp:1185] HTTP GET for /slave(814)/containers from 172.17.0.3:48440
I0928 18:29:59.345780  5795 http.cpp:976] Authorizing principal 'test-principal' to GET the
'/containers' endpoint
I0928 18:29:59.347678  5798 slave.cpp:869] Agent terminating
[       OK ] Endpoint/SlaveEndpointTest.UnauthorizedRequest/2 (27 ms)
[ RUN      ] Endpoint/SlaveEndpointTest.NoAuthorizer/0
I0928 18:29:59.358202  5765 containerizer.cpp:292] Using isolation { environment_secret, posix/cpu,
posix/mem, filesystem/posix, network/cni }
W0928 18:29:59.358683  5765 backend.cpp:76] Failed to create 'aufs' backend: AufsBackend requires
root privileges
W0928 18:29:59.358788  5765 backend.cpp:76] Failed to create 'bind' backend: BindBackend requires
root privileges
I0928 18:29:59.358819  5765 provisioner.cpp:255] Using default backend 'copy'
I0928 18:29:59.360375  5765 cluster.cpp:448] Creating default 'local' authorizer
I0928 18:29:59.362313  5799 slave.cpp:254] Mesos agent started on (815)@172.17.0.3:36368
I0928 18:29:59.362340  5799 slave.cpp:255] Flags at startup: --acls="" --appc_simple_discovery_uri_prefix="http://"
--appc_store_dir="/tmp/Endpoint_SlaveEndpointTest_NoAuthorizer_0_ArVeI1/store/appc" --authenticate_http_readonly="true"
--authenticate_http_readwrite="true" --authenticatee="crammd5" --authentication_backoff_factor="1secs"
--authorizer="local" --cgroups_cpu_enable_pids_and_tids_count="false" --cgroups_enable_cfs="false"
--cgroups_hierarchy="/sys/fs/cgroup" --cgroups_limit_swap="false" --cgroups_root="mesos" --container_disk_watch_interval="15secs"
--containerizers="mesos" --credential="/tmp/Endpoint_SlaveEndpointTest_NoAuthorizer_0_ArVeI1/credential"
--default_role="*" --disallow_sharing_agent_pid_namespace="false" --disk_watch_interval="1mins"
--docker="docker" --docker_kill_orphans="true" --docker_registry="https://registry-1.docker.io"
--docker_remove_delay="6hrs" --docker_socket="/var/run/docker.sock" --docker_stop_timeout="0ns"
--docker_store_dir="/tmp/Endpoint_SlaveEndpointTest_NoAuthorizer_0_ArVeI1/store/docker" --docker_volume_checkpoint_dir="/var/run/mesos/isolators/docker/volume"
--enforce_container_disk_quota="false" --executor_registration_timeout="1mins" --executor_reregistration_timeout="2secs"
--executor_shutdown_grace_period="5secs" --fetcher_cache_dir="/tmp/Endpoint_SlaveEndpointTest_NoAuthorizer_0_ArVeI1/fetch"
--fetcher_cache_size="2GB" --frameworks_home="" --gc_delay="1weeks" --gc_disk_headroom="0.1"
--hadoop_home="" --help="false" --hostname_lookup="true" --http_command_executor="false" --http_credentials="/tmp/Endpoint_SlaveEndpointTest_NoAuthorizer_0_ArVeI1/http_credentials"
--http_heartbeat_interval="30secs" --initialize_driver_logging="true" --isolation="posix/cpu,posix/mem"
--launcher="posix" --launcher_dir="/mesos/mesos-1.5.0/_build/src" --logbufsecs="0" --logging_level="INFO"
--max_completed_executors_per_framework="150" --oversubscribed_resources_interval="15secs"
--perf_duration="10secs" --perf_interval="1mins" --port="5051" --qos_correction_interval_min="0ns"
--quiet="false" --recover="reconnect" --recovery_timeout="15mins" --registration_backoff_factor="10ms"
--resources="cpus:2;gpus:0;mem:1024;disk:1024;ports:[31000-32000]" --revocable_cpu_low_priority="true"
--runtime_dir="/tmp/Endpoint_SlaveEndpointTest_NoAuthorizer_0_ArVeI1" --sandbox_directory="/mnt/mesos/sandbox"
--strict="true" --switch_user="true" --systemd_enable_support="true" --systemd_runtime_directory="/run/systemd/system"
--version="false" --work_dir="/tmp/Endpoint_SlaveEndpointTest_NoAuthorizer_0_FPfiag" --zk_session_timeout="10secs"
I0928 18:29:59.362707  5799 credentials.hpp:86] Loading credential for authentication from
'/tmp/Endpoint_SlaveEndpointTest_NoAuthorizer_0_ArVeI1/credential'
I0928 18:29:59.362848  5799 slave.cpp:287] Agent using credential for: test-principal
I0928 18:29:59.362869  5799 credentials.hpp:37] Loading credentials for authentication from
'/tmp/Endpoint_SlaveEndpointTest_NoAuthorizer_0_ArVeI1/http_credentials'
I0928 18:29:59.363090  5799 http.cpp:1045] Creating default 'basic' HTTP authenticator for
realm 'mesos-agent-readonly'
I0928 18:29:59.363242  5799 http.cpp:1045] Creating default 'basic' HTTP authenticator for
realm 'mesos-agent-readwrite'
I0928 18:29:59.364547  5799 slave.cpp:585] Agent resources: [{"name":"cpus","scalar":{"value":2.0},"type":"SCALAR"},{"name":"mem","scalar":{"value":1024.0},"type":"SCALAR"},{"name":"disk","scalar":{"value":1024.0},"type":"SCALAR"},{"name":"ports","ranges":{"range":[{"begin":31000,"end":32000}]},"type":"RANGES"}]
I0928 18:29:59.364797  5799 slave.cpp:593] Agent attributes: [  ]
I0928 18:29:59.364812  5799 slave.cpp:602] Agent hostname: ff3f2b6b03bc
I0928 18:29:59.364941  5795 status_update_manager.cpp:177] Pausing sending status updates
I0928 18:29:59.366237  5803 state.cpp:64] Recovering state from '/tmp/Endpoint_SlaveEndpointTest_NoAuthorizer_0_FPfiag/meta'
I0928 18:29:59.366488  5806 status_update_manager.cpp:203] Recovering status update manager
I0928 18:29:59.366689  5787 containerizer.cpp:648] Recovering containerizer
I0928 18:29:59.367861  5793 provisioner.cpp:416] Provisioner recovery complete
I0928 18:29:59.368158  5800 slave.cpp:6322] Finished recovery
I0928 18:29:59.368546  5800 slave.cpp:6504] Querying resource estimator for oversubscribable
resources
I0928 18:29:59.368826  5790 slave.cpp:6518] Received oversubscribable resources {} from the
resource estimator
I0928 18:29:59.371055  5805 process.cpp:3929] Handling HTTP event for process 'slave(815)'
with path: '/slave(815)/monitor/statistics'
I0928 18:29:59.372282  5792 http.cpp:1185] HTTP GET for /slave(815)/monitor/statistics from
172.17.0.3:48450
I0928 18:29:59.372352  5792 http.cpp:976] Authorizing principal 'test-principal' to GET the
'/monitor/statistics' endpoint
I0928 18:29:59.375506  5795 slave.cpp:869] Agent terminating
[       OK ] Endpoint/SlaveEndpointTest.NoAuthorizer/0 (27 ms)
[ RUN      ] Endpoint/SlaveEndpointTest.NoAuthorizer/1
I0928 18:29:59.386354  5765 containerizer.cpp:292] Using isolation { environment_secret, posix/cpu,
posix/mem, filesystem/posix, network/cni }
W0928 18:29:59.386859  5765 backend.cpp:76] Failed to create 'aufs' backend: AufsBackend requires
root privileges
W0928 18:29:59.386967  5765 backend.cpp:76] Failed to create 'bind' backend: BindBackend requires
root privileges
I0928 18:29:59.387001  5765 provisioner.cpp:255] Using default backend 'copy'
I0928 18:29:59.388650  5765 cluster.cpp:448] Creating default 'local' authorizer
I0928 18:29:59.390547  5805 slave.cpp:254] Mesos agent started on (816)@172.17.0.3:36368
I0928 18:29:59.390568  5805 slave.cpp:255] Flags at startup: --acls="" --appc_simple_discovery_uri_prefix="http://"
--appc_store_dir="/tmp/Endpoint_SlaveEndpointTest_NoAuthorizer_1_uEFc85/store/appc" --authenticate_http_readonly="true"
--authenticate_http_readwrite="true" --authenticatee="crammd5" --authentication_backoff_factor="1secs"
--authorizer="local" --cgroups_cpu_enable_pids_and_tids_count="false" --cgroups_enable_cfs="false"
--cgroups_hierarchy="/sys/fs/cgroup" --cgroups_limit_swap="false" --cgroups_root="mesos" --container_disk_watch_interval="15secs"
--containerizers="mesos" --credential="/tmp/Endpoint_SlaveEndpointTest_NoAuthorizer_1_uEFc85/credential"
--default_role="*" --disallow_sharing_agent_pid_namespace="false" --disk_watch_interval="1mins"
--docker="docker" --docker_kill_orphans="true" --docker_registry="https://registry-1.docker.io"
--docker_remove_delay="6hrs" --docker_socket="/var/run/docker.sock" --docker_stop_timeout="0ns"
--docker_store_dir="/tmp/Endpoint_SlaveEndpointTest_NoAuthorizer_1_uEFc85/store/docker" --docker_volume_checkpoint_dir="/var/run/mesos/isolators/docker/volume"
--enforce_container_disk_quota="false" --executor_registration_timeout="1mins" --executor_reregistration_timeout="2secs"
--executor_shutdown_grace_period="5secs" --fetcher_cache_dir="/tmp/Endpoint_SlaveEndpointTest_NoAuthorizer_1_uEFc85/fetch"
--fetcher_cache_size="2GB" --frameworks_home="" --gc_delay="1weeks" --gc_disk_headroom="0.1"
--hadoop_home="" --help="false" --hostname_lookup="true" --http_command_executor="false" --http_credentials="/tmp/Endpoint_SlaveEndpointTest_NoAuthorizer_1_uEFc85/http_credentials"
--http_heartbeat_interval="30secs" --initialize_driver_logging="true" --isolation="posix/cpu,posix/mem"
--launcher="posix" --launcher_dir="/mesos/mesos-1.5.0/_build/src" --logbufsecs="0" --logging_level="INFO"
--max_completed_executors_per_framework="150" --oversubscribed_resources_interval="15secs"
--perf_duration="10secs" --perf_interval="1mins" --port="5051" --qos_correction_interval_min="0ns"
--quiet="false" --recover="reconnect" --recovery_timeout="15mins" --registration_backoff_factor="10ms"
--resources="cpus:2;gpus:0;mem:1024;disk:1024;ports:[31000-32000]" --revocable_cpu_low_priority="true"
--runtime_dir="/tmp/Endpoint_SlaveEndpointTest_NoAuthorizer_1_uEFc85" --sandbox_directory="/mnt/mesos/sandbox"
--strict="true" --switch_user="true" --systemd_enable_support="true" --systemd_runtime_directory="/run/systemd/system"
--version="false" --work_dir="/tmp/Endpoint_SlaveEndpointTest_NoAuthorizer_1_tBA4vk" --zk_session_timeout="10secs"
I0928 18:29:59.390926  5805 credentials.hpp:86] Loading credential for authentication from
'/tmp/Endpoint_SlaveEndpointTest_NoAuthorizer_1_uEFc85/credential'
I0928 18:29:59.391078  5805 slave.cpp:287] Agent using credential for: test-principal
I0928 18:29:59.391099  5805 credentials.hpp:37] Loading credentials for authentication from
'/tmp/Endpoint_SlaveEndpointTest_NoAuthorizer_1_uEFc85/http_credentials'
I0928 18:29:59.391330  5805 http.cpp:1045] Creating default 'basic' HTTP authenticator for
realm 'mesos-agent-readonly'
I0928 18:29:59.391487  5805 http.cpp:1045] Creating default 'basic' HTTP authenticator for
realm 'mesos-agent-readwrite'
I0928 18:29:59.392849  5805 slave.cpp:585] Agent resources: [{"name":"cpus","scalar":{"value":2.0},"type":"SCALAR"},{"name":"mem","scalar":{"value":1024.0},"type":"SCALAR"},{"name":"disk","scalar":{"value":1024.0},"type":"SCALAR"},{"name":"ports","ranges":{"range":[{"begin":31000,"end":32000}]},"type":"RANGES"}]
I0928 18:29:59.393075  5805 slave.cpp:593] Agent attributes: [  ]
I0928 18:29:59.393090  5805 slave.cpp:602] Agent hostname: ff3f2b6b03bc
I0928 18:29:59.393218  5789 status_update_manager.cpp:177] Pausing sending status updates
I0928 18:29:59.394569  5799 state.cpp:64] Recovering state from '/tmp/Endpoint_SlaveEndpointTest_NoAuthorizer_1_tBA4vk/meta'
I0928 18:29:59.394850  5806 status_update_manager.cpp:203] Recovering status update manager
I0928 18:29:59.395030  5784 containerizer.cpp:648] Recovering containerizer
I0928 18:29:59.396293  5801 provisioner.cpp:416] Provisioner recovery complete
I0928 18:29:59.396608  5789 slave.cpp:6322] Finished recovery
I0928 18:29:59.397027  5789 slave.cpp:6504] Querying resource estimator for oversubscribable
resources
I0928 18:29:59.397260  5797 slave.cpp:6518] Received oversubscribable resources {} from the
resource estimator
I0928 18:29:59.399467  5786 process.cpp:3929] Handling HTTP event for process 'slave(816)'
with path: '/slave(816)/monitor/statistics.json'
I0928 18:29:59.400723  5807 http.cpp:1185] HTTP GET for /slave(816)/monitor/statistics.json
from 172.17.0.3:48452
I0928 18:29:59.400790  5807 http.cpp:976] Authorizing principal 'test-principal' to GET the
'/monitor/statistics.json' endpoint
I0928 18:29:59.403440  5793 slave.cpp:869] Agent terminating
[       OK ] Endpoint/SlaveEndpointTest.NoAuthorizer/1 (27 ms)
[ RUN      ] Endpoint/SlaveEndpointTest.NoAuthorizer/2
I0928 18:29:59.414357  5765 containerizer.cpp:292] Using isolation { environment_secret, posix/cpu,
posix/mem, filesystem/posix, network/cni }
W0928 18:29:59.414852  5765 backend.cpp:76] Failed to create 'aufs' backend: AufsBackend requires
root privileges
W0928 18:29:59.414968  5765 backend.cpp:76] Failed to create 'bind' backend: BindBackend requires
root privileges
I0928 18:29:59.415009  5765 provisioner.cpp:255] Using default backend 'copy'
I0928 18:29:59.416678  5765 cluster.cpp:448] Creating default 'local' authorizer
I0928 18:29:59.418632  5790 slave.cpp:254] Mesos agent started on (817)@172.17.0.3:36368
I0928 18:29:59.418654  5790 slave.cpp:255] Flags at startup: --acls="" --appc_simple_discovery_uri_prefix="http://"
--appc_store_dir="/tmp/Endpoint_SlaveEndpointTest_NoAuthorizer_2_GTKUOa/store/appc" --authenticate_http_readonly="true"
--authenticate_http_readwrite="true" --authenticatee="crammd5" --authentication_backoff_factor="1secs"
--authorizer="local" --cgroups_cpu_enable_pids_and_tids_count="false" --cgroups_enable_cfs="false"
--cgroups_hierarchy="/sys/fs/cgroup" --cgroups_limit_swap="false" --cgroups_root="mesos" --container_disk_watch_interval="15secs"
--containerizers="mesos" --credential="/tmp/Endpoint_SlaveEndpointTest_NoAuthorizer_2_GTKUOa/credential"
--default_role="*" --disallow_sharing_agent_pid_namespace="false" --disk_watch_interval="1mins"
--docker="docker" --docker_kill_orphans="true" --docker_registry="https://registry-1.docker.io"
--docker_remove_delay="6hrs" --docker_socket="/var/run/docker.sock" --docker_stop_timeout="0ns"
--docker_store_dir="/tmp/Endpoint_SlaveEndpointTest_NoAuthorizer_2_GTKUOa/store/docker" --docker_volume_checkpoint_dir="/var/run/mesos/isolators/docker/volume"
--enforce_container_disk_quota="false" --executor_registration_timeout="1mins" --executor_reregistration_timeout="2secs"
--executor_shutdown_grace_period="5secs" --fetcher_cache_dir="/tmp/Endpoint_SlaveEndpointTest_NoAuthorizer_2_GTKUOa/fetch"
--fetcher_cache_size="2GB" --frameworks_home="" --gc_delay="1weeks" --gc_disk_headroom="0.1"
--hadoop_home="" --help="false" --hostname_lookup="true" --http_command_executor="false" --http_credentials="/tmp/Endpoint_SlaveEndpointTest_NoAuthorizer_2_GTKUOa/http_credentials"
--http_heartbeat_interval="30secs" --initialize_driver_logging="true" --isolation="posix/cpu,posix/mem"
--launcher="posix" --launcher_dir="/mesos/mesos-1.5.0/_build/src" --logbufsecs="0" --logging_level="INFO"
--max_completed_executors_per_framework="150" --oversubscribed_resources_interval="15secs"
--perf_duration="10secs" --perf_interval="1mins" --port="5051" --qos_correction_interval_min="0ns"
--quiet="false" --recover="reconnect" --recovery_timeout="15mins" --registration_backoff_factor="10ms"
--resources="cpus:2;gpus:0;mem:1024;disk:1024;ports:[31000-32000]" --revocable_cpu_low_priority="true"
--runtime_dir="/tmp/Endpoint_SlaveEndpointTest_NoAuthorizer_2_GTKUOa" --sandbox_directory="/mnt/mesos/sandbox"
--strict="true" --switch_user="true" --systemd_enable_support="true" --systemd_runtime_directory="/run/systemd/system"
--version="false" --work_dir="/tmp/Endpoint_SlaveEndpointTest_NoAuthorizer_2_5fiC8o" --zk_session_timeout="10secs"
I0928 18:29:59.419028  5790 credentials.hpp:86] Loading credential for authentication from
'/tmp/Endpoint_SlaveEndpointTest_NoAuthorizer_2_GTKUOa/credential'
I0928 18:29:59.419173  5790 slave.cpp:287] Agent using credential for: test-principal
I0928 18:29:59.419201  5790 credentials.hpp:37] Loading credentials for authentication from
'/tmp/Endpoint_SlaveEndpointTest_NoAuthorizer_2_GTKUOa/http_credentials'
I0928 18:29:59.419440  5790 http.cpp:1045] Creating default 'basic' HTTP authenticator for
realm 'mesos-agent-readonly'
I0928 18:29:59.419613  5790 http.cpp:1045] Creating default 'basic' HTTP authenticator for
realm 'mesos-agent-readwrite'
I0928 18:29:59.421248  5790 slave.cpp:585] Agent resources: [{"name":"cpus","scalar":{"value":2.0},"type":"SCALAR"},{"name":"mem","scalar":{"value":1024.0},"type":"SCALAR"},{"name":"disk","scalar":{"value":1024.0},"type":"SCALAR"},{"name":"ports","ranges":{"range":[{"begin":31000,"end":32000}]},"type":"RANGES"}]
I0928 18:29:59.421658  5790 slave.cpp:593] Agent attributes: [  ]
I0928 18:29:59.421689  5790 slave.cpp:602] Agent hostname: ff3f2b6b03bc
I0928 18:29:59.421844  5793 status_update_manager.cpp:177] Pausing sending status updates
I0928 18:29:59.423512  5803 state.cpp:64] Recovering state from '/tmp/Endpoint_SlaveEndpointTest_NoAuthorizer_2_5fiC8o/meta'
I0928 18:29:59.423818  5794 status_update_manager.cpp:203] Recovering status update manager
I0928 18:29:59.424031  5805 containerizer.cpp:648] Recovering containerizer
I0928 18:29:59.425232  5806 provisioner.cpp:416] Provisioner recovery complete
I0928 18:29:59.425539  5793 slave.cpp:6322] Finished recovery
I0928 18:29:59.425973  5793 slave.cpp:6504] Querying resource estimator for oversubscribable
resources
I0928 18:29:59.426220  5801 slave.cpp:6518] Received oversubscribable resources {} from the
resource estimator
I0928 18:29:59.428606  5792 process.cpp:3929] Handling HTTP event for process 'slave(817)'
with path: '/slave(817)/containers'
I0928 18:29:59.430028  5785 http.cpp:1185] HTTP GET for /slave(817)/containers from 172.17.0.3:48458
I0928 18:29:59.430096  5785 http.cpp:976] Authorizing principal 'test-principal' to GET the
'/containers' endpoint
I0928 18:29:59.433555  5806 slave.cpp:869] Agent terminating
[       OK ] Endpoint/SlaveEndpointTest.NoAuthorizer/2 (29 ms)
[----------] 9 tests from Endpoint/SlaveEndpointTest (257 ms total)

[----------] 2 tests from ContainerizerType/DefaultContainerDNSFlagTest
[ RUN      ] ContainerizerType/DefaultContainerDNSFlagTest.ValidateFlag/0
[       OK ] ContainerizerType/DefaultContainerDNSFlagTest.ValidateFlag/0 (10 ms)
[ RUN      ] ContainerizerType/DefaultContainerDNSFlagTest.ValidateFlag/1
[       OK ] ContainerizerType/DefaultContainerDNSFlagTest.ValidateFlag/1 (10 ms)
[----------] 2 tests from ContainerizerType/DefaultContainerDNSFlagTest (20 ms total)

[----------] Global test environment tear-down
[==========] 1676 tests from 184 test cases ran. (650587 ms total)
[  PASSED  ] 1675 tests.
[  FAILED  ] 1 test, listed below:
[  FAILED  ] MasterTest.IgnoreOldAgentReregistration

 1 FAILED TEST
  YOU HAVE 20 DISABLED TESTS

I0928 18:29:59.522204  5808 process.cpp:1068] Failed to accept socket: future discarded
make[4]: *** [check-local] Error 1
make[4]: Leaving directory `/mesos/mesos-1.5.0/_build/src'
make[3]: *** [check-am] Error 2
make[3]: Leaving directory `/mesos/mesos-1.5.0/_build/src'
make[2]: *** [check] Error 2
make[2]: Leaving directory `/mesos/mesos-1.5.0/_build/src'
make[1]: *** [check-recursive] Error 1
make[1]: Leaving directory `/mesos/mesos-1.5.0/_build'
make: *** [distcheck] Error 1
+ docker rmi mesos-1506619894-3217
Untagged: mesos-1506619894-3217:latest
Deleted: sha256:6b36a17e6c13ab4f667659899d01fbceca4dd44461ad1bfbf8615716690cce04
Deleted: sha256:9abbaebf9bbdc4aa594036170d0fe0e5e2781e666931276d9cf0a2a5641f295a
Deleted: sha256:8f9b09c85c5ae3d5dec7d9608df4684a686d48ecc92fa56c97f43f81f3eb962d
Deleted: sha256:b979d9c17f89c78182b788bd5a1c93909abeb57086a2b438cea397ae39fed996
Deleted: sha256:3800828bab5567b606d714dd8a2254efb5442d0f235d0181c223940459c8c7b0
Deleted: sha256:00053a829b229e3c65ab515a2bf049a088feaefba8ef71c43cbf415fa9744163
Deleted: sha256:b4b23493ac4b443147f51d9e7e007807e45c68b454cb4bb02e5d00e4b8ddec5e
Deleted: sha256:e2b86a50b7988abf219dcb8643b5853c6469c15d4fd05c4cda1f1cdfb82fc46e
Deleted: sha256:d817858b93881bb04eeb09ec311a46c535808901baa05f413d031b280bd91726
Deleted: sha256:909f1a36e7064d58f6d15bb34996d4159e1a6f6799336b3ab24efcc509610961
Deleted: sha256:a6bebe7f2ca3ccda9d9ada7411e551b6c535650e0991bbc808cc382b21d30b98
Deleted: sha256:e37861e9b3c1825ecbfbb3a028491ffec106a906971652a36f61a641a0e0a16b
Deleted: sha256:077348283bb9902ef1b75af196d0d5d80aa8334a0a91b932decb78328d728752
Deleted: sha256:f701e2ca92cc9ecaef627f408c66f8ba3363975d16736002b7e715c6beb53930
Deleted: sha256:77e30475820fcb349aecf7dd85dde28fb16d91dd548c5b933352042a3ea29d66
Deleted: sha256:beda558c1023369952e950b10571b449764deede9df7354e8d7347d771580804
Deleted: sha256:5a1d63295cd9c640bd55e2ae91aaf5ec2278b376a9e1168243ec224c386d7b22
Deleted: sha256:4d8f94c59bbb99f42eda8a262ad5e96449e6d9d14c46e44720a1d178617a71bb
Deleted: sha256:39b1c6090b51137866d1b4de12399ea8d502d5956dc8251a5d030cd84461c9b8
Deleted: sha256:1177875aa9ce5178b4d669f9b804b7a0a03b7397e123dab97ccda253c652ec3d
Deleted: sha256:46384a215d65a55104c0e688ffa607caa71ba765b19c44eb9b18e92e1e4ec34a
Deleted: sha256:52aafb481c29ab25060550de4bc46086019e43794d9c604b053302a94ba6e26b
Deleted: sha256:597eef0bf7dcaac5a5146d59c138f83ed67e9dfd597aa446a72bd4fd005b6c36
Deleted: sha256:61544291fc9e1fff261fd850681ffe8ce8c2a9d7cdcfdf794acb43a7079eebfb
Deleted: sha256:3f1da764b714500b52a75367c484cae479a3a3a0715d4b2b85d15b0cc640276f
Deleted: sha256:ad9c59fc290ff22a67ceb9605e3d9630c1e2568dd15e7ec7716665da87d79b7a
Deleted: sha256:d4259c6fd73067387fe1610886a3b88aae66d803f46e8b319223643c56a2cc2a
Deleted: sha256:ef6e410f86113154a203b055fefebe54293d2018ea282203620c0d02a7cd41f9
Build step 'Execute shell' marked build as failure

Mime
View raw message